{"text_format":"1","workbook":"xlsx","n_sheets":11,"sheets":["Instructions","Plant Control IR Template","Job Sketch","Tree Pruning Guidelines","Resource Concern List","Practice Purposes","PIA T&E Plants","PIA Pervasive Weed List","Soils Data","CPPE","Version Notes"],"not_rendered":{"charts":0,"images":3,"macros":1,"external_links":0,"defined_names":15,"comments":1,"pivot_tables":0},"unopened":[],"bounds":{"document_bytes":16777216,"sheet_cells":100000,"rows_first":2000,"rows_last":500,"rows_between":2000,"halvings":0,"cell_chars":16384,"cell_head_chars":4096},"cells_cut":0,"cells_raw":0,"read":"whole","date_system":"1900"}

{"sheet":"Instructions","index":0,"n_rows":8,"n_cols":1,"rows_kept":8,"cut":false,"hidden":false,"merged":[]}
["Instructions for completing Excel Based Jobsheets & worksheets for plant control or plant treatment practices:"]
["These Jobsheets have two main sections: The white section for the Cooperator on the left, and; the tan area on the right to assist the Planner in making planning decisions while completing the Jobsheet. "]
["Planners must fill in all applicable grey boxes from top to bottom & left to right on the Plant Control Practices Tab.  When complete, print & have the Cooperator to sign and date.  Many grey boxes have drop down lists."]
["Click on, or hover the curser over cells with a small red triangle in the upper right corner for planner guidance with completing the Plant Control Practices form.  "]
["Some items have built in warnings indicating that the values or criteria selected by Planners may fall outside of typical technical recommendations.  Planners should modify the parameter until the warning goes away, or seek the additional review and/or approval as indicated."]
["Once the Jobsheet is completed, print out both the white and tan sections in their entirety for the case file folder.  Subsequently print out the shorter white section for the Cooperator's copy."]
["Macro buttons located in the left margin of the Jobsheet allow Planners to clear the Jobsheet for a new project or minimize the space required for listing plant species based on objectives of each Cooperator/project."]
["If you have any questions or problems with this Jobsheet, or if you have suggestions for improving the Jobsheet, please contact the PIA State Forester or PIA State Range Management Specialist."]
{"$rows_left_out":1}
{"sheet":"Plant Control IR Template","index":1,"n_rows":195,"n_cols":33,"rows_kept":195,"cut":false,"hidden":false,"merged":[[96,5,96,7],[97,5,97,7],[98,5,98,7],[95,5,95,7],[16,12,16,20],[50,12,50,20],[94,4,94,10],[16,2,16,11],[11,2,11,11],[59,2,59,3],[58,2,58,3],[94,2,94,3],[86,9,86,11],[87,2,87,11],[88,2,88,5],[88,7,88,11],[89,2,89,11],[54,4,54,5],[56,7,56,8],[51,4,51,5],[51,2,51,3],[53,10,53,11],[54,7,54,8],[53,7,53,8],[101,2,101,7],[103,2,103,7],[105,2,105,11],[106,2,106,11],[104,12,104,14],[104,19,104,20],[102,19,103,20],[39,2,39,11],[40,2,49,11],[79,2,82,11],[78,2,78,11],[64,2,64,11],[65,2,65,11],[66,2,66,11],[67,2,67,11],[68,2,68,11],[69,2,69,11],[70,2,70,11],[71,2,71,11],[84,12,93,20],[94,12,94,20],[96,12,96,14],[97,12,97,14],[98,12,98,14],[122,2,122,11],[120,5,120,11],[121,5,121,11],[113,2,113,11],[115,2,115,11],[114,2,114,11],[112,2,112,8],[110,2,110,11],[109,2,109,11],[138,2,138,11],[141,2,141,11],[142,2,142,11],[140,5,140,8],[132,2,132,10],[133,3,133,9],[134,3,134,9],[129,2,129,11],[130,2,130,10],[131,2,131,10],[135,2,135,10],[136,2,136,10],[137,2,137,11],[139,10,139,11],[140,10,140,11],[139,2,140,4],[99,12,101,20],[102,15,103,15],[102,16,103,16],[102,17,103,17],[102,18,103,18],[102,12,102,14],[103,12,103,14],[95,12,95,20],[58,4,58,5],[61,10,61,11],[59,4,59,5],[59,10,59,11],[94,11,95,11],[95,2,95,4],[95,8,95,10],[72,2,73,11],[74,2,74,11],[75,2,75,11],[76,2,76,11],[77,2,77,11],[62,2,62,11],[84,2,84,11],[85,2,85,11],[86,2,86,7],[125,2,125,3],[126,2,126,3],[128,2,128,3],[127,2,127,3],[25,4,25,5],[25,2,25,3],[26,2,26,3],[27,4,27,5],[30,2,30,5],[28,4,28,5],[32,3,32,5],[26,4,26,5],[34,3,34,5],[57,2,57,3],[37,2,38,5],[50,2,50,11],[117,9,117,11],[111,9,111,11],[112,9,112,11],[63,7,63,8],[123,11,124,11],[124,2,124,3],[116,10,116,11],[121,2,121,4],[53,4,53,5],[55,4,55,5],[54,10,54,11],[51,10,51,11],[52,2,52,3],[52,10,52,11],[56,10,56,11],[0,12,0,20],[7,3,7,5],[0,2,0,9],[0,10,0,11],[1,10,1,11],[1,2,1,9],[2,2,2,11],[4,2,4,4],[4,10,4,11],[5,9,5,11],[5,3,5,5],[3,2,3,11],[6,6,6,7],[2,13,2,20],[1,12,1,20],[5,6,5,8],[6,12,8,12],[6,13,8,20],[3,13,5,20],[3,12,5,12],[9,19,9,20],[9,13,9,18],[8,2,8,11],[9,10,9,11],[9,2,9,3],[9,5,9,9],[15,12,15,20],[11,16,11,17],[11,18,11,20],[10,13,10,14],[11,13,11,14],[10,2,10,3],[10,5,10,9],[10,16,10,17],[10,10,10,11],[12,2,15,11],[10,18,10,20],[13,12,14,20],[12,12,12,20],[123,2,123,3],[117,3,117,5],[116,2,116,4],[119,7,119,11],[120,2,120,4],[119,3,119,6],[63,2,63,4],[96,2,96,4],[96,8,96,10],[103,10,103,11],[97,2,97,4],[97,8,97,10],[98,2,98,4],[98,8,98,10],[100,8,100,9],[108,2,108,11],[107,2,107,11],[101,8,101,9],[101,10,101,11],[102,8,102,9],[102,10,102,11],[103,8,103,9],[90,2,93,11],[100,10,100,11],[31,3,31,5],[36,3,36,5],[33,3,33,5],[27,2,27,3],[60,10,60,11],[63,9,63,11],[61,2,61,3],[61,4,61,5],[60,2,60,3],[60,4,60,5],[61,7,61,8],[60,7,60,8],[59,7,59,8],[55,7,55,8],[56,2,56,3],[57,4,57,5],[54,2,54,3],[57,7,57,8],[35,3,35,5],[53,2,53,3],[51,7,51,8],[56,4,56,5],[55,2,55,3],[52,4,52,5],[17,2,17,3],[18,2,18,3],[21,2,21,3],[22,2,22,3],[21,4,21,5],[20,2,20,3],[22,4,22,5],[23,4,23,5],[29,4,29,5],[29,2,29,3],[23,2,23,3],[19,2,19,3],[19,4,19,5],[20,4,20,5],[28,2,28,3],[17,4,17,5],[18,4,18,5],[24,4,24,5],[24,2,24,3],[62,12,62,20],[70,12,71,15],[61,15,61,16],[64,12,64,16],[61,12,61,13],[63,12,63,16],[65,12,65,16],[66,12,66,16],[70,16,71,20],[69,12,69,20],[76,22,76,24],[75,22,75,24],[74,22,74,24],[73,22,73,24],[77,22,77,24],[83,12,83,20],[72,12,73,15],[72,22,72,24],[72,16,73,20],[74,12,75,15],[74,16,75,20],[18,12,18,13],[17,12,17,13],[46,15,47,20],[19,12,19,13],[21,12,21,13],[22,12,22,13],[23,12,23,13],[24,12,24,13],[44,12,45,20],[25,12,25,13],[26,12,26,13],[27,12,27,13],[28,12,28,13],[29,12,29,13],[30,12,30,14],[32,12,32,14],[20,12,20,13],[46,12,46,14],[47,12,47,14],[36,12,37,20],[33,12,35,12],[33,13,35,20],[40,12,43,20],[30,15,30,20],[59,12,59,13],[57,15,57,16],[56,15,56,16],[51,15,51,16],[56,12,56,13],[57,12,57,13],[60,15,60,16],[59,15,59,16],[55,15,55,16],[54,15,54,16],[53,15,53,16],[52,15,52,16],[52,12,52,13],[53,12,53,13],[54,12,54,13],[55,12,55,13],[58,15,58,16],[60,12,60,13],[31,7,31,10],[32,7,32,10],[33,7,33,10],[34,7,34,10],[30,7,30,11],[35,7,35,10],[36,7,38,11],[51,12,51,13],[58,12,58,13],[57,10,57,11],[49,12,49,20],[48,13,48,20],[58,10,58,11],[58,7,58,8],[31,15,31,20],[32,15,32,20],[31,12,31,14],[55,10,55,11],[52,7,52,8]]}
[null,null,"Natural Resources Conservation Service - Pacific Islands",null,null,null,null,null,null,null,"Field Office:",null,"Information & Resources for Conservation Planners",null,null,null,null,null,null,null,null,null,null,"American Samoa",null,{"$f":"IF(C3=\"\",\"\",VLOOKUP(C3,AA1:AB7,2,FALSE))","v":{"$error":"#N/A"}},"Brush Management (314)","BM","Tree/Shrub Site Preparation (490)"]
[null,null,"Conservation Practice Implementation Requirements",null,null,null,null,null,null,null,null,null,"Resource Concern and Purpose for Planned Practice",null,null,null,null,null,null,null,null,{"$f":"IF(OR(K2=\"Hilo\",K2=\"Waimea\",K2=\"Kealakekua\"),\"Hawaii\",IF(K2=\"Oahu\",\"Oahu\",IF(K2=\"Hoolehua\",\"Molokai\",IF(K2=\"Lihue\",\"Kauai\",IF(K2=\"Kahului\",\"Maui\",IF(K2=\"Palau\",\"Palau\",IF(K2=\"Pohnpei\",\"FSM\",IF(K2=\"Guam\",\"Guam\",IF(K2=\"Saipan\",\"Northern Mariana Islands\",IF(K2=\"Marshall Islands\",\"Marshall Islands\",IF(K2=\"American Samoa\",\"American Samoa\",FALSE)))))))))))","v":false},null,"Guam",null,null,"Forest Stand Improvement (666)","FSI","Fuel Break (383)"]
[null,null,"<Select Practice>",null,null,null,null,null,null,null,null,null,"Resource Concern ",null,null,null,null,null,null,null,null,null,null,"Hilo",null,null,"Fuel Break (383)","FB","Forest Stand Improvement (666)"]
[null,null,"Version: October 2021",null,null,null,null,null,null,null,null,null,"Primary Practice Purpose ",null,null,null,null,null,null,null,null,null,null,"Kahului",null,null,"Herbaceous Weed Treatment (315)","HWT","Tree/Shrub Pruning (660)"]
[null,null,"Jobsheet Prepared for and by:",null,null,null,null,null,null,"Date:",null,null,null,null,null,null,null,null,null,null,null,null,null,"Kaunakakai",null,null,"Tree/Shrub Pruning (660)","TSP","Windbreak/Shelterbelt Establishment and Renovation (380)"]
[null,null,"Cooperator Name",null,null,null,"     Business Name",null,null,null,null,null,null,null,null,null,null,null,null,null,null,null,null,"Kealakekua",null,null,"Tree/Shrub Site Preparation (490)","TSSP","<Select Practice>"]
[null,null,"Tract Number",null,"Field #s",null,{"$f":"IF(C3=\"Windbreak/Shelterbelt Renovation (650)\",\"Total Length of Windbreaks (ft)\",\"Field Acres\")","v":"Field Acres"},null,null,"Planned Amt",null,null,"Secondary Practice Purpose (if applicable)",null,null,null,null,null,null,null,null,"acres",null,"Lihue",null,null,"Windbreak/Shelterbelt Establishment and Renovation (380)","WSR"]
[null,null,"Planner Name",null,null,null,null,null,null,null,null,null,null,null,null,null,null,null,null,null,null,"feet",null,"Marshall Islands",null,null,"Select CPS First"]
{"$rows_left_out":188}
{"sheet":"Job Sketch","index":2,"n_rows":40,"n_cols":30,"rows_kept":40,"cut":false,"hidden":false,"merged":[[3,0,3,6],[3,7,3,20],[5,0,5,4],[5,5,5,7],[0,25,0,30],[0,0,0,24],[2,0,2,30],[4,0,4,4],[4,15,4,20],[4,5,4,14],[4,21,4,30],[1,0,1,24],[3,25,3,30],[1,25,1,30],[3,21,3,24],[5,29,5,30],[40,1,44,28],[5,25,5,28],[5,19,5,24],[5,8,5,13],[5,14,5,18],[7,20,8,21],[7,22,8,24],[7,15,8,19],[7,27,8,28],[7,25,8,26],[7,1,8,8]]}
["Natural Resources Conservation Service",null,null,null,null,null,null,null,null,null,null,null,null,null,null,null,null,null,null,null,null,null,null,null,null,"Field Office:"]
["Pacific Islands Conservation Practice Job Sketch",null,null,null,null,null,null,null,null,null,null,null,null,null,null,null,null,null,null,null,null,null,null,null,null,{"$f":"IF('Plant Control IR Template'!K2=\"\",\"\",'Plant Control IR Template'!K2)","v":""}]
[{"$f":"IF('Plant Control IR Template'!C3=\"\",\"\",'Plant Control IR Template'!C3)","v":"<Select Practice>"}]
["Sketch prepared by",null,null,null,null,null,null,{"$f":"IF('Plant Control IR Template'!D8=\"\",\"\",'Plant Control IR Template'!D8)","v":""},null,null,null,null,null,null,null,null,null,null,null,null,null,"Date",null,null,null,{"$f":"IF('Plant Control IR Template'!K5=\"\",\"\",'Plant Control IR Template'!K5)","v":""}]
["Client Name",null,null,null,null,{"$f":"IF('Plant Control IR Template'!D6=\"\",\"\",'Plant Control IR Template'!D6)","v":""},null,null,null,null,null,null,null,null,null,"Business Name",null,null,null,null,null,{"$f":"IF('Plant Control IR Template'!J6=\"\",\"\",'Plant Control IR Template'!J6)","v":""}]
["Tract Number",null,null,null,null,{"$f":"IF('Plant Control IR Template'!D7=\"\",\"\",'Plant Control IR Template'!D7)","v":""},null,null,"Field Number(s)",null,null,null,null,null,{"$f":"IF('Plant Control IR Template'!F7=\"\",\"\",'Plant Control IR Template'!F7)","v":""},null,null,null,null,"Planned Amount",null,null,null,null,null,{"$f":"IF('Plant Control IR Template'!I7=\"\",\"\",'Plant Control IR Template'!K7)","v":""},null,null,null,"acres"]
[]
[null,"Planting arrangment for portion of planned field",null,null,null,null,null,null,null,null,null,null,null,null,null,"Each grid cell  = ",null,null,null,null,null,null,"feet by",null,null,null,null,"feet"]
{"$rows_left_out":33}
{"sheet":"Tree Pruning Guidelines","index":3,"n_rows":22,"n_cols":1,"rows_kept":22,"cut":false,"hidden":false,"merged":[[0,0,0,8],[1,0,1,8],[3,0,18,8],[21,0,34,8],[19,0,19,8],[20,0,20,8],[2,0,2,8]]}
["Natural Resources Conservation Service"]
["Pacific Islands Tree Pruning Guidelines"]
["Cut Locations & Techniques"]
["• To find the proper place to cut a branch, look for the branch collar or branch bark ridge.  The collar is the swollen area at the base of the branch and the branch bark ridge is the tissue that separates the branch from the main stem.\n• Make the cuts as close to the collar and branch bark ridge as possible, without damaging them.  Do not leave a stub. Refer to Figure 1.\n• Remove a live branch by cutting from A1 to A2. For crown reduction, make the cut from B1 to B2 on the main stem.  Dead and live branches are removed in the same manner.  Refer to Figure 2.\n• Large branches are removed by eliminating the outer portions first.  Refer to Figure 3.\n• Make a cut 18 inches from the main stem to the underside of the branch.  Then make a cut from the top starting a few inches out from the first cut.  Cut completely through at this point.  Use the same method when cutting the main stem in crown reduction.\n• By cutting in this manner, the possibility of the branch snapping and causing the bark to tear is avoided.  Cut branches smoothly.  Do not tear bark or leave jagged splinters.\n• Do not remove more than 50 percent of the live crown at any pruning.\n• Do not treat pruning wounds with paint or wound dressing, as this will not help prevent decay.\n• Pruning equipment must be clean and sharp."]
[]
[]
[]
[]
{"$rows_left_out":15}
{"sheet":"Resource Concern List","index":4,"n_rows":48,"n_cols":2,"rows_kept":48,"cut":false,"hidden":true,"merged":[]}
["RCC","Resource Concerns"]
["Soil"," Sheet and rill erosion"]
["Soil"," Wind erosion"]
["Soil"," Ephemeral gully erosion"]
["Soil"," Classic gully erosion"]
["Soil"," Bank erosion from streams, shorelines, or water conveyance channels"]
["Soil"," Subsidence"]
["Soil"," Compaction"]
{"$rows_left_out":41}
{"sheet":"Practice Purposes","index":5,"n_rows":17,"n_cols":6,"rows_kept":17,"cut":false,"hidden":true,"merged":[]}
["CPS Code","CPS Name","Purposes",null,{"$f":"'Plant Control IR Template'!C3","v":"<Select Practice>"},"Formula for data validation list lookup below:"]
[383,"Fuel Break (383)","Control and reduce the risk of the spread of fire by treating, removing or modifying vegetation, debris and detritus",null,{"$f":"IFERROR(INDEX($C:$C,SMALL(IF($B$1:INDEX($B:$B,COUNTA($B:$B))=E$1,ROW($B$1:INDEX($B:$B,COUNTA($B:$B))),FALSE),ROW()-ROW($B$2)+1)),\"\")","v":""},"\"='Practice Purposes'!$E$2:INDEX('Practice Purposes'!$E$2:$E$50,COUNTIF('Practice Purposes'!$E$2:$E$50,\"?*\"))\""]
[490,"Tree/Shrub Site Preparation (490)","Encourage natural regeneration of desirable woody plants",null,{"$f":"IFERROR(INDEX($C:$C,SMALL(IF($B$1:INDEX($B:$B,COUNTA($B:$B))=E$1,ROW($B$1:INDEX($B:$B,COUNTA($B:$B))),FALSE),ROW()-ROW($B$2)+1)),\"\")","v":""}]
[490,"Tree/Shrub Site Preparation (490)","Permit artificial establishment of woody plants",null,{"$f":"IFERROR(INDEX($C:$C,SMALL(IF($B$1:INDEX($B:$B,COUNTA($B:$B))=E$1,ROW($B$1:INDEX($B:$B,COUNTA($B:$B))),FALSE),ROW()-ROW($B$2)+1)),\"\")","v":""}]
[660,"Tree/Shrub Pruning (660)","Maintain or improve plant productivity, health and vigor, and/or reduce excessive plant pest pressure",null,{"$f":"IFERROR(INDEX($C:$C,SMALL(IF($B$1:INDEX($B:$B,COUNTA($B:$B))=E$1,ROW($B$1:INDEX($B:$B,COUNTA($B:$B))),FALSE),ROW()-ROW($B$2)+1)),\"\")","v":""}]
[660,"Tree/Shrub Pruning (660)","Develop desired plant structure, foliage or branching density, or rooting length",null,{"$f":"IFERROR(INDEX($C:$C,SMALL(IF($B$1:INDEX($B:$B,COUNTA($B:$B))=E$1,ROW($B$1:INDEX($B:$B,COUNTA($B:$B))),FALSE),ROW()-ROW($B$2)+1)),\"\")","v":""}]
[660,"Tree/Shrub Pruning (660)","Improve the composition and vigor of understory plants",null,{"$f":"IFERROR(INDEX($C:$C,SMALL(IF($B$1:INDEX($B:$B,COUNTA($B:$B))=E$1,ROW($B$1:INDEX($B:$B,COUNTA($B:$B))),FALSE),ROW()-ROW($B$2)+1)),\"\")","v":""}]
[660,"Tree/Shrub Pruning (660)","Maintain or improve soil quality and organic matter content",null,{"$f":"IFERROR(INDEX($C:$C,SMALL(IF($B$1:INDEX($B:$B,COUNTA($B:$B))=E$1,ROW($B$1:INDEX($B:$B,COUNTA($B:$B))),FALSE),ROW()-ROW($B$2)+1)),\"\")","v":""}]
{"$rows_left_out":10}
{"sheet":"PIA T&E Plants","index":6,"n_rows":442,"n_cols":12,"rows_kept":442,"cut":false,"hidden":false,"merged":[[0,12,0,14]]}
["Definition","Type","Type2","Taxon Group","Sci Name","Main","NWHI","Marianas","Am Samoa","Remotes","Total","ch Total"]
["Listed Endangered","Terrestrial","Plant","Fern and Fern Ally Species","Adenophorus periens","X",null,null,null,null,6,5]
["Listed Endangered","Terrestrial","Plant","Fern and Fern Ally Species","Asplenium diellaciniatum","X",null,null,null,null,1,0]
["Listed Endangered","Terrestrial","Plant","Fern and Fern Ally Species","Asplenium peruvianum var. insulare","X",null,null,null,null,2,2]
["Listed Endangered","Terrestrial","Plant","Fern and Fern Ally Species","Ctenitis squamigera","X",null,null,null,null,5,4]
["Listed Endangered","Terrestrial","Plant","Fern and Fern Ally Species","Cyclosorus boydiae","X",null,null,null,null,3,0]
["Listed Endangered","Terrestrial","Plant","Fern and Fern Ally Species","Deparia kaalaana","X",null,null,null,null,3,0]
["Listed Endangered","Terrestrial","Plant","Fern and Fern Ally Species","Diellia erecta","X",null,null,null,null,6,5]
{"$rows_left_out":435}
{"sheet":"PIA Pervasive Weed List","index":7,"n_rows":119,"n_cols":6,"rows_kept":119,"cut":false,"hidden":false,"merged":[[0,0,1,5]]}
["For  plants not listed below that may require multiple treatments to control, contact the PIA State Grazing Lands Management Specialist or PIA State Forester."]
[]
[]
[]
[]
[]
["NRCS PIA Pervasive Weed List",null,null,null,null,"October, 2018"]
[]
{"$rows_left_out":112}
{"sheet":"Soils Data","index":8,"n_rows":1896,"n_cols":22,"rows_kept":1896,"cut":false,"hidden":true,"merged":[]}
["areasymbol","areaname","musym","musymflag","mukey","muname","compname","localphase","comppct_r","reskind","resdept_r","frags_0_25cm","slope_r","awc_0_50cm","flood_freq","flood_dur","flood_month","pond_freq","pond_dur","pond_month"]
["HI801","Hawaii",8,{"$f":"IF('Plant Control IR Template'!$V$2=B2,C2,\"\")","v":""},"2371777","Lava flows-Cinder land complex, 2 to 40 percent slopes","Lava flows","`a`a",45,"bedrock, lithic",39,95,15,0.2,"none",null,null,"none"]
["HI801","Hawaii",8,{"$f":"IF('Plant Control IR Template'!$V$2=B3,C3,\"\")","v":""},"2371777","Lava flows-Cinder land complex, 2 to 40 percent slopes","Cinder land",null,40,null,80,100,15,0.6,"none",null,null,"none"]
["HI801","Hawaii",9,{"$f":"IF('Plant Control IR Template'!$V$2=B4,C4,\"\")","v":""},"2371778","Rubble land, 12 to 40 percent slopes","Rubble land",null,95,null,80,0,20,null,"none",null,null,"none"]
["HI801","Hawaii",10,{"$f":"IF('Plant Control IR Template'!$V$2=B5,C5,\"\")","v":""},"2371213","Lava flows, `a`a, 2 to 20 percent slopes","Lava flows","`a`a",100,"bedrock, lithic",39,95,15,0.2,"none",null,null,"none"]
["HI801","Hawaii",11,{"$f":"IF('Plant Control IR Template'!$V$2=B6,C6,\"\")","v":""},"2371214","Lava flows, `a`a, 20 to 40 percent slopes","Lava flows","`a`a",100,"bedrock, lithic",39,95,30,0.2,"none",null,null,"none"]
["HI801","Hawaii",12,{"$f":"IF('Plant Control IR Template'!$V$2=B7,C7,\"\")","v":""},"2371215","Lava flows, pahoehoe, 2 to 20 percent slopes","Lava flows","pahoehoe",100,"bedrock, lithic",0,0,15,0,"none",null,null,"none"]
["HI801","Hawaii",13,{"$f":"IF('Plant Control IR Template'!$V$2=B8,C8,\"\")","v":""},"2371577","Lava flows, pahoehoe, 20 to 40 percent slopes","Lava flows","pahoehoe",100,"bedrock, lithic",0,0,30,0,"none",null,null,"none"]
{"$rows_left_out":1889}
{"sheet":"CPPE","index":9,"n_rows":117,"n_cols":82,"rows_kept":117,"cut":false,"hidden":true,"merged":[[1,1,1,2],[0,1,0,2]]}
["Resource Concern","Planned Conservation Practice",null,"CPPE Score"]
["Soil Erosion - Classic Gully","Access Control"]
[]
[]
["PracticeName","Soil Erosion - Classic Gully","Soil Erosion Ephemeral Gully","Soil Erosion - Irrigation-induced","Soil Erosion - Mass Movement","Soil Erosion - Road, Road Sides and Construction Sites","Soil Erosion - Sheet and Rill","Soil Erosion - Shoreline","Soil Erosion - Streambank","Soil Erosion - Wind","Soil Condition - Compaction","Soil Condition - Contaminants - Residual Pesticides","Soil Condition - Contaminants - Salts and Other Chemicals","Soil Condition - Damage from Sediment Deposition","Soil Condition - Organic Matter Depletion","Soil Condition - Subsidence","Soil Condition - Contaminants-Animal Waste and Other Organics - N","Soil Condition - Contaminants-Animal Waste and Other Organics - P","Soil Condition - Contaminants-Animal Waste and Other Organics - K","Soil Condition - Contaminants-Commercial Fertilizer - N","Soil Condition - Contaminants-Commercial Fertilizer - P","Soil Condition - Contaminants-Commercial Fertilizer - K","Soil Condition - Rangeland Site Stability","Water Quantity - Aquifer Overdraft","Water Quantity - Drifted Snow","Water Quantity - Excessive Runoff, Flooding, or Ponding","Water Quantity - Excessive Seepage","Water Quantity - Excessive Subsurface Water","Water Quantity - Inadequate Outlets","Water Quantity - Inefficient Water Use on Irrigated Land","Water Quantity - Inefficient Water Use on Non-irrigated Land","Water Quantity - Insufficient Flows in Water Courses","Water Quantity - Reduced Capacity of Conveyances by Sediment Deposition","Water Quantity - Reduced Storage of Water Bodies by Sediment Accumulation","Water Quantity - Rangeland Hydrologic Cycle","Water Quality - Excessive Nutrients and Organics in Groundwater","Water Quality - Excessive Nutrients and Organics in Surface Water","Water Quality - Excessive Salinity in Groundwater","Water Quality - Excessive Salinity in Surface Water","Water Quality - Excessive Suspended Sediment and Turbidity in Surface Water","Water Quality - Harmful Levels of Heavy Metals in Groundwater","Water Quality - Harmful Levels of Heavy Metals in Surface Water","Water Quality - Harmful Levels of Pathogens in Groundwater","Water Quality - Harmful Levels of Pathogens in Surface Water","Water Quality - Harmful Levels of Pesticides in Groundwater","Water Quality - Harmful Levels of Pesticides in Surface Water","Water Quality - Harmful Levels of Petroleum in Groundwater","Water Quality - Harmful Levels of Petroleum in Surface Water","Water Quality - Harmful Temperatures of Surface Water","Air Quality - Adverse Air Temperature","Air Quality - Ammonia (NH3)","Air Quality - Chemical Drift","Excessive Greenhouse Gas - CH4 (methane)","Excessive Greenhouse Gas - CO2 (carbon dioxide)","Air Quality - Excessive Greenhouse Gas - N2O (nitrous oxide)","Air Quality - Excessive Ozone","Air Quality - Objectionable Odors","Air Quality - Particulate matter less than 10 micrometers in diameter (PM 10)","Air Quality - Particulate matter less than 2.5 micrometers in diameter (PM 2.5)","Air Quality - Reduced Visibility","Air Quality - Undesirable Air Movement","Plant Condition - Forage Quality and Palatability","Plant Condition - Noxious and Invasive Plants","Plant Condition - Plants not adapted or suited","Plant Condition - Productivity, Health and Vigor","Plant Condition - Threatened and Endangered Plant Species","Plant Condition - Wildfire Hazard","Plant Condition - T&E Plant Species: Declining Species, Species of Concern","Fish and Wildlife - Imbalance Among and Within Populations","Fish and Wildlife - Inadequate Cover/Shelter","Fish and Wildlife - Inadequate Food","Fish and Wildlife - Inadequate Space","Fish and Wildlife - Inadequate Water ","Fish and Wildlife - Threatened and Endangered Fish and Wildlife Species","Fish and Wildlife - Habitat Fragmentation","Fish and Wildlife - T&E Species: Declining Species, Species of Concern","Domestic Animals - Inadequate Stock Water","Domestic Animals - Inadequate Quantities and Quality of Feed and Forage","Domestic Animals - Inadequate Shelter ","Domestic Animals - Stress and Mortality","Energy - Inefficient Energy Use - Equipment and Facilities","Energy - Inefficient Energy Use – Farming / Ranching Practices and Field Operations"]
["Access Control",4,4,0,0,4,4,4,4,4,4,0,0,4,2,0,2,2,2,2,2,2,3,0,0,-1,1,2,1,0,3,2,4,3,3,1,2,0,0,2,1,1,1,2,0,1,1,2,0,0,0,0,0,1,0,0,0,2,2,1,0,4,4,3,4,5,3,5,5,5,5,5,2,5,5,5,0,4,0,4,0,0]
["Access Road",-1,0,0,-1,0,0,0,0,0,2,0,0,0,0,0,0,0,0,0,0,0,0,0,-2,-1,0,0,2,0,0,-1,0,0,0,0,0,0,0,1,0,0,0,0,0,0,-1,-1,0,0,0,0,0,0,0,0,0,-2,-2,4,0,0,-3,5,2,0,4,0,0,0,0,-2,0,0,-1,0,0,0,0,0,0,0]
["Agrichemical Handling Facility",0,0,0,0,0,0,0,0,0,0,5,0,0,0,0,0,0,0,5,5,5,0,0,0,0,0,0,0,0,0,0,0,0,0,5,5,0,0,0,0,0,0,0,5,5,0,0,0,0,0,0,0,0,0,0,0,0,0,0,0,0,0,0,0,0,0,0,0,0,0,0,0,0,0,0,0,0,0,0,0,0]
{"$rows_left_out":110}
{"sheet":"Version Notes","index":10,"n_rows":17,"n_cols":3,"rows_kept":17,"cut":false,"hidden":true,"merged":[]}
["Version Date","Item No.","Notes"]
["2014-02-01",1,"Original version released"]
["2014-06-01",2,"Percentage formatting in cells J21:k32 & N21:P32 modified."]
[null,3,"Certification page modified to accommodate units in \"feet\" for Windbreak/Shelterbelt Renovation (650)."]
[null,4,"Macros for selecting number of plant species to control or retain streamlined."]
["2016-10-01",5,"Land Clearing (460) removed - no longer used for plant control in PIA"]
[null,6,"Planned acres and planned units changed to allow manual/custom input."]
[null,7,"Resource Problem and Primary Practice Purpose selections moved to Planner's side of Jobsheet"]
{"$rows_left_out":9}