{"text_format":"1","workbook":"xlsx","n_sheets":11,"sheets":["Instructions","Plant Control IR Template","Job Sketch","Tree Pruning Guidelines","Resource Concern List","Practice Purposes","PIA T&E Plants","PIA Pervasive Weed List","Soils Data","CPPE","Version Notes"],"not_rendered":{"charts":0,"images":3,"macros":1,"external_links":0,"defined_names":15,"comments":1,"pivot_tables":0},"unopened":[],"bounds":{"document_bytes":16777216,"sheet_cells":100000,"rows_first":2000,"rows_last":500,"rows_between":2000,"halvings":0,"cell_chars":16384,"cell_head_chars":4096},"cells_cut":0,"cells_raw":0,"read":"whole","date_system":"1900"}

{"sheet":"Instructions","index":0,"n_rows":8,"n_cols":1,"rows_kept":8,"cut":false,"hidden":false,"merged":[]}
["Instructions for completing Excel Based Jobsheets & worksheets for plant control or plant treatment practices:"]
["These Jobsheets have two main sections: The white section for the Cooperator on the left, and; the tan area on the right to assist the Planner in making planning decisions while completing the Jobsheet. "]
["Planners must fill in all applicable grey boxes from top to bottom & left to right on the Plant Control Practices Tab.  When complete, print & have the Cooperator to sign and date.  Many grey boxes have drop down lists."]
["Click on, or hover the curser over cells with a small red triangle in the upper right corner for planner guidance with completing the Plant Control Practices form.  "]
["Some items have built in warnings indicating that the values or criteria selected by Planners may fall outside of typical technical recommendations.  Planners should modify the parameter until the warning goes away, or seek the additional review and/or approval as indicated."]
["Once the Jobsheet is completed, print out both the white and tan sections in their entirety for the case file folder.  Subsequently print out the shorter white section for the Cooperator's copy."]
["Macro buttons located in the left margin of the Jobsheet allow Planners to clear the Jobsheet for a new project or minimize the space required for listing plant species based on objectives of each Cooperator/project."]
["If you have any questions or problems with this Jobsheet, or if you have suggestions for improving the Jobsheet, please contact the PIA State Forester or PIA State Range Management Specialist."]

{"sheet":"Plant Control IR Template","index":1,"n_rows":195,"n_cols":33,"rows_kept":195,"cut":false,"hidden":false,"merged":[[96,5,96,7],[97,5,97,7],[98,5,98,7],[95,5,95,7],[16,12,16,20],[50,12,50,20],[94,4,94,10],[16,2,16,11],[11,2,11,11],[59,2,59,3],[58,2,58,3],[94,2,94,3],[86,9,86,11],[87,2,87,11],[88,2,88,5],[88,7,88,11],[89,2,89,11],[54,4,54,5],[56,7,56,8],[51,4,51,5],[51,2,51,3],[53,10,53,11],[54,7,54,8],[53,7,53,8],[101,2,101,7],[103,2,103,7],[105,2,105,11],[106,2,106,11],[104,12,104,14],[104,19,104,20],[102,19,103,20],[39,2,39,11],[40,2,49,11],[79,2,82,11],[78,2,78,11],[64,2,64,11],[65,2,65,11],[66,2,66,11],[67,2,67,11],[68,2,68,11],[69,2,69,11],[70,2,70,11],[71,2,71,11],[84,12,93,20],[94,12,94,20],[96,12,96,14],[97,12,97,14],[98,12,98,14],[122,2,122,11],[120,5,120,11],[121,5,121,11],[113,2,113,11],[115,2,115,11],[114,2,114,11],[112,2,112,8],[110,2,110,11],[109,2,109,11],[138,2,138,11],[141,2,141,11],[142,2,142,11],[140,5,140,8],[132,2,132,10],[133,3,133,9],[134,3,134,9],[129,2,129,11],[130,2,130,10],[131,2,131,10],[135,2,135,10],[136,2,136,10],[137,2,137,11],[139,10,139,11],[140,10,140,11],[139,2,140,4],[99,12,101,20],[102,15,103,15],[102,16,103,16],[102,17,103,17],[102,18,103,18],[102,12,102,14],[103,12,103,14],[95,12,95,20],[58,4,58,5],[61,10,61,11],[59,4,59,5],[59,10,59,11],[94,11,95,11],[95,2,95,4],[95,8,95,10],[72,2,73,11],[74,2,74,11],[75,2,75,11],[76,2,76,11],[77,2,77,11],[62,2,62,11],[84,2,84,11],[85,2,85,11],[86,2,86,7],[125,2,125,3],[126,2,126,3],[128,2,128,3],[127,2,127,3],[25,4,25,5],[25,2,25,3],[26,2,26,3],[27,4,27,5],[30,2,30,5],[28,4,28,5],[32,3,32,5],[26,4,26,5],[34,3,34,5],[57,2,57,3],[37,2,38,5],[50,2,50,11],[117,9,117,11],[111,9,111,11],[112,9,112,11],[63,7,63,8],[123,11,124,11],[124,2,124,3],[116,10,116,11],[121,2,121,4],[53,4,53,5],[55,4,55,5],[54,10,54,11],[51,10,51,11],[52,2,52,3],[52,10,52,11],[56,10,56,11],[0,12,0,20],[7,3,7,5],[0,2,0,9],[0,10,0,11],[1,10,1,11],[1,2,1,9],[2,2,2,11],[4,2,4,4],[4,10,4,11],[5,9,5,11],[5,3,5,5],[3,2,3,11],[6,6,6,7],[2,13,2,20],[1,12,1,20],[5,6,5,8],[6,12,8,12],[6,13,8,20],[3,13,5,20],[3,12,5,12],[9,19,9,20],[9,13,9,18],[8,2,8,11],[9,10,9,11],[9,2,9,3],[9,5,9,9],[15,12,15,20],[11,16,11,17],[11,18,11,20],[10,13,10,14],[11,13,11,14],[10,2,10,3],[10,5,10,9],[10,16,10,17],[10,10,10,11],[12,2,15,11],[10,18,10,20],[13,12,14,20],[12,12,12,20],[123,2,123,3],[117,3,117,5],[116,2,116,4],[119,7,119,11],[120,2,120,4],[119,3,119,6],[63,2,63,4],[96,2,96,4],[96,8,96,10],[103,10,103,11],[97,2,97,4],[97,8,97,10],[98,2,98,4],[98,8,98,10],[100,8,100,9],[108,2,108,11],[107,2,107,11],[101,8,101,9],[101,10,101,11],[102,8,102,9],[102,10,102,11],[103,8,103,9],[90,2,93,11],[100,10,100,11],[31,3,31,5],[36,3,36,5],[33,3,33,5],[27,2,27,3],[60,10,60,11],[63,9,63,11],[61,2,61,3],[61,4,61,5],[60,2,60,3],[60,4,60,5],[61,7,61,8],[60,7,60,8],[59,7,59,8],[55,7,55,8],[56,2,56,3],[57,4,57,5],[54,2,54,3],[57,7,57,8],[35,3,35,5],[53,2,53,3],[51,7,51,8],[56,4,56,5],[55,2,55,3],[52,4,52,5],[17,2,17,3],[18,2,18,3],[21,2,21,3],[22,2,22,3],[21,4,21,5],[20,2,20,3],[22,4,22,5],[23,4,23,5],[29,4,29,5],[29,2,29,3],[23,2,23,3],[19,2,19,3],[19,4,19,5],[20,4,20,5],[28,2,28,3],[17,4,17,5],[18,4,18,5],[24,4,24,5],[24,2,24,3],[62,12,62,20],[70,12,71,15],[61,15,61,16],[64,12,64,16],[61,12,61,13],[63,12,63,16],[65,12,65,16],[66,12,66,16],[70,16,71,20],[69,12,69,20],[76,22,76,24],[75,22,75,24],[74,22,74,24],[73,22,73,24],[77,22,77,24],[83,12,83,20],[72,12,73,15],[72,22,72,24],[72,16,73,20],[74,12,75,15],[74,16,75,20],[18,12,18,13],[17,12,17,13],[46,15,47,20],[19,12,19,13],[21,12,21,13],[22,12,22,13],[23,12,23,13],[24,12,24,13],[44,12,45,20],[25,12,25,13],[26,12,26,13],[27,12,27,13],[28,12,28,13],[29,12,29,13],[30,12,30,14],[32,12,32,14],[20,12,20,13],[46,12,46,14],[47,12,47,14],[36,12,37,20],[33,12,35,12],[33,13,35,20],[40,12,43,20],[30,15,30,20],[59,12,59,13],[57,15,57,16],[56,15,56,16],[51,15,51,16],[56,12,56,13],[57,12,57,13],[60,15,60,16],[59,15,59,16],[55,15,55,16],[54,15,54,16],[53,15,53,16],[52,15,52,16],[52,12,52,13],[53,12,53,13],[54,12,54,13],[55,12,55,13],[58,15,58,16],[60,12,60,13],[31,7,31,10],[32,7,32,10],[33,7,33,10],[34,7,34,10],[30,7,30,11],[35,7,35,10],[36,7,38,11],[51,12,51,13],[58,12,58,13],[57,10,57,11],[49,12,49,20],[48,13,48,20],[58,10,58,11],[58,7,58,8],[31,15,31,20],[32,15,32,20],[31,12,31,14],[55,10,55,11],[52,7,52,8]]}
[null,null,"Natural Resources Conservation Service - Pacific Islands",null,null,null,null,null,null,null,"Field Office:",null,"Information & Resources for Conservation Planners",null,null,null,null,null,null,null,null,null,null,"American Samoa",null,{"$f":"IF(C3=\"\",\"\",VLOOKUP(C3,AA1:AB7,2,FALSE))","v":{"$error":"#N/A"}},"Brush Management (314)","BM","Tree/Shrub Site Preparation (490)"]
[null,null,"Conservation Practice Implementation Requirements",null,null,null,null,null,null,null,null,null,"Resource Concern and Purpose for Planned Practice",null,null,null,null,null,null,null,null,{"$f":"IF(OR(K2=\"Hilo\",K2=\"Waimea\",K2=\"Kealakekua\"),\"Hawaii\",IF(K2=\"Oahu\",\"Oahu\",IF(K2=\"Hoolehua\",\"Molokai\",IF(K2=\"Lihue\",\"Kauai\",IF(K2=\"Kahului\",\"Maui\",IF(K2=\"Palau\",\"Palau\",IF(K2=\"Pohnpei\",\"FSM\",IF(K2=\"Guam\",\"Guam\",IF(K2=\"Saipan\",\"Northern Mariana Islands\",IF(K2=\"Marshall Islands\",\"Marshall Islands\",IF(K2=\"American Samoa\",\"American Samoa\",FALSE)))))))))))","v":false},null,"Guam",null,null,"Forest Stand Improvement (666)","FSI","Fuel Break (383)"]
[null,null,"<Select Practice>",null,null,null,null,null,null,null,null,null,"Resource Concern ",null,null,null,null,null,null,null,null,null,null,"Hilo",null,null,"Fuel Break (383)","FB","Forest Stand Improvement (666)"]
[null,null,"Version: October 2021",null,null,null,null,null,null,null,null,null,"Primary Practice Purpose ",null,null,null,null,null,null,null,null,null,null,"Kahului",null,null,"Herbaceous Weed Treatment (315)","HWT","Tree/Shrub Pruning (660)"]
[null,null,"Jobsheet Prepared for and by:",null,null,null,null,null,null,"Date:",null,null,null,null,null,null,null,null,null,null,null,null,null,"Kaunakakai",null,null,"Tree/Shrub Pruning (660)","TSP","Windbreak/Shelterbelt Establishment and Renovation (380)"]
[null,null,"Cooperator Name",null,null,null,"     Business Name",null,null,null,null,null,null,null,null,null,null,null,null,null,null,null,null,"Kealakekua",null,null,"Tree/Shrub Site Preparation (490)","TSSP","<Select Practice>"]
[null,null,"Tract Number",null,"Field #s",null,{"$f":"IF(C3=\"Windbreak/Shelterbelt Renovation (650)\",\"Total Length of Windbreaks (ft)\",\"Field Acres\")","v":"Field Acres"},null,null,"Planned Amt",null,null,"Secondary Practice Purpose (if applicable)",null,null,null,null,null,null,null,null,"acres",null,"Lihue",null,null,"Windbreak/Shelterbelt Establishment and Renovation (380)","WSR"]
[null,null,"Planner Name",null,null,null,null,null,null,null,null,null,null,null,null,null,null,null,null,null,null,"feet",null,"Marshall Islands",null,null,"Select CPS First"]
[null,null,"Site Conditions for Planned Practice:",null,null,null,null,null,null,null,null,null,null,null,null,null,null,null,null,null,null,"trees",null,"Oahu"]
[null,null,"Site Rainfall (inches/year)",null,null,"Predominant Soil Map Unit Symbol",null,null,null,null,null,null,"Predominant Soil Map Unit Name ->",{"$f":"IF(K10=\"\",\"\",IF(VLOOKUP($K$10,'Soils Data'!$D$2:$O$1896,3,0)=\"\",\"No Data\",VLOOKUP($K$10,'Soils Data'!$D$2:$O$1896,3,0)))","v":""},null,null,null,null,null,"Web Soil Survey",null,null,null,"Palau"]
[null,null,"Site Elevation (feet)",null,null,"NRCS Land Use Designation for Planned Fields",null,null,null,null,null,null,"Soil Restrictive Layer (inches)","Percent Rock Content in Plow Layer",null,"Percent Slope","Available Water Capacity: top 20\"",null,"Flooding Frequency",null,null,"Crop",null,"Pohnpei"]
[null,null,"Summary of Conservation Practice:",null,null,null,null,null,null,null,null,null,{"$f":"IF(K10=\"\",\"\",IF(X16=\"No Data\",\"Greater than 79 inches\",X16))","v":""},{"$f":"IF(K10=\"\",\"\",IF(VLOOKUP($K$10,'Soils Data'!$D$2:$O$1896,9,0)=\"\",\"No Data\",VLOOKUP($K$10,'Soils Data'!$D$2:$O$1896,9,0)))","v":""},null,{"$f":"IF(K10=\"\",\"\",IF(VLOOKUP($K$10,'Soils Data'!$D$2:$O$1896,10,0)=\"\",\"No Data\",VLOOKUP($K$10,'Soils Data'!$D$2:$O$1896,10,0)))","v":""},{"$f":"IF(K10=\"\",\"\",IF(Y16=\"No Data\",\"No Data\",Y16))","v":""},null,{"$f":"IF(K10=\"\",\"\",IF(VLOOKUP($K$10,'Soils Data'!$D$2:$O$1896,12,0)=\"\",\"No Data\",VLOOKUP($K$10,'Soils Data'!$D$2:$O$1896,12,0)))","v":""},null,null,"Range",null,"Saipan"]
[null,null,null,null,null,null,null,null,null,null,null,null,{"$f":"IF(C3=\"\",\"\",IF(COUNTIF(I19:I30,\"Native\"),AC75,\"\"))","v":""},null,null,null,null,null,null,null,null,"Pasture",null,"Waimea"]
[null,null,null,null,null,null,null,null,null,null,null,null,"     Native in all PIA locations: Dicranopteris linearis\n     Native outside Hawaii: Hibisucs tiliaceus; Casuarina equisetifolia; Macaranga thompsonii; Macaranga harveyana",null,null,null,null,null,null,null,null,"Forest"]
[null,null,null,null,null,null,null,null,null,null,null,null,null,null,null,null,null,null,null,null,null,"Farmstead",null,"Restrictive","AWC"]
[null,null,null,null,null,null,null,null,null,null,null,null,{"$f":"IF(C3=\"\",\"\",IF(COUNTIF(O19:O30,\"Yes\")>0,\"Controlling listed plant species is illegal and unauthorized - remove this plant from list of species to control\",\"\"))","v":""},null,null,null,null,null,null,null,null,"Associated Agricultural lands",null,{"$f":"IF(VLOOKUP($K$10,'Soils Data'!$D$2:$O$1896,8,0)=80,\"No Data\",VLOOKUP($K$10,'Soils Data'!$D$2:$O$1896,8,0))","v":{"$error":"#N/A"}},{"$f":"IF(VLOOKUP($K$10,'Soils Data'!$D$2:$O$1896,11,0)=\"\",\"No Data\",VLOOKUP($K$10,'Soils Data'!$D$2:$O$1896,11,0))","v":{"$error":"#N/A"}}]
[null,null,"Plant Species to Treat or Control:",null,null,null,null,null,null,null,null,null,"Plant Species to Treat or Control:",null,null,null,null,null,null,null,null,"Other"]
[null,"Select number","Scientific name",null,"Common name",null,"Type","Species group","Origin","Initial density","Final density","Density units","Common name",null,"Is Species Threatened or Endangered?",null,null,null,null,null,null,null,null,null,null,"Density units filter"]
[null,null,null,null,null,null,null,null,null,null,null,null,{"$f":"IF(E19=\"\",\"\",E19)","v":""},null,null,null,null,null,null,null,null,"Native","A","Grass","stems/acre",{"$f":"IF(C3=\"\",SCPF,VLOOKUP(C3,W74:AE80,9,FALSE))","v":{"$error":"#N/A"}}]
[{"$f":"IF($B$18=\"Select number\",\"No\",IF($B$18<2,\"No\",\"Yes\"))","v":"No"},null,null,null,null,null,null,null,null,null,null,null,{"$f":"IF(E20=\"\",\"\",E20)","v":""},null,null,null,null,null,null,null,null,"Introduced","B","Herbaceous","canopy %"]
[{"$f":"IF($B$18=\"Select number\",\"No\",IF($B$18<3,\"No\",\"Yes\"))","v":"No"},null,null,null,null,null,null,null,null,null,null,null,"",null,null,null,null,null,null,null,null,null,"C","Vine-herb","trees"]
[{"$f":"IF($B$18=\"Select number\",\"No\",IF($B$18<4,\"No\",\"Yes\"))","v":"No"},null,null,null,null,null,null,null,null,null,null,null,"",null,null,null,null,null,null,null,null,"No","D","Vine-woody","feet"]
[{"$f":"IF($B$18=\"Select number\",\"No\",IF($B$18<5,\"No\",\"Yes\"))","v":"No"},null,null,null,null,null,null,null,null,null,null,null,"",null,null,null,null,null,null,null,null,"Yes","E","Shrub","stems/100 ft"]
[{"$f":"IF($B$18=\"Select number\",\"No\",IF($B$18<6,\"No\",\"Yes\"))","v":"No"},null,null,null,null,null,null,null,null,null,null,null,"",null,null,null,null,null,null,null,null,null,"Other","Tree"]
[{"$f":"IF($B$18=\"Select number\",\"No\",IF($B$18<7,\"No\",\"Yes\"))","v":"No"},null,null,null,null,null,null,null,null,null,null,null,"",null,null,null,null,null,null,null,null,"Select number"]
[{"$f":"IF($B$18=\"Select number\",\"No\",IF($B$18<8,\"No\",\"Yes\"))","v":"No"},null,null,null,null,null,null,null,null,null,null,null,"",null,null,null,null,null,null,null,null,1]
[{"$f":"IF($B$18=\"Select number\",\"No\",IF($B$18<9,\"No\",\"Yes\"))","v":"No"},null,null,null,null,null,null,null,null,null,null,null,"",null,null,null,null,null,null,null,null,2,"N/A"]
[{"$f":"IF($B$18=\"Select number\",\"No\",IF($B$18<10,\"No\",\"Yes\"))","v":"No"},null,null,null,null,null,null,null,null,null,null,null,"",null,null,null,null,null,null,null,null,3,"Mechanized"]
[{"$f":"IF($B$18=\"Select number\",\"No\",IF($B$18<11,\"No\",\"Yes\"))","v":"No"},null,null,null,null,null,null,null,null,null,null,null,"",null,null,null,null,null,null,null,null,4,"Chemical, manual - foliar spray"]
[{"$f":"IF($B$18=\"Select number\",\"No\",IF($B$18<12,\"No\",\"Yes\"))","v":"No"},null,null,null,null,null,null,null,null,null,null,null,"",null,null,null,null,null,null,null,null,5,"Chemical, manual - basal bark"]
[null,null,"Plant Control or Treatment Method(s):",null,null,null,null,"Fuel Break/Pruning Specifications:",null,null,null,null,"Hawaii Pacific Weed Risk Assessment",null,null,"<--Search here to evaluate specified species for weed threats",null,null,null,null,null,6,"Chemical, manual - cut stump"]
[null,null,"Species group",{"$f":"IF(AND(M40<>\"Select number\",M40>=2,OR(C3=\"Brush Management (314)\",C3=\"Herbaceous Weed Control (315)\")),\"Treatment method - 1st application\",\"Treatment method\")","v":"Treatment method"},null,null,null,"Retained trees will be pruned?",null,null,null,null,null,null,null,"<--View T&E list for PIA, plants only",null,null,null,null,null,7,"Chemical, manual - injection"]
[null,null,"A",null,null,null,null,"Pruning height above ground (feet)",null,null,null,null,"ESA list for Pacific Islands Area (FOTG Section II)",null,null,"<--Complete ESA species list for PIA (xlsm download)",null,null,null,null,null,8,"Chemical, mechanized"]
[null,null,"B",null,null,null,null,"Width (feet)",null,null,null,null,null,"Were any Threatened or Endangered plant (within APE) or animal (within 1/3 mile of APE) species identified where plant clearing or control work will be conducted during either the environmental compliance or inventory & evaluation processes?",null,null,null,null,null,null,null,9,"Chemical, aerial"]
[null,null,"C",null,null,null,null,"Length (feet)",null,null,null,null,null,null,null,null,null,null,null,null,null,10,"Manual cut"]
[null,null,"D",null,null,null,null,"Acres",null,null,null,{"$f":"L34*L35/43560","v":0},null,null,null,null,null,null,null,null,null,11,"Manual grubbing"]
[null,null,"E",null,null,null,null,{"$f":"IF($L$34=\"\",\"\",IF($L$34<30,\"For plant control in areas less than 30 feet wide, use Brush Management (314) or Forest Stand Improvement (666)\",\"\"))","v":""},null,null,null,null,{"$f":"IF(OR(M34=\"Yes\",COUNTIF(P53:Q62,\"Yes\")>0),\"You must specifically document mitigative measures to be taken in both the Conservation Plan and Implementation Requirements for each listed species to ensure their protection and preservation during control work.\",\"\")","v":""},null,null,null,null,null,null,null,null,12,"Prune, branches"]
[null,null,{"$f":"IF(OR($D$33=$W$43,$D$34=$W$43,$D$35=$W$43,$D$36=$W$43,$D$37=$W$43),\"You must obtain PIA State Rangeland Specialist approval for biological control method and specifications.\",\"\")","v":""},null,null,null,null,null,null,null,null,null,null,null,null,null,null,null,null,null,null,null,"Prune, fire hazard (canopy lifting)"]
[null,null,null,null,null,null,null,null,null,null,null,null,"   • In general plan to control plant species with a HPWRA score of 7 or higher",null,null,null,null,null,null,null,null,null,"Prune, roots"]
[null,null,"Site-specific specifications (Refer to Standard), additional requirements and information:",null,null,null,null,null,null,null,null,null,"   • Pervasive weeds should be controlled as close to 100% eradication as possible ",null,null,null,null,null,null,null,null,null,"Tree topping"]
[null,null,null,null,null,null,null,null,null,null,null,null,"   • Only plants listed on the PIA Pervasive Weed List can be treated multiple times following 490 Tree/Shrub Site Preparation. Control of these species is limited to a maximum of three practice applications where 490 is the first practice scheduled. CPS 314 and 315 may be planned multiple times following 490 and those IRs are fillable PDF forms found in respective folders in FOTG.",null,null,null,null,null,null,null,null,null,"Mow"]
[null,null,null,null,null,null,null,null,null,null,null,null,null,null,null,null,null,null,null,null,null,null,"Mow + chemical (wet blade)"]
[null,null,null,null,null,null,null,null,null,null,null,null,null,null,null,null,null,null,null,null,null,null,"Biological, grazing or browsing"]
[null,null,null,null,null,null,null,null,null,null,null,null,null,null,null,null,null,null,null,null,null,null,"See \"Additional Information\" below"]
[null,null,null,null,null,null,null,null,null,null,null,null,"<--- For each selected herbicide, specify that applicable labels must be followed along with a UH-recommended control method and prescription.  If desired prescritpions are not found in the top two links below, contact the",null,null,null,null,null,null,null,null,null,"N/A"]
[null,null,null,null,null,null,null,null,null,null,null,null,null,null,null,null,null,null,null,null,null,"Very low"]
[null,null,null,null,null,null,null,null,null,null,null,null,"UH Extension herbicide methods & prescriptions ",null,null,{"$f":"IF(AND(COUNTIFS($D$33:$L$39,\"*Chemical*\")>0,C3>0),VLOOKUP(C3,W74:AD80,8,FALSE),\"[contact will be specified after a practice is selected in cell C3 and chemical methods are selected in D33:37]\")","v":"[contact will be specified after a practice is selected in cell C3 and chemical methods are selected in D33:37]"},null,null,null,null,null,"Low"]
[null,null,null,null,null,null,null,null,null,null,null,null,"More UH Extension herbicide prescriptions",null,null,null,null,null,null,null,null,"Intermediate"]
[null,null,null,null,null,null,null,null,null,null,null,null,"Intermediate","<- Score from WinPST or PIA Water Quality Tech Note 14 for proposed chemcial with highest risk",null,null,null,null,null,null,null,"High"]
[{"$f":"IF(OR(M49=\"intermediate\",M49=\"high\", M49=\"very high\"),\"Yes\",\"No\")","v":"Yes"},null,null,null,null,null,null,null,null,null,null,null,{"$f":"IF(OR(M49=\"intermediate\",M49=\"high\", M49=\"very high\"),\"Complete CPS 595 Cons. Planning Worksheet if any chemical with risk level 'Intermediate' or higher will be broadcast\",\"\")","v":"Complete CPS 595 Cons. Planning Worksheet if any chemical with risk level 'Intermediate' or higher will be broadcast"},null,null,null,null,null,null,null,null,"Very High"]
[null,null,"Plant Species to Retain:",null,null,null,null,null,null,null,null,null,"Plant Species to Retain:"]
[null,"Select number","Scientific name",null,"Common name",null,"Type","Origin",null,null,null,null,"Common name",null,"HPWRA score","Is species Threatened or Endangered?",null,null,null,null,null,"Select number"]
[null,null,null,null,null,null,null,null,null,null,null,null,{"$f":"IF(E53=\"\",\"\",E53)","v":""},null,null,null,null,null,null,null,null,0]
[{"$f":"IF(AND($B$52<>\"Select Number\",$B$52>1),\"Yes\",\"No\")","v":"No"},null,null,null,null,null,null,null,null,null,null,null,"",null,null,null,null,null,null,null,null,1]
[{"$f":"IF(AND($B$52<>\"Select Number\",$B$52>2),\"Yes\",\"No\")","v":"No"},null,null,null,null,null,null,null,null,null,null,null,"",null,null,null,null,null,null,null,null,2]
[{"$f":"IF(AND($B$52<>\"Select Number\",$B$52>3),\"Yes\",\"No\")","v":"No"},null,null,null,null,null,null,null,null,null,null,null,"",null,null,null,null,null,null,null,null,3]
[{"$f":"IF(AND($B$52<>\"Select Number\",$B$52>4),\"Yes\",\"No\")","v":"No"},null,null,null,null,null,null,null,null,null,null,null,"",null,null,null,null,null,null,null,null,4]
[{"$f":"IF(AND($B$52<>\"Select Number\",$B$52>5),\"Yes\",\"No\")","v":"No"},null,null,null,null,null,null,null,null,null,null,null,"",null,null,null,null,null,null,null,null,5]
[{"$f":"IF(AND($B$52<>\"Select Number\",$B$52>6),\"Yes\",\"No\")","v":"No"},null,null,null,null,null,null,null,null,null,null,null,"",null,null,null,null,null,null,null,null,6]
[{"$f":"IF(AND($B$52<>\"Select Number\",$B$52>7),\"Yes\",\"No\")","v":"No"},null,null,null,null,null,null,null,null,null,null,null,"",null,null,null,null,null,null,null,null,7]
[{"$f":"IF(AND($B$52<>\"Select Number\",$B$52>8),\"Yes\",\"No\")","v":"No"},null,null,null,null,null,null,null,null,null,null,null,"",null,null,null,null,null,null,null,null,8]
[{"$f":"IF(AND($B$52<>\"Select Number\",$B$52>9),\"Yes\",\"No\")","v":"No"},null,null,null,null,null,null,null,null,null,null,null,"",null,null,null,null,null,null,null,null,9]
[null,null,"Timing of work & other considerations",null,null,null,null,null,null,null,null,null,{"$f":"IF(C3=\"\",\"\",IF(AND(K11=\"Forest\",COUNTIF(O53:O62,\">6\")),\"You must obtain PIA State Forester approval to retain plant species with a HPWRA score of 7 or higher\",\"\"))","v":""},null,null,null,null,null,null,null,null,10]
[null,null,"   ● The rainy season for this site is typically",null,null,null,"-- to --",null,null,null,null,null,"<---  ○ Hawaii - UH Geography Department interactive rainfall map"]
[null,null,"  ● Specify treatment dates for best plant control while minimizing seasonal impacts to wildlife & pollinators.",null,null,null,null,null,null,null,null,null,"         ○ Guam - U.S. Geological Survey rainfall modelling map"]
[null,null,"  ● Control work should be completed 2 weeks to 6 months before a planting practice (if any) is scheduled,",null,null,null,null,null,null,null,null,null,"         ○ Saipan - U.S. Geological Survey rainfall modelling map"]
[null,null,"     with a preference for the shortest time period possible.",null,null,null,null,null,null,null,null,null,"         ○ Tutuila - U.S. Geological Survey rainfall modelling map"]
[null,null,"  ● Treat slash/debris so it doesn't foster harmful pest levels, hinder operations or create undue fire hazards."]
[null,null,"  ● For methods that involve soil disturbance, minimize activities during the rainy season and employ"]
[null,null,"     mitigative measures and/or conservation practices to reduce potential erosion & runoff as needed.",null,null,null,null,null,null,null,null,null," Specified approval signature(s) must be obtained for each item shown below (if any) to proceed with the project:"]
[null,null,"  ● For mechanized control methods, avoid crossing wet watercourses with heavy equipment.",null,null,null,null,null,null,null,null,null,{"$f":"IF(COUNTIFS(M13,\"*forester*\"),\"PIA State Forester approval for cutting or clearing native species:\",IF(COUNTIFS(M13,\"*grazing*\"),\"PIA State Grazing Land Management Specialist approval for cutting or clearing native species:\",\"\"))","v":""},null,null,null,"{Approval Signature}"]
[null,null,"  ● All permits are the responsibility of the landowner and contractor."]
[null,null,"  ● Do not apply herbicides when average winds exceed 10 mph or rainfall exceeds 1/16\" during/within one\n     hour after the application to improve treatment effectiveness & reduce potential chemical drift or runoff.",null,null,null,null,null,null,null,null,null,{"$f":"IF(COUNTIFS(M63,\"*forester*\"),\"PIA State Forester approval to retain plant species with a HPWRA score of 7 or higher:\",\"\")","v":""},null,null,null,"{Approval Signature}",null,null,null,null,null,"Practice",null,null,"Narrative title","Narrative details","Lifespan","Native spp. control","Herbicide notes","Density units"]
[null,null,null,null,null,null,null,null,null,null,null,null,null,null,null,null,null,null,null,null,null,null,"Brush Management (314)"]
[null,null,"  ● Where applicable, minimize damage to residual/desirable vegetation to the greatest practical extent.",null,null,null,null,null,null,null,null,null,{"$f":"IF($C$38<>\"\",\"PIA State Grazing Land Management Specialist approval for biological control method and specifications:\",\"\")","v":""},null,null,null,"{Approval Signature}",null,null,null,null,null,"Forest Stand Improvement (666)",null,null,"Additional Guidelines & Specifications for Forest Stand Improvement (666):","• Complimentary practices: Woody Residue Treatment (384); Mulching (484), Access Control (472).\n• Summary of Conservation Practice: Specify either even-aged or uneven-aged mangement system.\n• Plant Control or Treatment Methods: Specify felling and operational methods that minimize impacts to desired residual vegetation.\n• Plant Species to Retain: For residual trees, specify desired spacing, basal area or trees per acre by species and size-class distribution, and; Specify desired understory composition.\n• See applicable \"Additional Criteria\" in 666 Standard.\n• Consider establishing temporary cover as necessary to control sheet and rill and/or wind erosion on the cleared area until the planned land use is in place.","ten-year","You must obtain PIA State Forester approval to cut or clear native species except for species listed here:","State Forester for assistance.",1]
[null,null,"  ● When controlling noxious or invasive species, avoid field operations during the seeding season.  Minimize",null,null,null,null,null,null,null,null,null,null,null,null,null,null,null,null,null,null,null,"Fuel Break (383)",null,null,"Additional Guidelines & Specifications for Fuelbreak (383):","• Conservation Plans including this practice shall not leave fuel breaks in a permanant bare ground condition.\n• Complimentary practices: Woody Residue Treatment (384), Prescribed Grazing (528), appropriate planting practice if fire-resistant vegetation is to be established.\n• Summary of Conservation Practice: Specify planned number of trees to be pruned if \"Pruning, fire hazard\" practice payment scenario is to be contracted.\n• Plant Control or Treatment Methods: Prune lower branches on all trees remaining within fuel break to a minimum height of 8-10 feet above ground level, and; Prune crowns to maintain minumum 20-30 foot horizontal separation between adjacent tree crowns.\n• Timing of work & other considerations: Specify fuelbreak location & design details; When possible locate fuel breaks (a) Perpendicular to the prevailing wind and on the windward side of the area to be protected, and/or (b) near ridge crests and valley bottoms, and; Specify requirements for treatment and/or removal of slash to minimize risk of fire, pests or disease.\n• See applicable \"Additional Criteria\" in 383 Standard.\n• Provide a sketch and conduct a sample marking of \"leave\" vs. \"remove\" trees/vegetation.\n• Consider establishing temporary cover as necessary to control sheet and rill and/or wind erosion on the cleared area until the planned land use is in place.\n• O&M: Specify requirements for periodic inspection/maintenance of fuelbreaks at least annually to ensure that accumulations of woody materials are removed and herbaceous plants are controlled or mowed as necessary to maintain the desired level of fuelbreak function.","ten-year","You must obtain PIA State Forester approval to cut or clear native species except for species listed here:","State Forester for assistance.",3]
[null,null,"     ingress & egress of vehicles, personnel & associated equipment to the greatest practical extent.  Wash",null,null,null,null,null,null,null,null,null,null,null,null,null,null,null,null,null,null,null,"Herbaceous Weed Treatment (315)"]
[null,null,"     machinery, equipment, boots and clothing thoroughly prior to beginning & after completing work.",null,null,null,null,null,null,null,null,null,null,null,null,null,null,null,null,null,null,null,"Tree/Shrub Pruning (660)",null,null,"Additional Guidelines & Specifications for Tree/Shrub Pruning (660):","• Complimentary practice: Woody Residue Treatment (384).\n• Summary of Conservation Practice: Specify planned number of trees to be pruned if any crown pruning practice payment scenario is to be contracted - otherwise specify planned number of feet to be root pruned if \"Pruning, root\" practice payment scenario is to be contracted.\n• Plant Control or Treatment Methods: For a high degree of removal of crown foliage, pruning and shearing shall be done in two or more timed intervals to minimize plant stress; Disinfect pruning and shearing tools to minimize the spread of pathogens; If selected purpose is \"Reduce fire and/or safety hazards,\" prune lower branches on all trees to a minimum height of 8-10 feet above ground level, and; Specify minimum and maximum crown/branch removals by individual plant types and species.\n• See applicable \"Additional Criteria\" in 660 Standard.\n• O & M: Any new branch development on the previously pruned tree bole shall be removed, and; Maintain tree and shrub canopy shape where needed for intended production and/or function.\n• Provide Cooperator with a copy of the \"Tree Pruning Guidelines\" worksheet included in this Excel file.\n• Consult with PIA State Forester for specific pruning techniques and references.","ten-year","You must obtain PIA State Forester approval to cut or clear native species except for species listed here:","State Forester for assistance.",4]
[null,null,"Additional Information/Requirements: ",null,null,null,null,null,null,null,null,null,null,null,null,null,null,null,null,null,null,null,"Tree/Shrub Site Preparation (490)",null,null,"Additional Guidelines & Specifications for Tree/Shrub Site Preparation (490):","• Complimentary practices: Woody Residue Treatment (384); Mulching (484); Tree/Shrub planting practices; Access Control (472).\n• Plant Control or Treatment Methods: Specify felling and operational methods that minimize impacts to desired residual vegetation.\n• Plant Species to Retain: For residual trees, specify desired spacing, basal area or trees per acre by species and size-class distribution; Specify desired understory composition.\n• See applicable \"Additional Criteria\" in 490 Standard.\n• Consider establishing temporary cover as necessary to control sheet and rill and/or wind erosion on the cleared area until the planned land use is in place.","one-year","You must obtain PIA State Forester approval to cut or clear native species except for species listed here:","State Forester for assistance.",1]
[null,null,null,null,null,null,null,null,null,null,null,null,null,null,null,null,null,null,null,null,null,null,"Windbreak/Shelterbelt Establishment and Renovation (380)",null,null,"Additional Guidelines & Specifications for Windbreak/Shelterbelt Establishment and Renovation (380):","• Complimentary practices: Woody Residue Treatment (384); Mulching (484); Windbreak/Shelterbelt Establishment (380); Access Control (472); Windbreak/Shelterbelt Establishment (380).\n• Evaluate existing windbreak growing space, canopy structure & density, shade level and root competition with vegetation in adjacent fields to determine if these factors are at acceptable levels.\n• Remove entire or partial rows of trees or shrubs to release adjacent trees/shrubs or tree/shrub rows.\n• Plant Species to Control or Treat: Specify method (thin, prune, shear, coppice, top, remove entire row) for each species to be treated and treatment amount (type, percent or density) to be removed.\n• Consider establishing temporary cover as necessary to control sheet and rill and/or wind erosion on the cleared area until the planned land use is in place.\n• O&M: If needed install protective measures for coppiced plants to maintain intended windbreak function, and; Specify that Cooperator is responsible for additional renovation work that may arise during the 15-year lifespan of this practice.","15 - year","You must obtain PIA State Forester approval to cut or clear native species except for species listed here:","State Forester for assistance.",5]
[]
[]
[]
[null,null,"Operation and Maintenance Requirements:",null,null,null,null,null,null,null,null,null,{"$f":"IF(OR($C$3=\"<Select Practice>\",$C$3=\"\"),\"\",VLOOKUP($C$3,$W$74:$AB$81,4,FALSE))","v":""},null,null,null,null,null,null,null,null,"January"]
[null,null,"  ● Maintain erosion control measures as necessary",null,null,null,null,null,null,null,null,null,{"$f":"IF(OR(C3=\"<Select Practice>\",$C$3=\"\"),\"\",VLOOKUP($C$3,$W$74:$AB$81,5,FALSE))","v":""},null,null,null,null,null,null,null,null,"February"]
[null,null,"  ● The Cooperator is responsible for follow-up control work on undesired or invasive species that",null,null,null,null,null,null,null,null,null,null,null,null,null,null,null,null,null,null,"March"]
[null,null,"    germinate or colonize the site following treatment and during the",null,null,null,null,null,{"$f":"IF(OR($C$3=\"<Select Practice>\",$C$3=\"\"),\"\",VLOOKUP($C$3,$W$74:$AB$81,6,FALSE))","v":""},"lifespan of this practice",null,null,null,null,null,null,null,null,null,null,null,"April"]
[null,null,"  ● The Cooperator is responsible for follow-up control work on any/all treated species if the control",null,null,null,null,null,null,null,null,null,null,null,null,null,null,null,null,null,null,"May"]
[null,null,"    rate  falls  below  that  stated  above  during  the",null,null,null,{"$f":"IF(OR($C$3=\"<Select Practice>\",$C$3=\"\"),\"\",VLOOKUP($C$3,$W$74:$AB$81,6,FALSE))","v":""},"lifespan of this practice",null,null,null,null,null,null,null,null,null,null,null,null,null,"June"]
[null,null,"Additional Information/Requirements: ",null,null,null,null,null,null,null,null,null,null,null,null,null,null,null,null,null,null,"July"]
[null,null,null,null,null,null,null,null,null,null,null,null,null,null,null,null,null,null,null,null,null,"August"]
[null,null,null,null,null,null,null,null,null,null,null,null,null,null,null,null,null,null,null,null,null,"September"]
[null,null,null,null,null,null,null,null,null,null,null,null,null,null,null,null,null,null,null,null,null,"October",null,null,null,"N/A"]
[null,null,null,null,null,null,null,null,null,null,null,null,null,null,null,null,null,null,null,null,null,"November",null,"Forest Types","Veg Type","Controlling Factors","Fire Behavior"]
[null,null," I&E and Design Approval:",null,{"$f":"IF($C$3=\"\",\"\",$C$3)","v":"<Select Practice>"},null,null,null,null,null,null,"Req. Job Class","Fuel Assessment/Fire Hazard Determination:",null,null,null,null,null,null,null,null,"December",null,"<select forest type>","low grass (<2ft)","Method/equipment type","very low/none","I"]
[null,null,"Controlling Factors",null,null,"Units",null,null,"Planned Amt/Type/Method",null,null,null,"  ● For Controlling Factors \"Fire behavior\" or \"Post-implimentation fire risk\", select veg type below for analysis:",null,null,null,null,null,null,null,null,null,null,"wet forest (>80\" rain)","high grass (>2ft)","Site sensitivity","low","II"]
[null,null,{"$f":"IF($C$3=\"\",\"\",IF($C$3=$AC$1,$Z$95,IF($C$3=$AC$2,$Z$99,IF($C$3=$AC$3,$Z$97,IF($C$3=$AC$4,$Z$95,IF($C$3=$AC$5,$Z$101,\"\"))))))","v":""},null,null,null,null,null,null,null,null,null,{"$f":"IF($E$10=\"\",\"\",$E$10)","v":""},null,null,"<-----Rainfall entered at top of form",null,null,null,null,null,"No",null,"mesic forest (50-80\" rain)","scattered shrubs/trees and grass","Stand complexity","moderate","III"]
[null,null,{"$f":"IF($C$3=\"\",\"\",IF($C$3=$AC$1,$Z$96,IF($C$3=$AC$2,$Z$93,IF($C$3=$AC$3,$Z$96,IF($C$3=$AC$4,$Z$93,IF($C$3=$AC$5,$Z$93,\"\"))))))","v":""},null,null,null,null,null,null,null,null,null,null,null,null,"<-----Select best description of the vegetation at the site",null,null,null,null,null,"Yes",null,"dry forest (<50\" rain)","dense shrubs","Post-instalation fire risk","high or extreme","IV"]
[null,null,{"$f":"IF($C$3=\"\",\"\",IF($C$3=$AC$1,$Z$93,IF($C$3=$AC$2,$Z$100,IF($C$3=$AC$3,$Z$98,IF($C$3=$AC$4,$Z$93,IF($C$3=$AC$5,$Z$93,\"\"))))))","v":""},null,null,{"$f":"IF($E$95=\"\",\"\",IF(OR($E$95=\"Forest Stand Improvement (666)\",$E$95=\"Fuel Break (383)\"),\"Fire Behavior/Risk Rating\",\"\"))","v":""},null,null,{"$f":"IF($E$95=\"\",\"\",IF(OR($E$95=\"Forest Stand Improvement (666)\",$E$95=\"Fuel Break (383)\"),$M$99,\"\"))","v":""},null,null,{"$f":"IF($I$99=\"\",\"\",IF($I$99=$AA$95,$AB$95,IF($I$99=$AA$96,$AB$95,IF($I$99=$AA$97,$AB$96,IF($I$99=$AA$98,$AB$97,$AB$97)))))","v":""},{"$f":"IF($M$98=\"\",\"\",IF($E$10=\"\",\"enter rainfall in cell E10\",IF($E$10>=80,$AA$95,IF($E$10>=60,$AA$96,IF(AND($E$10>=40,OR($M$98=$Y$96,$M$98=$Y$97,$M$98=$Y$98)),$AA$97,IF(AND($E$10<40,OR($M$98=$Y$96,$M$98=$Y$97,$M$98=$Y$98,$M$98=$Y$99)),$AA$98,$AA$96))))))","v":""},null,null,"<-----Estimated Fire Behavior or Risk",null,null,null,null,null,null,null,null,"forest","Fuel characteristics",null,"V"]
[null,null,null,null,null,null,null,null,null,null,null,null,"The estimated fire behavior/risk is based on the entered average rainfall and the vegetation type selected above. Greater than 80 inches annual rainfall will always report as \"low\" for fire behavior/risk. As yearly rainfall lowers, site fire behavior/risk increases. Low grass vegetation is always placed in \"low\" fire behavior/risk. For forest stand improvement, the vegetation type selected should match the \"expected\" condition after implimentation of the practice.",null,null,null,null,null,null,null,null,null,null,null,null,"Fire behavior"]
[null,null,null,null,null,null,null,null,null,null,null,null,null,null,null,null,null,null,null,null,null,null,null,null,null,"Treatment complexity"]
[null,null,"Signature for Approval of I&E (must submit inventory work to approver)",null,null,null,null,null,"Approver's JAA",null,"Date"]
[null,null,null,null,null,null,null,null,null,null,null,null,"Cheet sheet for Planned \"Type\" and Job Class selection for \"Fuel Characteristics\" of Fuel Break (383)",null,null,"low grass (<2ft)","high grass (>2ft)","scattered shrubs/ trees & grass","dense shrubs","<select forest type>"]
[null,null,"Signature for Approval of Design",null,null,null,null,null,"Approver's JAA",null,"Date",null,"Fuel Characterization Options ------------------->"]
[null,null,null,null,null,null,null,null,null,null,null,null,"Job Class Selection ---------------------------------->",null,null,"I","II","II","III",{"$f":"IF($T$103=$X$96,$AB$95,IF($T$103=$X$97,$AB$96,IF($T$103=$X$98,$AB$97,\"\")))","v":""}]
[null,null,"Cooperator’s Acknowledgement: (To be completed after practice I&E and Design have been completed.)"]
[null,null,"By signing below, I acknowledge that I: "]
[null,null,"  ● Have reviewed these implementation requirements & have an understanding of its contents & requirements; "]
[null,null,"  ● Will make no changes to these implementation requirements, without prior concurrence of NRCS;"]
[null,null,"  ● Will install, operate, and maintain this practice in accordance with these implementation requirements; and",null,null,null,null,null,null,null,null,null,null,null,null,null,null,null,null,null,null,{"$f":"TRANSPOSE(Y95:Y99)","v":"low grass (<2ft)"},"high grass (>2ft)","scattered shrubs/trees and grass","dense shrubs","forest"]
[null,null,"  ● Will obtain all necessary permits and/or rights, comply with all ordinances and laws, and notify all utilities                     >>pertaining to the installation, operation, and maintenance of this practice."]
[]
[null,null,"Signature",null,null,null,null,null,null,"Date"]
[null,null,"Natural Resources Conservation Service"]
[null,null,"Pacific Islands Conservation Practice Certification Sheet"]
[null,null,{"$f":"IF(C3=0,\"\",C3)","v":"<Select Practice>"}]
[null,null,"Certification Prepared for:",null,null,null,null,null,null,"Date"]
[null,null,"Cooperator Name",{"$f":"IF(D6=0,\"\",D6)","v":""},null,null,"     Business Name",null,null,{"$f":"IF(J6=0,\"\",J6)","v":""}]
[null,null,"Tract Number",{"$f":"IF(D7=0,\"\",D7)","v":""},"Field Number(s)",{"$f":"IF(F7=0,\"\",F7)","v":""},{"$f":"IF(C3=\"Windbreak/Shelterbelt Renovation (650)\",\"Total Length of Windbreaks (ft)\",\"Field Acres\")","v":"Field Acres"},null,{"$f":"IF(I7=0,\"\",I7)","v":""},"Planned Amount",{"$f":"IF(K7=0,\"\",K7)","v":""},{"$f":"IF(L7=\"\",\"\",L7)","v":""},null,null,null,null,null,null,null,null,null,true]
[null,null,null,"Certification Prepared by (Planner Name)",null,null,null,null,null,null,null,null,null,null,null,null,null,null,null,null,null,false]
[null,null,"Resource Problem Identified",null,null,{"$f":"IF(N3=0,\"\",N3)","v":""},null,null,null,null,null,null,null,null,null,null,null,null,null,null,null,"N/A"]
[null,null,"Selected Primary Purpose ",null,null,{"$f":"IF(N7=0,\"\",N7)","v":""}]
[null,null,"Record of Plant Species Controlled/Treated and Field Checkout Notes:"]
[null,null,"CIN #"]
[null,null,"Field"]
[null,null,"Treatment completion date(s)",null,null,null,null,null,null,null,null,"Totals"]
[null,null,"Treated acres",null,null,null,null,null,null,null,null,{"$f":"SUM(E127:K127)","v":0}]
[null,null,"Number of pruned trees",null,null,null,null,null,null,null,null,{"$f":"SUM(E128:K128)","v":0}]
[null,null,"Linear feet treated",null,null,null,null,null,null,null,null,{"$f":"SUM(E129:K129)","v":0}]
[null,null," Any variances to the following terms must be documented and approved by NRCS prior to conducting work."]
[null,null,"1.  Each species designated for control was treated at the required treatment rate."]
[null,null,"2.  The required control rate for each species designated for control was equalled or exceeded."]
[null,null,"3.  Cooperator confirms that herbicide applications followed product label(s) & UH recommendations as\n      specified in the Jobsheet.  If herbicide was used, provide item a) and/or b) below:"]
[null,null,null,"a) Pounds/acre of active ingredient applied for broadcast treatments:"]
[null,null,null,"b) Percent herbicide concentration for individual plant/spot treatments:"]
[null,null,"4.  All other Jobsheet specifications have been followed."]
[null,null,"5.  The practice as installed addresses the identified resource problem for the planned area."]
[null,null,"Checkout notes: Methods applied & techniques used to determine applied units (GPS, tape, count, inventory, etc.): "]
[]
[null,null,"If the above six questions are answered True then the practice should be certified complete."]
[null,null,null,null,null,"Certification Signature",null,null,null,null,"Date"]
[null,null,"Answering any of the above questions False simply means that this practice should not be certified at this time.  In the box below describe what needs to occur before the practice can be certified and review with the Cooperator."]
[]
[]
[]
[]
[]
[]
[]
[]
[]
[]
[]
[]
[]
[]
[]
[]
[]
[]
[]
[]
[]
[]
[]
[]
[]
[]
[]
[]
[null,null,"Forest Stand Improvement (666)","Improve and sustain forest health and productivity.",{"$f":"IF($C$3=C171,TRUE,FALSE)","v":false},{"$f":"IF(E171=TRUE,D171,\" \")","v":" "}]
[null,null,"Forest Stand Improvement (666)","Reduce damage from pests and moisture stress.",false," "]
[null,null,"Forest Stand Improvement (666)","Reduce fire risk and hazard.",false," "]
[null,null,"Forest Stand Improvement (666)","Restore or maintain natural plant communities.",false," "]
[null,null,"Forest Stand Improvement (666)","Improve wildlife and pollinator habitat.",false," "]
[null,null,"Forest Stand Improvement (666)","Alter quantity, quality, and timing of water yield.",false," "]
[null,null,"Forest Stand Improvement (666)","Increase or maintain carbon storage.",false," "]
[null,null,"Fuel Break (383)","Control and reduce the risk of the spread of fire by treating, removing or modifying vegetation, debris and detritus.",{"$f":"IF($C$3=C178,TRUE,FALSE)","v":false},{"$f":"IF(E178=TRUE,D178,\" \")","v":" "}]
[null,null,"Tree/Shrub Pruning (660)","Maintain or improve plant productivity, health and vigor, and/or reduce excessive plant pest pressure.",{"$f":"IF($C$3=C179,TRUE,FALSE)","v":false},{"$f":"IF(E179=TRUE,D179,\" \")","v":" "},null,null,null,null,null,null,"INSUFFICIENT WATER – Inefficient use of irrigation water","WATER QUALITY DEGRADATION – Excess nutrients in surface and ground waters","WATER QUALITY DEGRADATION – Pesticides transported to surface and ground waters","WATER QUALITY DEGRADATION – Excess pathogens and chemicals from manure, bio-solids or compost applications","WATER QUALITY DEGRADATION – Excessive salts in surface and ground waters","WATER QUALITY DEGRADATION – Petroleum, heavy metals and other pollutants transported to receiving waters","WATER QUALITY DEGRADATION – Excessive sediment in surface waters","DEGRADED PLANT CONDITION – Undesirable plant productivity and health","DEGRADED PLANT CONDITION – Inadequate structure and composition","DEGRADED PLANT CONDITION – Excessive plant pest pressure","DEGRADED PLANT CONDITION– Wildfire hazard, excessive biomass accumulation","INADEQUATE HABITAT FOR FISH AND WILDLIFE – Habitat degradation","LIVESTOCK PRODUCTION LIMITATION – Inadequate feed and forage","LIVESTOCK PRODUCTION LIMITATION – Inadequate livestock shelter","LIVESTOCK PRODUCTION LIMITATION – Inadequate livestock water","INEFFICIENT ENERGY USE – Equipment and facilities","INEFFICIENT ENERGY USE – Farming/ranching practices and field operations","AIR QUALITY IMPACTS - Emissions of Particulate Matter (PM) and PM Precursors","AIR QUALITY IMPACTS - Emissions of Greenhouse Gases (GHGs)","AIR QUALITY IMPACTS - Emissions of Ozone Precursors","AIR QUALITY IMPACTS - Objectionable odors"]
[null,null,"Tree/Shrub Pruning (660)","Develop desired plant structure, foliage or branching density, or rooting length.",false,{"$f":"IF(E180=TRUE,D183,\" \")","v":" "}]
[null,null,"Tree/Shrub Pruning (660)","Improve the composition and vigor of understory plants.",{"$f":"IF($C$3=C181,TRUE,FALSE)","v":false},{"$f":"IF(E181=TRUE,D184,\" \")","v":" "}]
[null,null,"Tree/Shrub Pruning (660)","Maintain or improve soil quality and organic matter content.",false," "]
[null,null,"Tree/Shrub Pruning (660)","Reduce wildfire and/or safety hazards.",false," "]
[null,null,"Tree/Shrub Pruning (660)","Reduce energy use during field operations.",false," "]
[null,null,"Tree/Shrub Site Preparation (490)","Encourage natural regeneration of desirable woody plants.",false," "]
[null,null,"Tree/Shrub Site Preparation (490)","Permit artificial establishment of woody plants.",false," "]
[null,null,"Windbreak/Shelterbelt Renovation (650)","Restoring or enhancing the original planned function of existing windbreaks or shelterbelts.",false," "]
[]
[null,null,"The CPPE matrix will be tied to the selected resource concern to see if there is even a problem to be addressed - hold off on this until we have the updated resource concerns fully adopted with their associated CPPE values"]
[null,null,"PracticeName","SOIL EROSION - Sheet, rill, & wind erosion","SOIL EROSION – Concentrated flow erosion","SOIL EROSION– Excessive bank erosion from streams shorelines or water conveyance channels","SOIL QUALITY DEGRADATION - Subsidence","SOIL QUALITY DEGRADATION – Compaction","SOIL QUALITY DEGRADATION – Organic matter depletion","SOIL QUALITY DEGRADATION – Concentration of salts or other chemicals","EXCESS WATER – Ponding, flooding, seasonal high water table, seeps, and drifted snow","INSUFFICIENT WATER – Inefficient moisture management"]
[null,null,"Forest Stand Improvement (666)"]
[null,null,"Fuel Break (383)"]
[null,null,"Tree/Shrub Pruning (660)"]
[null,null,"Tree/Shrub Site Preparation (490)"]
[null,null,"Windbreak/Shelterbelt Renovation (650)"]

{"sheet":"Job Sketch","index":2,"n_rows":40,"n_cols":30,"rows_kept":40,"cut":false,"hidden":false,"merged":[[3,0,3,6],[3,7,3,20],[5,0,5,4],[5,5,5,7],[0,25,0,30],[0,0,0,24],[2,0,2,30],[4,0,4,4],[4,15,4,20],[4,5,4,14],[4,21,4,30],[1,0,1,24],[3,25,3,30],[1,25,1,30],[3,21,3,24],[5,29,5,30],[40,1,44,28],[5,25,5,28],[5,19,5,24],[5,8,5,13],[5,14,5,18],[7,20,8,21],[7,22,8,24],[7,15,8,19],[7,27,8,28],[7,25,8,26],[7,1,8,8]]}
["Natural Resources Conservation Service",null,null,null,null,null,null,null,null,null,null,null,null,null,null,null,null,null,null,null,null,null,null,null,null,"Field Office:"]
["Pacific Islands Conservation Practice Job Sketch",null,null,null,null,null,null,null,null,null,null,null,null,null,null,null,null,null,null,null,null,null,null,null,null,{"$f":"IF('Plant Control IR Template'!K2=\"\",\"\",'Plant Control IR Template'!K2)","v":""}]
[{"$f":"IF('Plant Control IR Template'!C3=\"\",\"\",'Plant Control IR Template'!C3)","v":"<Select Practice>"}]
["Sketch prepared by",null,null,null,null,null,null,{"$f":"IF('Plant Control IR Template'!D8=\"\",\"\",'Plant Control IR Template'!D8)","v":""},null,null,null,null,null,null,null,null,null,null,null,null,null,"Date",null,null,null,{"$f":"IF('Plant Control IR Template'!K5=\"\",\"\",'Plant Control IR Template'!K5)","v":""}]
["Client Name",null,null,null,null,{"$f":"IF('Plant Control IR Template'!D6=\"\",\"\",'Plant Control IR Template'!D6)","v":""},null,null,null,null,null,null,null,null,null,"Business Name",null,null,null,null,null,{"$f":"IF('Plant Control IR Template'!J6=\"\",\"\",'Plant Control IR Template'!J6)","v":""}]
["Tract Number",null,null,null,null,{"$f":"IF('Plant Control IR Template'!D7=\"\",\"\",'Plant Control IR Template'!D7)","v":""},null,null,"Field Number(s)",null,null,null,null,null,{"$f":"IF('Plant Control IR Template'!F7=\"\",\"\",'Plant Control IR Template'!F7)","v":""},null,null,null,null,"Planned Amount",null,null,null,null,null,{"$f":"IF('Plant Control IR Template'!I7=\"\",\"\",'Plant Control IR Template'!K7)","v":""},null,null,null,"acres"]
[]
[null,"Planting arrangment for portion of planned field",null,null,null,null,null,null,null,null,null,null,null,null,null,"Each grid cell  = ",null,null,null,null,null,null,"feet by",null,null,null,null,"feet"]
[]
[]
[]
[]
[]
[]
[]
[]
[]
[]
[]
[]
[]
[]
[]
[]
[]
[]
[]
[]
[]
[]
[]
[]
[]
[]
[]
[]
[]
[]
[]
[null,"Additional Information/Requirements:"]

{"sheet":"Tree Pruning Guidelines","index":3,"n_rows":22,"n_cols":1,"rows_kept":22,"cut":false,"hidden":false,"merged":[[0,0,0,8],[1,0,1,8],[3,0,18,8],[21,0,34,8],[19,0,19,8],[20,0,20,8],[2,0,2,8]]}
["Natural Resources Conservation Service"]
["Pacific Islands Tree Pruning Guidelines"]
["Cut Locations & Techniques"]
["• To find the proper place to cut a branch, look for the branch collar or branch bark ridge.  The collar is the swollen area at the base of the branch and the branch bark ridge is the tissue that separates the branch from the main stem.\n• Make the cuts as close to the collar and branch bark ridge as possible, without damaging them.  Do not leave a stub. Refer to Figure 1.\n• Remove a live branch by cutting from A1 to A2. For crown reduction, make the cut from B1 to B2 on the main stem.  Dead and live branches are removed in the same manner.  Refer to Figure 2.\n• Large branches are removed by eliminating the outer portions first.  Refer to Figure 3.\n• Make a cut 18 inches from the main stem to the underside of the branch.  Then make a cut from the top starting a few inches out from the first cut.  Cut completely through at this point.  Use the same method when cutting the main stem in crown reduction.\n• By cutting in this manner, the possibility of the branch snapping and causing the bark to tear is avoided.  Cut branches smoothly.  Do not tear bark or leave jagged splinters.\n• Do not remove more than 50 percent of the live crown at any pruning.\n• Do not treat pruning wounds with paint or wound dressing, as this will not help prevent decay.\n• Pruning equipment must be clean and sharp."]
[]
[]
[]
[]
[]
[]
[]
[]
[]
[]
[]
[]
[]
[]
[]
[]
["General Pruning Guidelines"]
["• Prune trees immediately after the fruiting/seeding season and/or before the growing season.\n• Prune leaders when they reach the desired length.\n• When pruning to maintain desired crown shape, prune sides & leaders at the same time.\n• For commercially managed timber, the primary objective of pruning is to increase the amount of clear wood product produced to bring a higher market price.  Due to financial considerations:\n   1) Pruning should be limited to trees on highly productive sites and high value tree species;\n   2) Do not prune every tree - depending on species select 50-200 dominant and co-dominant\n        trees per acre or about twice the number needed for final harvest;\n   3) Pre-commercial thin and/or commercial thin first, if needed;\n   4) Prune trees to heights of marketable logs;\n   5) Remove all branches within the area to be pruned, dead or alive, regardless of size;\n   6) It may be advisable to prune in two to three vertical stages, and;\n   7) Consult a qualified Forester for the proper pruning techniques to achieve quality logs that\n        are free of knots and the desired length."]

{"sheet":"Resource Concern List","index":4,"n_rows":48,"n_cols":2,"rows_kept":48,"cut":false,"hidden":true,"merged":[]}
["RCC","Resource Concerns"]
["Soil"," Sheet and rill erosion"]
["Soil"," Wind erosion"]
["Soil"," Ephemeral gully erosion"]
["Soil"," Classic gully erosion"]
["Soil"," Bank erosion from streams, shorelines, or water conveyance channels"]
["Soil"," Subsidence"]
["Soil"," Compaction"]
["Soil"," Organic matter depletion"]
["Soil"," Concentration of salts or other chemicals"]
["Soil"," Soil organism habitat loss or degradation"]
["Soil"," Aggregate instability "]
["Water"," Ponding and flooding"]
["Water"," Seasonal high water table"]
["Water"," Seeps"]
["Water"," Drifted snow"]
["Water"," Surface water depletion"]
["Water"," Ground water depletion"]
["Water"," Naturally available moisture use"]
["Water"," Inefficient irrigation water use"]
["Water"," Nutrients transported to surface water"]
["Water"," Nutrients transported to ground water"]
["Water"," Pesticides transported to surface water"]
["Water"," Pesticides transported to ground water"]
["Water"," Pathogens and chemicals from manure, biosolids, or compost applications transported to surface water"]
["Water"," Pathogens and chemicals from manure, biosolids, or compost applications transported to ground water"]
["Water"," Salts transported to surface water"]
["Water"," Salts transported to ground water"]
["Water"," Petroleum, heavy metals, and other pollutants transported to surface water"]
["Water"," Petroleum, heavy metals, and other pollutants transported to ground water"]
["Water"," Sediment transported to surface water"]
["Water"," Elevated water temperature"]
["Air"," Emissions of particulate matter (PM) and PM precursors"]
["Air"," Emissions of greenhouse gases (GHGs)"]
["Air"," Emissions of ozone precursors"]
["Air"," Objectionable odors"]
["Air"," Emissions of airborne reactive nitrogen"]
["Plants"," Plant productivity and health"]
["Plants"," Plant structure and composition"]
["Plants"," Plant pest pressure"]
["Plants"," Wildfire hazard from biomass accumulation"]
["Animals"," Terrestrial habitat for wildlife and invertebrates"]
["Animals"," Aquatic habitat for fish and other organisms"]
["Animals"," Feed and forage imbalance"]
["Animals"," Inadequate livestock shelter"]
["Animals"," Inadequate livestock water quantity, quality, and distribution"]
["Energy"," Energy efficiency of equipment and facilities"]
["Energy"," Energy efficiency of farming/ranching practices and field operations"]

{"sheet":"Practice Purposes","index":5,"n_rows":17,"n_cols":6,"rows_kept":17,"cut":false,"hidden":true,"merged":[]}
["CPS Code","CPS Name","Purposes",null,{"$f":"'Plant Control IR Template'!C3","v":"<Select Practice>"},"Formula for data validation list lookup below:"]
[383,"Fuel Break (383)","Control and reduce the risk of the spread of fire by treating, removing or modifying vegetation, debris and detritus",null,{"$f":"IFERROR(INDEX($C:$C,SMALL(IF($B$1:INDEX($B:$B,COUNTA($B:$B))=E$1,ROW($B$1:INDEX($B:$B,COUNTA($B:$B))),FALSE),ROW()-ROW($B$2)+1)),\"\")","v":""},"\"='Practice Purposes'!$E$2:INDEX('Practice Purposes'!$E$2:$E$50,COUNTIF('Practice Purposes'!$E$2:$E$50,\"?*\"))\""]
[490,"Tree/Shrub Site Preparation (490)","Encourage natural regeneration of desirable woody plants",null,{"$f":"IFERROR(INDEX($C:$C,SMALL(IF($B$1:INDEX($B:$B,COUNTA($B:$B))=E$1,ROW($B$1:INDEX($B:$B,COUNTA($B:$B))),FALSE),ROW()-ROW($B$2)+1)),\"\")","v":""}]
[490,"Tree/Shrub Site Preparation (490)","Permit artificial establishment of woody plants",null,{"$f":"IFERROR(INDEX($C:$C,SMALL(IF($B$1:INDEX($B:$B,COUNTA($B:$B))=E$1,ROW($B$1:INDEX($B:$B,COUNTA($B:$B))),FALSE),ROW()-ROW($B$2)+1)),\"\")","v":""}]
[660,"Tree/Shrub Pruning (660)","Maintain or improve plant productivity, health and vigor, and/or reduce excessive plant pest pressure",null,{"$f":"IFERROR(INDEX($C:$C,SMALL(IF($B$1:INDEX($B:$B,COUNTA($B:$B))=E$1,ROW($B$1:INDEX($B:$B,COUNTA($B:$B))),FALSE),ROW()-ROW($B$2)+1)),\"\")","v":""}]
[660,"Tree/Shrub Pruning (660)","Develop desired plant structure, foliage or branching density, or rooting length",null,{"$f":"IFERROR(INDEX($C:$C,SMALL(IF($B$1:INDEX($B:$B,COUNTA($B:$B))=E$1,ROW($B$1:INDEX($B:$B,COUNTA($B:$B))),FALSE),ROW()-ROW($B$2)+1)),\"\")","v":""}]
[660,"Tree/Shrub Pruning (660)","Improve the composition and vigor of understory plants",null,{"$f":"IFERROR(INDEX($C:$C,SMALL(IF($B$1:INDEX($B:$B,COUNTA($B:$B))=E$1,ROW($B$1:INDEX($B:$B,COUNTA($B:$B))),FALSE),ROW()-ROW($B$2)+1)),\"\")","v":""}]
[660,"Tree/Shrub Pruning (660)","Maintain or improve soil quality and organic matter content",null,{"$f":"IFERROR(INDEX($C:$C,SMALL(IF($B$1:INDEX($B:$B,COUNTA($B:$B))=E$1,ROW($B$1:INDEX($B:$B,COUNTA($B:$B))),FALSE),ROW()-ROW($B$2)+1)),\"\")","v":""}]
[660,"Tree/Shrub Pruning (660)","Reduce wildfire and/or safety hazards",null,{"$f":"IFERROR(INDEX($C:$C,SMALL(IF($B$1:INDEX($B:$B,COUNTA($B:$B))=E$1,ROW($B$1:INDEX($B:$B,COUNTA($B:$B))),FALSE),ROW()-ROW($B$2)+1)),\"\")","v":""}]
[660,"Tree/Shrub Pruning (660)","Reduce energy use during field operations",null,{"$f":"IFERROR(INDEX($C:$C,SMALL(IF($B$1:INDEX($B:$B,COUNTA($B:$B))=E$1,ROW($B$1:INDEX($B:$B,COUNTA($B:$B))),FALSE),ROW()-ROW($B$2)+1)),\"\")","v":""}]
[666,"Forest Stand Improvement (666)","Improve and sustain forest health and productivity",null,{"$f":"IFERROR(INDEX($C:$C,SMALL(IF($B$1:INDEX($B:$B,COUNTA($B:$B))=E$1,ROW($B$1:INDEX($B:$B,COUNTA($B:$B))),FALSE),ROW()-ROW($B$2)+1)),\"\")","v":""}]
[666,"Forest Stand Improvement (666)","Reduce damage from pests and moisture stress",null,{"$f":"IFERROR(INDEX($C:$C,SMALL(IF($B$1:INDEX($B:$B,COUNTA($B:$B))=E$1,ROW($B$1:INDEX($B:$B,COUNTA($B:$B))),FALSE),ROW()-ROW($B$2)+1)),\"\")","v":""}]
[666,"Forest Stand Improvement (666)","Reduce fire risk and hazard",null,{"$f":"IFERROR(INDEX($C:$C,SMALL(IF($B$1:INDEX($B:$B,COUNTA($B:$B))=E$1,ROW($B$1:INDEX($B:$B,COUNTA($B:$B))),FALSE),ROW()-ROW($B$2)+1)),\"\")","v":""}]
[666,"Forest Stand Improvement (666)","Restore or maintain natural plant communities",null,{"$f":"IFERROR(INDEX($C:$C,SMALL(IF($B$1:INDEX($B:$B,COUNTA($B:$B))=E$1,ROW($B$1:INDEX($B:$B,COUNTA($B:$B))),FALSE),ROW()-ROW($B$2)+1)),\"\")","v":""}]
[666,"Forest Stand Improvement (666)","Improve wildlife and pollinator habitat",null,{"$f":"IFERROR(INDEX($C:$C,SMALL(IF($B$1:INDEX($B:$B,COUNTA($B:$B))=E$1,ROW($B$1:INDEX($B:$B,COUNTA($B:$B))),FALSE),ROW()-ROW($B$2)+1)),\"\")","v":""}]
[666,"Forest Stand Improvement (666)","Alter quantity, quality, and timing of water yield",null,{"$f":"IFERROR(INDEX($C:$C,SMALL(IF($B$1:INDEX($B:$B,COUNTA($B:$B))=E$1,ROW($B$1:INDEX($B:$B,COUNTA($B:$B))),FALSE),ROW()-ROW($B$2)+1)),\"\")","v":""}]
[666,"Forest Stand Improvement (666)","Increase or maintain carbon storage",null,{"$f":"IFERROR(INDEX($C:$C,SMALL(IF($B$1:INDEX($B:$B,COUNTA($B:$B))=E$1,ROW($B$1:INDEX($B:$B,COUNTA($B:$B))),FALSE),ROW()-ROW($B$2)+1)),\"\")","v":""}]

{"sheet":"PIA T&E Plants","index":6,"n_rows":442,"n_cols":12,"rows_kept":442,"cut":false,"hidden":false,"merged":[[0,12,0,14]]}
["Definition","Type","Type2","Taxon Group","Sci Name","Main","NWHI","Marianas","Am Samoa","Remotes","Total","ch Total"]
["Listed Endangered","Terrestrial","Plant","Fern and Fern Ally Species","Adenophorus periens","X",null,null,null,null,6,5]
["Listed Endangered","Terrestrial","Plant","Fern and Fern Ally Species","Asplenium diellaciniatum","X",null,null,null,null,1,0]
["Listed Endangered","Terrestrial","Plant","Fern and Fern Ally Species","Asplenium peruvianum var. insulare","X",null,null,null,null,2,2]
["Listed Endangered","Terrestrial","Plant","Fern and Fern Ally Species","Ctenitis squamigera","X",null,null,null,null,5,4]
["Listed Endangered","Terrestrial","Plant","Fern and Fern Ally Species","Cyclosorus boydiae","X",null,null,null,null,3,0]
["Listed Endangered","Terrestrial","Plant","Fern and Fern Ally Species","Deparia kaalaana","X",null,null,null,null,3,0]
["Listed Endangered","Terrestrial","Plant","Fern and Fern Ally Species","Diellia erecta","X",null,null,null,null,6,5]
["Listed Endangered","Terrestrial","Plant","Fern and Fern Ally Species","Diellia falcata","X",null,null,null,null,1,1]
["Listed Endangered","Terrestrial","Plant","Fern and Fern Ally Species","Diellia mannii","X",null,null,null,null,1,0]
["Listed Endangered","Terrestrial","Plant","Fern and Fern Ally Species","Diellia pallida","X",null,null,null,null,1,1]
["Listed Endangered","Terrestrial","Plant","Fern and Fern Ally Species","Diellia unisora","X",null,null,null,null,1,1]
["Listed Endangered","Terrestrial","Plant","Fern and Fern Ally Species","Diplazium molokaiense","X",null,null,null,null,5,4]
["Listed Endangered","Terrestrial","Plant","Fern and Fern Ally Species","Doryopteris angelica ","X",null,null,null,null,1,0]
["Listed Endangered","Terrestrial","Plant","Fern and Fern Ally Species","Doryopteris takeuchii","X",null,null,null,null,1,1]
["Listed Endangered","Terrestrial","Plant","Fern and Fern Ally Species","Dryopteris crinalis var. podosorus ","X",null,null,null,null,1,0]
["Listed Endangered","Terrestrial","Plant","Fern and Fern Ally Species","Dryopteris glabra var. pusilla","X",null,null,null,null,1,0]
["Listed Endangered","Terrestrial","Plant","Fern and Fern Ally Species","Huperzia mannii","X",null,null,null,null,3,1]
["Listed Endangered","Terrestrial","Plant","Fern and Fern Ally Species","Huperzia nutans","X",null,null,null,null,2,2]
["Listed Endangered","Terrestrial","Plant","Fern and Fern Ally Species","Huperzia stemmermanniae","X",null,null,null,null,2,0]
["Listed Endangered","Terrestrial","Plant","Fern and Fern Ally Species","Hypolepis hawaiiensis var. mauiensis","X",null,null,null,null,1,0]
["Listed Endangered","Terrestrial","Plant","Fern and Fern Ally Species","Marsilea villosa","X",null,null,null,null,3,2]
["Listed Endangered","Terrestrial","Plant","Fern and Fern Ally Species","Microlepia strigosa var. mauiensis","X",null,null,null,null,3,0]
["Listed Endangered","Terrestrial","Plant","Fern and Fern Ally Species","Pteris lidgatei","X",null,null,null,null,3,3]
["Listed Endangered","Terrestrial","Plant","Flowering Plant  Species","Abutilon eremitopetalum ","X",null,null,null,null,1,0]
["Listed Endangered","Terrestrial","Plant","Flowering Plant  Species","Abutilon menziesii ","X",null,null,null,null,4,0]
["Listed Endangered","Terrestrial","Plant","Flowering Plant  Species","Abutilon sandwicense ","X",null,null,null,null,1,1]
["Listed Endangered","Terrestrial","Plant","Flowering Plant  Species","Acaena exigua ","X",null,null,null,null,2,1]
["Listed Endangered","Terrestrial","Plant","Flowering Plant  Species","Achyranthes mutica ","X",null,null,null,null,2,1]
["Listed Endangered","Terrestrial","Plant","Flowering Plant  Species","Achyranthes splendens var. rotundata","X",null,null,null,null,3,1]
["Listed Endangered","Terrestrial","Plant","Flowering Plant  Species","Alectryon macrococcus","X",null,null,null,null,4,4]
["Listed Endangered","Terrestrial","Plant","Flowering Plant  Species","Alsinidendron lychnoides","X",null,null,null,null,1,1]
["Listed Endangered","Terrestrial","Plant","Flowering Plant  Species","Alsinidendron viscosum","X",null,null,null,null,1,1]
["Listed Endangered","Terrestrial","Plant","Flowering Plant  Species","Amaranthus brownii ",null,"X",null,null,null,1,1]
["Listed Endangered","Terrestrial","Plant","Flowering Plant  Species","Argyroxiphium kauense ","X",null,null,null,null,1,1]
["Listed Endangered","Terrestrial","Plant","Flowering Plant  Species","Argyroxiphium sandwicense ssp. sandwicense","X",null,null,null,null,1,0]
["Listed Endangered","Terrestrial","Plant","Flowering Plant  Species","Astelia waialealae ","X",null,null,null,null,1,0]
["Listed Endangered","Terrestrial","Plant","Flowering Plant  Species","Bidens amplectens","X",null,null,null,null,1,1]
["Listed Endangered","Terrestrial","Plant","Flowering Plant  Species","Bidens campylotheca ssp. pentamera","X",null,null,null,null,1,1]
["Listed Endangered","Terrestrial","Plant","Flowering Plant  Species","Bidens campylotheca ssp. waihoiensis","X",null,null,null,null,1,1]
["Listed Endangered","Terrestrial","Plant","Flowering Plant  Species","Bidens conjuncta","X",null,null,null,null,1,1]
["Listed Endangered","Terrestrial","Plant","Flowering Plant  Species","Bidens hillebrandiana ssp. hillebrandiana","X",null,null,null,null,1,0]
["Listed Endangered","Terrestrial","Plant","Flowering Plant  Species","Bidens micrantha ssp. ctenophylla","X",null,null,null,null,1,1]
["Listed Endangered","Terrestrial","Plant","Flowering Plant  Species","Bidens micrantha ssp. kalealaha","X",null,null,null,null,2,1]
["Listed Endangered","Terrestrial","Plant","Flowering Plant  Species","Bidens wiebkei ","X",null,null,null,null,1,1]
["Listed Endangered","Terrestrial","Plant","Flowering Plant  Species","Bonamia menziesii ","X",null,null,null,null,6,5]
["Listed Endangered","Terrestrial","Plant","Flowering Plant  Species","Brighamia insignis ","X",null,null,null,null,2,2]
["Listed Endangered","Terrestrial","Plant","Flowering Plant  Species","Brighamia rockii ","X",null,null,null,null,3,2]
["Listed Endangered","Terrestrial","Plant","Flowering Plant  Species","Calamagrostis expansa","X",null,null,null,null,2,0]
["Listed Endangered","Terrestrial","Plant","Flowering Plant  Species","Calamagrostis hillebrandii","X",null,null,null,null,1,1]
["Listed Endangered","Terrestrial","Plant","Flowering Plant  Species","Canavalia molokaiensis ","X",null,null,null,null,1,1]
["Listed Endangered","Terrestrial","Plant","Flowering Plant  Species","Canavalia napaliensis ","X",null,null,null,null,1,0]
["Listed Endangered","Terrestrial","Plant","Flowering Plant  Species","Canavalia pubescens","X",null,null,null,null,4,1]
["Listed Endangered","Terrestrial","Plant","Flowering Plant  Species","Cenchrus agrimonioides","X","X",null,null,null,7,5]
["Listed Endangered","Terrestrial","Plant","Flowering Plant  Species","Chamaesyce celastroides var. kaenana","X",null,null,null,null,1,1]
["Listed Endangered","Terrestrial","Plant","Flowering Plant  Species","Chamaesyce deppeana","X",null,null,null,null,1,1]
["Listed Endangered","Terrestrial","Plant","Flowering Plant  Species","Chamaesyce eleanoriae","X",null,null,null,null,1,0]
["Listed Endangered","Terrestrial","Plant","Flowering Plant  Species","Chamaesyce halemanui","X",null,null,null,null,1,1]
["Listed Endangered","Terrestrial","Plant","Flowering Plant  Species","Chamaesyce herbstii","X",null,null,null,null,1,1]
["Listed Endangered","Terrestrial","Plant","Flowering Plant  Species","Chamaesyce kuwaleana","X",null,null,null,null,1,1]
["Listed Endangered","Terrestrial","Plant","Flowering Plant  Species","Chamaesyce remyi var. kauaiensis","X",null,null,null,null,1,0]
["Listed Endangered","Terrestrial","Plant","Flowering Plant  Species","Chamaesyce remyi var. remyi","X",null,null,null,null,1,0]
["Listed Endangered","Terrestrial","Plant","Flowering Plant  Species","Chamaesyce rockii","X",null,null,null,null,1,1]
["Listed Endangered","Terrestrial","Plant","Flowering Plant  Species","Chamaesyce skottsbergii var. skottsbergii","X",null,null,null,null,1,1]
["Listed Endangered","Terrestrial","Plant","Flowering Plant  Species","Charpentiera densiflora ","X",null,null,null,null,1,0]
["Listed Endangered","Terrestrial","Plant","Flowering Plant  Species","Clermontia drepanomorpha ","X",null,null,null,null,1,1]
["Listed Endangered","Terrestrial","Plant","Flowering Plant  Species","Clermontia lindseyana","X",null,null,null,null,2,2]
["Listed Endangered","Terrestrial","Plant","Flowering Plant  Species","Clermontia oblongiflora ssp. brevipes","X",null,null,null,null,1,1]
["Listed Endangered","Terrestrial","Plant","Flowering Plant  Species","Clermontia oblongiflora ssp. mauiensis","X",null,null,null,null,2,1]
["Listed Endangered","Terrestrial","Plant","Flowering Plant  Species","Clermontia peleana","X",null,null,null,null,2,2]
["Listed Endangered","Terrestrial","Plant","Flowering Plant  Species","Clermontia pyrularia ","X",null,null,null,null,1,1]
["Listed Endangered","Terrestrial","Plant","Flowering Plant  Species","Clermontia samuelii","X",null,null,null,null,1,1]
["Listed Endangered","Terrestrial","Plant","Flowering Plant  Species","Colubrina oppositifolia ","X",null,null,null,null,3,3]
["Listed Endangered","Terrestrial","Plant","Flowering Plant  Species","Cyanea acuminata ","X",null,null,null,null,1,1]
["Listed Endangered","Terrestrial","Plant","Flowering Plant  Species","Cyanea asarifolia ","X",null,null,null,null,1,1]
["Listed Endangered","Terrestrial","Plant","Flowering Plant  Species","Cyanea asplenifolia","X",null,null,null,null,1,1]
["Listed Endangered","Terrestrial","Plant","Flowering Plant  Species","Cyanea calycina","X",null,null,null,null,1,1]
["Listed Endangered","Terrestrial","Plant","Flowering Plant  Species","Cyanea copelandii ssp. copelandii","X",null,null,null,null,1,0]
["Listed Endangered","Terrestrial","Plant","Flowering Plant  Species","Cyanea copelandii ssp. haleakalaensis","X",null,null,null,null,1,1]
["Listed Endangered","Terrestrial","Plant","Flowering Plant  Species","Cyanea crispa","X",null,null,null,null,1,1]
["Listed Endangered","Terrestrial","Plant","Flowering Plant  Species","Cyanea dolichopoda ","X",null,null,null,null,1,0]
["Listed Endangered","Terrestrial","Plant","Flowering Plant  Species","Cyanea dunbariae","X",null,null,null,null,1,1]
["Listed Endangered","Terrestrial","Plant","Flowering Plant  Species","Cyanea duvalliorum","X",null,null,null,null,1,1]
["Listed Endangered","Terrestrial","Plant","Flowering Plant  Species","Cyanea eleeleensis ","X",null,null,null,null,1,0]
["Listed Endangered","Terrestrial","Plant","Flowering Plant  Species","Cyanea glabra ","X",null,null,null,null,1,1]
["Listed Endangered","Terrestrial","Plant","Flowering Plant  Species","Cyanea grimesiana ssp. grimesiana","X",null,null,null,null,2,2]
["Listed Endangered","Terrestrial","Plant","Flowering Plant  Species","Cyanea grimesiana ssp. obatae","X",null,null,null,null,1,1]
["Listed Endangered","Terrestrial","Plant","Flowering Plant  Species","Cyanea hamatiflora ssp. carlsonii","X",null,null,null,null,1,1]
["Listed Endangered","Terrestrial","Plant","Flowering Plant  Species","Cyanea hamatiflora ssp. hamatiflora","X",null,null,null,null,1,1]
["Listed Endangered","Terrestrial","Plant","Flowering Plant  Species","Cyanea horrida","X",null,null,null,null,1,1]
["Listed Endangered","Terrestrial","Plant","Flowering Plant  Species","Cyanea humboldtiana ","X",null,null,null,null,1,1]
["Listed Endangered","Terrestrial","Plant","Flowering Plant  Species","Cyanea kauaulaensis","X",null,null,null,null,1,0]
["Listed Endangered","Terrestrial","Plant","Flowering Plant  Species","Cyanea kolekoleensis ","X",null,null,null,null,1,0]
["Listed Endangered","Terrestrial","Plant","Flowering Plant  Species","Cyanea koolauensis ","X",null,null,null,null,1,1]
["Listed Endangered","Terrestrial","Plant","Flowering Plant  Species","Cyanea kuhihewa ","X",null,null,null,null,1,0]
["Listed Endangered","Terrestrial","Plant","Flowering Plant  Species","Cyanea kunthiana","X",null,null,null,null,1,1]
["Listed Endangered","Terrestrial","Plant","Flowering Plant  Species","Cyanea lanceolata","X",null,null,null,null,1,1]
["Listed Endangered","Terrestrial","Plant","Flowering Plant  Species","Cyanea lobata","X",null,null,null,null,2,1]
["Listed Endangered","Terrestrial","Plant","Flowering Plant  Species","Cyanea longiflora ","X",null,null,null,null,1,1]
["Listed Endangered","Terrestrial","Plant","Flowering Plant  Species","Cyanea macrostegia ssp. gibsonii","X",null,null,null,null,1,0]
["Listed Endangered","Terrestrial","Plant","Flowering Plant  Species","Cyanea magnicalyx","X",null,null,null,null,1,1]
["Listed Endangered","Terrestrial","Plant","Flowering Plant  Species","Cyanea mannii ","X",null,null,null,null,1,1]
["Listed Endangered","Terrestrial","Plant","Flowering Plant  Species","Cyanea maritae","X",null,null,null,null,1,1]
["Listed Endangered","Terrestrial","Plant","Flowering Plant  Species","Cyanea marksii","X",null,null,null,null,1,0]
["Listed Endangered","Terrestrial","Plant","Flowering Plant  Species","Cyanea mauiensis","X",null,null,null,null,1,0]
["Listed Endangered","Terrestrial","Plant","Flowering Plant  Species","Cyanea mceldowneyi ","X",null,null,null,null,1,1]
["Listed Endangered","Terrestrial","Plant","Flowering Plant  Species","Cyanea munroi","X",null,null,null,null,2,1]
["Listed Endangered","Terrestrial","Plant","Flowering Plant  Species","Cyanea obtusa","X",null,null,null,null,1,1]
["Listed Endangered","Terrestrial","Plant","Flowering Plant  Species","Cyanea pinnatifida ","X",null,null,null,null,1,1]
["Listed Endangered","Terrestrial","Plant","Flowering Plant  Species","Cyanea platyphylla ","X",null,null,null,null,1,1]
["Listed Endangered","Terrestrial","Plant","Flowering Plant  Species","Cyanea procera ","X",null,null,null,null,1,1]
["Listed Endangered","Terrestrial","Plant","Flowering Plant  Species","Cyanea profuga","X",null,null,null,null,1,1]
["Listed Endangered","Terrestrial","Plant","Flowering Plant  Species","Cyanea purpurellifolia","X",null,null,null,null,1,1]
["Listed Endangered","Terrestrial","Plant","Flowering Plant  Species","Cyanea remyi ","X",null,null,null,null,1,1]
["Listed Endangered","Terrestrial","Plant","Flowering Plant  Species","Cyanea shipmanii ","X",null,null,null,null,1,1]
["Listed Endangered","Terrestrial","Plant","Flowering Plant  Species","Cyanea solanacea","X",null,null,null,null,2,1]
["Listed Endangered","Terrestrial","Plant","Flowering Plant  Species","Cyanea st.-johnii ","X",null,null,null,null,1,1]
["Listed Endangered","Terrestrial","Plant","Flowering Plant  Species","Cyanea stictophylla ","X",null,null,null,null,1,1]
["Listed Endangered","Terrestrial","Plant","Flowering Plant  Species","Cyanea superba","X",null,null,null,null,1,1]
["Listed Endangered","Terrestrial","Plant","Flowering Plant  Species","Cyanea tritomantha","X",null,null,null,null,1,0]
["Listed Endangered","Terrestrial","Plant","Flowering Plant  Species","Cyanea truncata ","X",null,null,null,null,1,1]
["Listed Endangered","Terrestrial","Plant","Flowering Plant  Species","Cyanea undulata ","X",null,null,null,null,1,1]
["Listed Endangered","Terrestrial","Plant","Flowering Plant  Species","Cyperus fauriei","X",null,null,null,null,3,2]
["Listed Endangered","Terrestrial","Plant","Flowering Plant  Species","Cyperus neokunthianus","X",null,null,null,null,1,0]
["Listed Endangered","Terrestrial","Plant","Flowering Plant  Species","Cyperus pennatiformis","X","X",null,null,null,5,4]
["Listed Endangered","Terrestrial","Plant","Flowering Plant  Species","Cyperus trachysanthos ","X",null,null,null,null,5,3]
["Listed Endangered","Terrestrial","Plant","Flowering Plant  Species","Cyrtandra crenata ","X",null,null,null,null,1,0]
["Listed Endangered","Terrestrial","Plant","Flowering Plant  Species","Cyrtandra cyaneoides ","X",null,null,null,null,1,1]
["Listed Endangered","Terrestrial","Plant","Flowering Plant  Species","Cyrtandra dentata ","X",null,null,null,null,1,1]
["Listed Endangered","Terrestrial","Plant","Flowering Plant  Species","Cyrtandra ferripilosa","X",null,null,null,null,1,1]
["Listed Endangered","Terrestrial","Plant","Flowering Plant  Species","Cyrtandra filipes","X",null,null,null,null,2,2]
["Listed Endangered","Terrestrial","Plant","Flowering Plant  Species","Cyrtandra giffardii ","X",null,null,null,null,1,1]
["Listed Endangered","Terrestrial","Plant","Flowering Plant  Species","Cyrtandra gracilis","X",null,null,null,null,1,1]
["Listed Endangered","Terrestrial","Plant","Flowering Plant  Species","Cyrtandra hematos","X",null,null,null,null,1,0]
["Listed Endangered","Terrestrial","Plant","Flowering Plant  Species","Cyrtandra kaulantha","X",null,null,null,null,1,1]
["Listed Endangered","Terrestrial","Plant","Flowering Plant  Species","Cyrtandra munroi ","X",null,null,null,null,2,1]
["Listed Endangered","Terrestrial","Plant","Flowering Plant  Species","Cyrtandra nanawaleensis","X",null,null,null,null,1,0]
["Listed Endangered","Terrestrial","Plant","Flowering Plant  Species","Cyrtandra oenobarba ","X",null,null,null,null,1,0]
["Listed Endangered","Terrestrial","Plant","Flowering Plant  Species","Cyrtandra oxybapha","X",null,null,null,null,1,1]
["Listed Endangered","Terrestrial","Plant","Flowering Plant  Species","Cyrtandra paliku ","X",null,null,null,null,1,0]
["Listed Endangered","Terrestrial","Plant","Flowering Plant  Species","Cyrtandra polyantha ","X",null,null,null,null,1,1]
["Listed Endangered","Terrestrial","Plant","Flowering Plant  Species","Cyrtandra sessilis","X",null,null,null,null,1,1]
["Listed Endangered","Terrestrial","Plant","Flowering Plant  Species","Cyrtandra subumbellata ","X",null,null,null,null,1,1]
["Listed Endangered","Terrestrial","Plant","Flowering Plant  Species","Cyrtandra tintinnabula ","X",null,null,null,null,1,1]
["Listed Endangered","Terrestrial","Plant","Flowering Plant  Species","Cyrtandra viridiflora ","X",null,null,null,null,1,1]
["Listed Endangered","Terrestrial","Plant","Flowering Plant  Species","Cyrtandra wagneri","X",null,null,null,null,1,0]
["Listed Endangered","Terrestrial","Plant","Flowering Plant  Species","Cyrtandra waiolani","X",null,null,null,null,1,1]
["Listed Endangered","Terrestrial","Plant","Flowering Plant  Species","Delissea rhytidosperma ","X",null,null,null,null,1,1]
["Listed Endangered","Terrestrial","Plant","Flowering Plant  Species","Delissea rivularis","X",null,null,null,null,1,1]
["Listed Endangered","Terrestrial","Plant","Flowering Plant  Species","Delissea subcordata","X",null,null,null,null,1,1]
["Listed Endangered","Terrestrial","Plant","Flowering Plant  Species","Delissea undulata","X",null,null,null,null,1,1]
["Listed Endangered","Terrestrial","Plant","Flowering Plant  Species","Dubautia herbstobatae ","X",null,null,null,null,1,1]
["Listed Endangered","Terrestrial","Plant","Flowering Plant  Species","Dubautia imbricata ssp. imbricata","X",null,null,null,null,1,0]
["Listed Endangered","Terrestrial","Plant","Flowering Plant  Species","Dubautia kalalauensis ","X",null,null,null,null,1,0]
["Listed Endangered","Terrestrial","Plant","Flowering Plant  Species","Dubautia kenwoodii ","X",null,null,null,null,1,0]
["Listed Endangered","Terrestrial","Plant","Flowering Plant  Species","Dubautia latifolia ","X",null,null,null,null,1,1]
["Listed Endangered","Terrestrial","Plant","Flowering Plant  Species","Dubautia pauciflorula ","X",null,null,null,null,1,1]
["Listed Endangered","Terrestrial","Plant","Flowering Plant  Species","Dubautia plantaginea ssp. humilis","X",null,null,null,null,1,1]
["Listed Endangered","Terrestrial","Plant","Flowering Plant  Species","Dubautia plantaginea ssp. magnifolia","X",null,null,null,null,1,0]
["Listed Endangered","Terrestrial","Plant","Flowering Plant  Species","Dubautia waialealae ","X",null,null,null,null,1,0]
["Listed Endangered","Terrestrial","Plant","Flowering Plant  Species","Eragrostis fosbergii ","X",null,null,null,null,1,1]
["Listed Endangered","Terrestrial","Plant","Flowering Plant  Species","Eugenia bryanii",null,null,"X",null,null,1,0]
["Listed Endangered","Terrestrial","Plant","Flowering Plant  Species","Eugenia koolauensis ","X",null,null,null,null,2,2]
["Listed Endangered","Terrestrial","Plant","Flowering Plant  Species","Euphorbia haeleeleana ","X",null,null,null,null,2,2]
["Listed Endangered","Terrestrial","Plant","Flowering Plant  Species","Exocarpos luteolus ","X",null,null,null,null,1,1]
["Listed Endangered","Terrestrial","Plant","Flowering Plant  Species","Exocarpos menziesii","X",null,null,null,null,2,0]
["Listed Endangered","Terrestrial","Plant","Flowering Plant  Species","Festuca hawaiiensis","X",null,null,null,null,2,0]
["Listed Endangered","Terrestrial","Plant","Flowering Plant  Species","Festuca molokaienesis","X",null,null,null,null,1,1]
["Listed Endangered","Terrestrial","Plant","Flowering Plant  Species","Flueggea neowawraea ","X",null,null,null,null,5,5]
["Listed Endangered","Terrestrial","Plant","Flowering Plant  Species","Gardenia brighamii ","X",null,null,null,null,5,0]
["Listed Endangered","Terrestrial","Plant","Flowering Plant  Species","Gardenia mannii ","X",null,null,null,null,1,1]
["Listed Endangered","Terrestrial","Plant","Flowering Plant  Species","Gardenia remyi","X",null,null,null,null,4,0]
["Listed Endangered","Terrestrial","Plant","Flowering Plant  Species","Geranium arboreum ","X",null,null,null,null,1,1]
["Listed Endangered","Terrestrial","Plant","Flowering Plant  Species","Geranium hanaense","X",null,null,null,null,1,1]
["Listed Endangered","Terrestrial","Plant","Flowering Plant  Species","Geranium hillebrandii","X",null,null,null,null,1,1]
["Listed Endangered","Terrestrial","Plant","Flowering Plant  Species","Geranium kauaiense ","X",null,null,null,null,1,0]
["Listed Endangered","Terrestrial","Plant","Flowering Plant  Species","Geranium multiflorum ","X",null,null,null,null,1,1]
["Listed Endangered","Terrestrial","Plant","Flowering Plant  Species","Gouania hillebrandii ","X",null,null,null,null,4,3]
["Listed Endangered","Terrestrial","Plant","Flowering Plant  Species","Gouania meyenii ","X",null,null,null,null,2,2]
["Listed Endangered","Terrestrial","Plant","Flowering Plant  Species","Gouania vitifolia ","X",null,null,null,null,3,3]
["Listed Endangered","Terrestrial","Plant","Flowering Plant  Species","Haplostachys haplostachya var. angustifolia","X",null,null,null,null,3,0]
["Listed Endangered","Terrestrial","Plant","Flowering Plant  Species","Hedyotis megalantha",null,null,"X",null,null,1,0]
["Listed Endangered","Terrestrial","Plant","Flowering Plant  Species","Hedyotis schlechtendahliana var. remyi","X",null,null,null,null,1,0]
["Listed Endangered","Terrestrial","Plant","Flowering Plant  Species","Heritiera longipetiolata",null,null,"X",null,null,4,0]
["Listed Endangered","Terrestrial","Plant","Flowering Plant  Species","Hesperomannia arborescens ","X",null,null,null,null,4,3]
["Listed Endangered","Terrestrial","Plant","Flowering Plant  Species","Hesperomannia arbuscula ","X",null,null,null,null,2,2]
["Listed Endangered","Terrestrial","Plant","Flowering Plant  Species","Hesperomannia lydgatei ","X",null,null,null,null,1,1]
["Listed Endangered","Terrestrial","Plant","Flowering Plant  Species","Hibiscadelphus distans ","X",null,null,null,null,1,0]
["Listed Endangered","Terrestrial","Plant","Flowering Plant  Species","Hibiscadelphus giffardianus ","X",null,null,null,null,1,1]
["Listed Endangered","Terrestrial","Plant","Flowering Plant  Species","Hibiscadelphus hualalaiensis ","X",null,null,null,null,1,1]
["Listed Endangered","Terrestrial","Plant","Flowering Plant  Species","Hibiscadelphus woodii ","X",null,null,null,null,1,1]
["Listed Endangered","Terrestrial","Plant","Flowering Plant  Species","Hibiscus arnottianus ssp. immaculatus","X",null,null,null,null,1,1]
["Listed Endangered","Terrestrial","Plant","Flowering Plant  Species","Hibiscus brackenridgei","X",null,null,null,null,7,5]
["Listed Endangered","Terrestrial","Plant","Flowering Plant  Species","Hibiscus waimeae ssp. hannerae","X",null,null,null,null,1,1]
["Listed Endangered","Terrestrial","Plant","Flowering Plant  Species","Ischaemum byrone ","X",null,null,null,null,5,4]
["Listed Endangered","Terrestrial","Plant","Flowering Plant  Species","Isodendrion hosakae ","X",null,null,null,null,1,1]
["Listed Endangered","Terrestrial","Plant","Flowering Plant  Species","Isodendrion laurifolium ","X",null,null,null,null,2,2]
["Listed Endangered","Terrestrial","Plant","Flowering Plant  Species","Isodendrion pyrifolium ","X",null,null,null,null,6,4]
["Listed Endangered","Terrestrial","Plant","Flowering Plant  Species","Joinvillea ascendens ssp. ascendens","X",null,null,null,null,5,0]
["Listed Endangered","Terrestrial","Plant","Flowering Plant  Species","Kadua cookiana","X",null,null,null,null,2,0]
["Listed Endangered","Terrestrial","Plant","Flowering Plant  Species","Kadua coriacea","X",null,null,null,null,3,2]
["Listed Endangered","Terrestrial","Plant","Flowering Plant  Species","Kadua degeneri","X",null,null,null,null,1,1]
["Listed Endangered","Terrestrial","Plant","Flowering Plant  Species","Kadua fluviatilis","X",null,null,null,null,2,0]
["Listed Endangered","Terrestrial","Plant","Flowering Plant  Species","Kadua haupuensis","X",null,null,null,null,1,0]
["Listed Endangered","Terrestrial","Plant","Flowering Plant  Species","Kadua laxiflora","X",null,null,null,null,3,2]
["Listed Endangered","Terrestrial","Plant","Flowering Plant  Species","Kadua parvula","X",null,null,null,null,1,1]
["Listed Endangered","Terrestrial","Plant","Flowering Plant  Species","Kadua st.-johnii","X",null,null,null,null,1,1]
["Listed Endangered","Terrestrial","Plant","Flowering Plant  Species","Kanaloa kahoolawensis ","X",null,null,null,null,1,1]
["Listed Endangered","Terrestrial","Plant","Flowering Plant  Species","Keysseria erici ","X",null,null,null,null,1,0]
["Listed Endangered","Terrestrial","Plant","Flowering Plant  Species","Keysseria helenae ","X",null,null,null,null,1,0]
["Listed Endangered","Terrestrial","Plant","Flowering Plant  Species","Kokia cookei ","X",null,null,null,null,1,1]
["Listed Endangered","Terrestrial","Plant","Flowering Plant  Species","Kokia drynarioides ","X",null,null,null,null,1,1]
["Listed Endangered","Terrestrial","Plant","Flowering Plant  Species","Kokia kauaiensis ","X",null,null,null,null,1,1]
["Listed Endangered","Terrestrial","Plant","Flowering Plant  Species","Korthalsella degeneri","X",null,null,null,null,1,1]
["Listed Endangered","Terrestrial","Plant","Flowering Plant  Species","Labordia cyrtandrae ","X",null,null,null,null,1,0]
["Listed Endangered","Terrestrial","Plant","Flowering Plant  Species","Labordia helleri ","X",null,null,null,null,1,0]
["Listed Endangered","Terrestrial","Plant","Flowering Plant  Species","Labordia lorenciana","X",null,null,null,null,1,0]
["Listed Endangered","Terrestrial","Plant","Flowering Plant  Species","Labordia lydgatei ","X",null,null,null,null,1,1]
["Listed Endangered","Terrestrial","Plant","Flowering Plant  Species","Labordia pumila ","X",null,null,null,null,1,0]
["Listed Endangered","Terrestrial","Plant","Flowering Plant  Species","Labordia tinifolia var. lanaiensis","X",null,null,null,null,1,0]
["Listed Endangered","Terrestrial","Plant","Flowering Plant  Species","Labordia tinifolia var. wahiawaensis ","X",null,null,null,null,1,1]
["Listed Endangered","Terrestrial","Plant","Flowering Plant  Species","Labordia triflora ","X",null,null,null,null,1,1]
["Listed Endangered","Terrestrial","Plant","Flowering Plant  Species","Lepidium arbuscula ","X",null,null,null,null,1,1]
["Listed Endangered","Terrestrial","Plant","Flowering Plant  Species","Lepidium orbiculare","X",null,null,null,null,1,0]
["Listed Endangered","Terrestrial","Plant","Flowering Plant  Species","Lipochaeta fauriei","X",null,null,null,null,1,1]
["Listed Endangered","Terrestrial","Plant","Flowering Plant  Species","Lipochaeta lobata ssp. leptophylla","X",null,null,null,null,1,1]
["Listed Endangered","Terrestrial","Plant","Flowering Plant  Species","Lipochaeta micrantha","X",null,null,null,null,1,1]
["Listed Endangered","Terrestrial","Plant","Flowering Plant  Species","Lipochaeta venosa","X",null,null,null,null,1,0]
["Listed Endangered","Terrestrial","Plant","Flowering Plant  Species","Lipochaeta waimeaensis","X",null,null,null,null,2,1]
["Listed Endangered","Terrestrial","Plant","Flowering Plant  Species","Lobelia gaudichaudii ssp. koolauensis","X",null,null,null,null,1,1]
["Listed Endangered","Terrestrial","Plant","Flowering Plant  Species","Lobelia monostachya ","X",null,null,null,null,1,1]
["Listed Endangered","Terrestrial","Plant","Flowering Plant  Species","Lobelia niihauensis ","X",null,null,null,null,3,2]
["Listed Endangered","Terrestrial","Plant","Flowering Plant  Species","Lobelia oahuensis ","X",null,null,null,null,1,1]
["Listed Endangered","Terrestrial","Plant","Flowering Plant  Species","Lysimachia daphnoides ","X",null,null,null,null,1,0]
["Listed Endangered","Terrestrial","Plant","Flowering Plant  Species","Lysimachia filifolia ","X",null,null,null,null,2,2]
["Listed Endangered","Terrestrial","Plant","Flowering Plant  Species","Lysimachia iniki ","X",null,null,null,null,1,0]
["Listed Endangered","Terrestrial","Plant","Flowering Plant  Species","Lysimachia lydgatei ","X",null,null,null,null,1,1]
["Listed Endangered","Terrestrial","Plant","Flowering Plant  Species","Lysimachia maxima ","X",null,null,null,null,1,1]
["Listed Endangered","Terrestrial","Plant","Flowering Plant  Species","Lysimachia pendens ","X",null,null,null,null,1,0]
["Listed Endangered","Terrestrial","Plant","Flowering Plant  Species","Lysimachia scopulensis ","X",null,null,null,null,1,0]
["Listed Endangered","Terrestrial","Plant","Flowering Plant  Species","Lysimachia venosa ","X",null,null,null,null,1,0]
["Listed Endangered","Terrestrial","Plant","Flowering Plant  Species","Melanthera kamolensis","X",null,null,null,null,1,1]
["Listed Endangered","Terrestrial","Plant","Flowering Plant  Species","Melanthera tenuifolia","X",null,null,null,null,1,1]
["Listed Endangered","Terrestrial","Plant","Flowering Plant  Species","Melicope adscendens ","X",null,null,null,null,1,1]
["Listed Endangered","Terrestrial","Plant","Flowering Plant  Species","Melicope balloui ","X",null,null,null,null,1,1]
["Listed Endangered","Terrestrial","Plant","Flowering Plant  Species","Melicope christophersenii","X",null,null,null,null,1,1]
["Listed Endangered","Terrestrial","Plant","Flowering Plant  Species","Melicope degeneri ","X",null,null,null,null,1,0]
["Listed Endangered","Terrestrial","Plant","Flowering Plant  Species","Melicope haupuensis ","X",null,null,null,null,1,1]
["Listed Endangered","Terrestrial","Plant","Flowering Plant  Species","Melicope hiiakae","X",null,null,null,null,1,1]
["Listed Endangered","Terrestrial","Plant","Flowering Plant  Species","Melicope knudsenii ","X",null,null,null,null,2,2]
["Listed Endangered","Terrestrial","Plant","Flowering Plant  Species","Melicope lydgatei ","X",null,null,null,null,1,1]
["Listed Endangered","Terrestrial","Plant","Flowering Plant  Species","Melicope makahae","X",null,null,null,null,1,1]
["Listed Endangered","Terrestrial","Plant","Flowering Plant  Species","Melicope mucronulata ","X",null,null,null,null,2,2]
["Listed Endangered","Terrestrial","Plant","Flowering Plant  Species","Melicope munroi ","X",null,null,null,null,2,1]
["Listed Endangered","Terrestrial","Plant","Flowering Plant  Species","Melicope ovalis ","X",null,null,null,null,1,1]
["Listed Endangered","Terrestrial","Plant","Flowering Plant  Species","Melicope pallida ","X",null,null,null,null,2,2]
["Listed Endangered","Terrestrial","Plant","Flowering Plant  Species","Melicope paniculata ","X",null,null,null,null,1,0]
["Listed Endangered","Terrestrial","Plant","Flowering Plant  Species","Melicope puberula ","X",null,null,null,null,1,0]
["Listed Endangered","Terrestrial","Plant","Flowering Plant  Species","Melicope quadrangularis ","X",null,null,null,null,1,0]
["Listed Endangered","Terrestrial","Plant","Flowering Plant  Species","Melicope reflexa ","X",null,null,null,null,1,1]
["Listed Endangered","Terrestrial","Plant","Flowering Plant  Species","Melicope saint-johnii ","X",null,null,null,null,1,1]
["Listed Endangered","Terrestrial","Plant","Flowering Plant  Species","Melicope zahlbruckneri ","X",null,null,null,null,1,1]
["Listed Endangered","Terrestrial","Plant","Flowering Plant  Species","Mezoneuron kavaiensis","X",null,null,null,null,5,1]
["Listed Endangered","Terrestrial","Plant","Flowering Plant  Species","Mucuna sloanei var. persericea","X",null,null,null,null,1,1]
["Listed Endangered","Terrestrial","Plant","Flowering Plant  Species","Munroidendron racemosum","X",null,null,null,null,1,1]
["Listed Endangered","Terrestrial","Plant","Flowering Plant  Species","Myrsine fosbergii","X",null,null,null,null,2,0]
["Listed Endangered","Terrestrial","Plant","Flowering Plant  Species","Myrsine juddii ","X",null,null,null,null,1,1]
["Listed Endangered","Terrestrial","Plant","Flowering Plant  Species","Myrsine knudsenii ","X",null,null,null,null,1,0]
["Listed Endangered","Terrestrial","Plant","Flowering Plant  Species","Myrsine mezii ","X",null,null,null,null,1,0]
["Listed Endangered","Terrestrial","Plant","Flowering Plant  Species","Myrsine vaccinioides","X",null,null,null,null,1,1]
["Listed Endangered","Terrestrial","Plant","Flowering Plant  Species","Neraudia angulata","X",null,null,null,null,1,1]
["Listed Endangered","Terrestrial","Plant","Flowering Plant  Species","Neraudia ovata ","X",null,null,null,null,1,1]
["Listed Endangered","Terrestrial","Plant","Flowering Plant  Species","Neraudia sericea ","X",null,null,null,null,4,3]
["Listed Endangered","Terrestrial","Plant","Flowering Plant  Species","Nesogenes rotensis ",null,null,"X",null,null,1,1]
["Listed Endangered","Terrestrial","Plant","Flowering Plant  Species","Nothocestrum breviflorum ","X",null,null,null,null,1,1]
["Listed Endangered","Terrestrial","Plant","Flowering Plant  Species","Nothocestrum latifolium","X",null,null,null,null,5,0]
["Listed Endangered","Terrestrial","Plant","Flowering Plant  Species","Nothocestrum peltatum ","X",null,null,null,null,1,1]
["Listed Endangered","Terrestrial","Plant","Flowering Plant  Species","Nototrichium humile ","X",null,null,null,null,2,2]
["Listed Endangered","Terrestrial","Plant","Flowering Plant  Species","Ochrosia haleakalae","X",null,null,null,null,2,0]
["Listed Endangered","Terrestrial","Plant","Flowering Plant  Species","Ochrosia kilaueaensis ","X",null,null,null,null,1,0]
["Listed Endangered","Terrestrial","Plant","Flowering Plant  Species","Osmoxylon mariannense ",null,null,"X",null,null,1,1]
["Listed Endangered","Terrestrial","Plant","Flowering Plant  Species","Panicum carteri","X",null,null,null,null,4,1]
["Listed Endangered","Terrestrial","Plant","Flowering Plant  Species","Panicum niihauense ","X",null,null,null,null,2,1]
["Listed Endangered","Terrestrial","Plant","Flowering Plant  Species","Peperomia subpetiolata","X",null,null,null,null,1,1]
["Listed Endangered","Terrestrial","Plant","Flowering Plant  Species","Phyllanthus saffordii",null,null,"X",null,null,1,0]
["Listed Endangered","Terrestrial","Plant","Flowering Plant  Species","Phyllostegia bracteata","X",null,null,null,null,1,1]
["Listed Endangered","Terrestrial","Plant","Flowering Plant  Species","Phyllostegia brevidens","X",null,null,null,null,2,0]
["Listed Endangered","Terrestrial","Plant","Flowering Plant  Species","Phyllostegia floribunda","X",null,null,null,null,1,0]
["Listed Endangered","Terrestrial","Plant","Flowering Plant  Species","Phyllostegia glabra var. lanaiensis ","X",null,null,null,null,1,0]
["Listed Endangered","Terrestrial","Plant","Flowering Plant  Species","Phyllostegia haliakalae","X",null,null,null,null,3,2]
["Listed Endangered","Terrestrial","Plant","Flowering Plant  Species","Phyllostegia helleri","X",null,null,null,null,1,0]
["Listed Endangered","Terrestrial","Plant","Flowering Plant  Species","Phyllostegia hirsuta ","X",null,null,null,null,1,1]
["Listed Endangered","Terrestrial","Plant","Flowering Plant  Species","Phyllostegia hispida ","X",null,null,null,null,1,1]
["Listed Endangered","Terrestrial","Plant","Flowering Plant  Species","Phyllostegia kaalaensis ","X",null,null,null,null,1,1]
["Listed Endangered","Terrestrial","Plant","Flowering Plant  Species","Phyllostegia knudsenii ","X",null,null,null,null,1,1]
["Listed Endangered","Terrestrial","Plant","Flowering Plant  Species","Phyllostegia mannii ","X",null,null,null,null,2,2]
["Listed Endangered","Terrestrial","Plant","Flowering Plant  Species","Phyllostegia mollis","X",null,null,null,null,1,1]
["Listed Endangered","Terrestrial","Plant","Flowering Plant  Species","Phyllostegia parviflora","X",null,null,null,null,3,1]
["Listed Endangered","Terrestrial","Plant","Flowering Plant  Species","Phyllostegia pilosa","X",null,null,null,null,2,2]
["Listed Endangered","Terrestrial","Plant","Flowering Plant  Species","Phyllostegia racemosa ","X",null,null,null,null,1,1]
["Listed Endangered","Terrestrial","Plant","Flowering Plant  Species","Phyllostegia renovans ","X",null,null,null,null,1,0]
["Listed Endangered","Terrestrial","Plant","Flowering Plant  Species","Phyllostegia stachyoides","X",null,null,null,null,3,0]
["Listed Endangered","Terrestrial","Plant","Flowering Plant  Species","Phyllostegia velutina ","X",null,null,null,null,1,1]
["Listed Endangered","Terrestrial","Plant","Flowering Plant  Species","Phyllostegia waimeae ","X",null,null,null,null,1,1]
["Listed Endangered","Terrestrial","Plant","Flowering Plant  Species","Phyllostegia warshaueri ","X",null,null,null,null,1,1]
["Listed Endangered","Terrestrial","Plant","Flowering Plant  Species","Phyllostegia wawrana ","X",null,null,null,null,1,1]
["Listed Endangered","Terrestrial","Plant","Flowering Plant  Species","Pittosporum halophilum","X",null,null,null,null,1,1]
["Listed Endangered","Terrestrial","Plant","Flowering Plant  Species","Pittosporum hawaiiense","X",null,null,null,null,1,0]
["Listed Endangered","Terrestrial","Plant","Flowering Plant  Species","Pittosporum napaliense ","X",null,null,null,null,1,0]
["Listed Endangered","Terrestrial","Plant","Flowering Plant  Species","Plantago hawaiensis ","X",null,null,null,null,1,0]
["Listed Endangered","Terrestrial","Plant","Flowering Plant  Species","Plantago princeps","X",null,null,null,null,5,3]
["Listed Endangered","Terrestrial","Plant","Flowering Plant  Species","Plantago princeps var. longibracteata","X",null,null,null,null,2,2]
["Listed Endangered","Terrestrial","Plant","Flowering Plant  Species","Plantago princeps var. princeps","X",null,null,null,null,1,1]
["Listed Endangered","Terrestrial","Plant","Flowering Plant  Species","Platanthera holochila ","X",null,null,null,null,4,4]
["Listed Endangered","Terrestrial","Plant","Flowering Plant  Species","Platydesma cornuta var. cornuta","X",null,null,null,null,1,1]
["Listed Endangered","Terrestrial","Plant","Flowering Plant  Species","Platydesma cornuta var. decurrens","X",null,null,null,null,1,1]
["Listed Endangered","Terrestrial","Plant","Flowering Plant  Species","Platydesma remyi","X",null,null,null,null,1,0]
["Listed Endangered","Terrestrial","Plant","Flowering Plant  Species","Platydesma rostrata ","X",null,null,null,null,1,0]
["Listed Endangered","Terrestrial","Plant","Flowering Plant  Species","Pleomele fernaldii","X",null,null,null,null,1,0]
["Listed Endangered","Terrestrial","Plant","Flowering Plant  Species","Pleomele forbesii","X",null,null,null,null,1,1]
["Listed Endangered","Terrestrial","Plant","Flowering Plant  Species","Pleomele hawaiiensis","X",null,null,null,null,1,1]
["Listed Endangered","Terrestrial","Plant","Flowering Plant  Species","Poa mannii ","X",null,null,null,null,1,1]
["Listed Endangered","Terrestrial","Plant","Flowering Plant  Species","Poa sandvicensis ","X",null,null,null,null,1,1]
["Listed Endangered","Terrestrial","Plant","Flowering Plant  Species","Poa siphonoglossa ","X",null,null,null,null,1,1]
["Listed Endangered","Terrestrial","Plant","Flowering Plant  Species","Portulaca sclerocarpa ","X",null,null,null,null,2,1]
["Listed Endangered","Terrestrial","Plant","Flowering Plant  Species","Portulaca villosa","X","X",null,null,null,7,0]
["Listed Endangered","Terrestrial","Plant","Flowering Plant  Species","Pritchardia affinis ","X",null,null,null,null,1,0]
["Listed Endangered","Terrestrial","Plant","Flowering Plant  Species","Pritchardia bakeri","X",null,null,null,null,1,0]
["Listed Endangered","Terrestrial","Plant","Flowering Plant  Species","Pritchardia hardyi ","X",null,null,null,null,1,0]
["Listed Endangered","Terrestrial","Plant","Flowering Plant  Species","Pritchardia kaalae ","X",null,null,null,null,1,0]
["Listed Endangered","Terrestrial","Plant","Flowering Plant  Species","Pritchardia lanigera","X",null,null,null,null,1,0]
["Listed Endangered","Terrestrial","Plant","Flowering Plant  Species","Pritchardia munroi ","X",null,null,null,null,2,0]
["Listed Endangered","Terrestrial","Plant","Flowering Plant  Species","Pritchardia napaliensis ","X",null,null,null,null,1,0]
["Listed Endangered","Terrestrial","Plant","Flowering Plant  Species","Pritchardia remota ","X","X",null,null,null,3,2]
["Listed Endangered","Terrestrial","Plant","Flowering Plant  Species","Pritchardia schattaueri ","X",null,null,null,null,1,0]
["Listed Endangered","Terrestrial","Plant","Flowering Plant  Species","Pritchardia viscosa ","X",null,null,null,null,1,0]
["Listed Endangered","Terrestrial","Plant","Flowering Plant  Species","Pseudognaphalium sandwicensium ssp. molokaiense","X",null,null,null,null,4,0]
["Listed Endangered","Terrestrial","Plant","Flowering Plant  Species","Psychotria grandiflora ","X",null,null,null,null,1,0]
["Listed Endangered","Terrestrial","Plant","Flowering Plant  Species","Psychotria hexandra ssp. oahuensis","X",null,null,null,null,1,1]
["Listed Endangered","Terrestrial","Plant","Flowering Plant  Species","Psychotria hobdyi ","X",null,null,null,null,1,0]
["Listed Endangered","Terrestrial","Plant","Flowering Plant  Species","Psychotria malaspinae",null,null,"X",null,null,1,0]
["Listed Endangered","Terrestrial","Plant","Flowering Plant  Species","Pteralyxia kauaiensis ","X",null,null,null,null,1,1]
["Listed Endangered","Terrestrial","Plant","Flowering Plant  Species","Pteralyxia macrocarpa","X",null,null,null,null,1,1]
["Listed Endangered","Terrestrial","Plant","Flowering Plant  Species","Ranunculus hawaiensis","X",null,null,null,null,2,0]
["Listed Endangered","Terrestrial","Plant","Flowering Plant  Species","Ranunculus mauiensis","X",null,null,null,null,5,0]
["Listed Endangered","Terrestrial","Plant","Flowering Plant  Species","Remya kauaiensis ","X",null,null,null,null,1,1]
["Listed Endangered","Terrestrial","Plant","Flowering Plant  Species","Remya mauiensis ","X",null,null,null,null,1,1]
["Listed Endangered","Terrestrial","Plant","Flowering Plant  Species","Remya montgomeryi ","X",null,null,null,null,1,1]
["Listed Endangered","Terrestrial","Plant","Flowering Plant  Species","Sanicula mariversa ","X",null,null,null,null,1,1]
["Listed Endangered","Terrestrial","Plant","Flowering Plant  Species","Sanicula purpurea ","X",null,null,null,null,2,2]
["Listed Endangered","Terrestrial","Plant","Flowering Plant  Species","Sanicula sandwicensis","X",null,null,null,null,2,0]
["Listed Endangered","Terrestrial","Plant","Flowering Plant  Species","Santalum haleakalae var. lanaiense","X",null,null,null,null,3,2]
["Listed Endangered","Terrestrial","Plant","Flowering Plant  Species","Santalum involutum","X",null,null,null,null,1,0]
["Listed Endangered","Terrestrial","Plant","Flowering Plant  Species","Scaevola coriacea ","X",null,null,null,null,7,0]
["Listed Endangered","Terrestrial","Plant","Flowering Plant  Species","Schenkia sebaeoides","X",null,null,null,null,5,4]
["Listed Endangered","Terrestrial","Plant","Flowering Plant  Species","Schiedea adamantis ","X",null,null,null,null,1,0]
["Listed Endangered","Terrestrial","Plant","Flowering Plant  Species","Schiedea apokremnos ","X",null,null,null,null,1,1]
["Listed Endangered","Terrestrial","Plant","Flowering Plant  Species","Schiedea attenuata ","X",null,null,null,null,1,0]
["Listed Endangered","Terrestrial","Plant","Flowering Plant  Species","Schiedea diffusa ssp. diffusa","X",null,null,null,null,1,0]
["Listed Endangered","Terrestrial","Plant","Flowering Plant  Species","Schiedea diffusa ssp. macraei","X",null,null,null,null,1,0]
["Listed Endangered","Terrestrial","Plant","Flowering Plant  Species","Schiedea haleakalensis ","X",null,null,null,null,1,1]
["Listed Endangered","Terrestrial","Plant","Flowering Plant  Species","Schiedea hawaiiensis","X",null,null,null,null,1,0]
["Listed Endangered","Terrestrial","Plant","Flowering Plant  Species","Schiedea helleri ","X",null,null,null,null,1,1]
["Listed Endangered","Terrestrial","Plant","Flowering Plant  Species","Schiedea hookeri ","X",null,null,null,null,2,1]
["Listed Endangered","Terrestrial","Plant","Flowering Plant  Species","Schiedea jacobii","X",null,null,null,null,1,1]
["Listed Endangered","Terrestrial","Plant","Flowering Plant  Species","Schiedea kaalae ","X",null,null,null,null,1,1]
["Listed Endangered","Terrestrial","Plant","Flowering Plant  Species","Schiedea kauaiensis ","X",null,null,null,null,1,1]
["Listed Endangered","Terrestrial","Plant","Flowering Plant  Species","Schiedea kealiae ","X",null,null,null,null,1,1]
["Listed Endangered","Terrestrial","Plant","Flowering Plant  Species","Schiedea laui","X",null,null,null,null,1,1]
["Listed Endangered","Terrestrial","Plant","Flowering Plant  Species","Schiedea lydgatei ","X",null,null,null,null,1,1]
["Listed Endangered","Terrestrial","Plant","Flowering Plant  Species","Schiedea membranacea ","X",null,null,null,null,1,1]
["Listed Endangered","Terrestrial","Plant","Flowering Plant  Species","Schiedea nuttallii","X",null,null,null,null,4,1]
["Listed Endangered","Terrestrial","Plant","Flowering Plant  Species","Schiedea obovata","X",null,null,null,null,1,1]
["Listed Endangered","Terrestrial","Plant","Flowering Plant  Species","Schiedea pubescens","X",null,null,null,null,3,0]
["Listed Endangered","Terrestrial","Plant","Flowering Plant  Species","Schiedea salicaria","X",null,null,null,null,1,1]
["Listed Endangered","Terrestrial","Plant","Flowering Plant  Species","Schiedea sarmentosa ","X",null,null,null,null,1,1]
["Listed Endangered","Terrestrial","Plant","Flowering Plant  Species","Schiedea spergulina var. spergulina","X",null,null,null,null,1,1]
["Listed Endangered","Terrestrial","Plant","Flowering Plant  Species","Schiedea stellarioides ","X",null,null,null,null,1,1]
["Listed Endangered","Terrestrial","Plant","Flowering Plant  Species","Schiedea trinervis","X",null,null,null,null,1,1]
["Listed Endangered","Terrestrial","Plant","Flowering Plant  Species","Schiedea verticillata ",null,"X",null,null,null,1,1]
["Listed Endangered","Terrestrial","Plant","Flowering Plant  Species","Serianthes nelsonii ",null,null,"X",null,null,2,0]
["Listed Endangered","Terrestrial","Plant","Flowering Plant  Species","Sesbania tomentosa ","X","X",null,null,null,10,9]
["Listed Endangered","Terrestrial","Plant","Flowering Plant  Species","Sicyos alba ","X",null,null,null,null,1,1]
["Listed Endangered","Terrestrial","Plant","Flowering Plant  Species","Sicyos lanceoloideus","X",null,null,null,null,2,0]
["Listed Endangered","Terrestrial","Plant","Flowering Plant  Species","Sicyos macrophyllus","X",null,null,null,null,2,0]
["Listed Endangered","Terrestrial","Plant","Flowering Plant  Species","Silene alexandri ","X",null,null,null,null,1,0]
["Listed Endangered","Terrestrial","Plant","Flowering Plant  Species","Silene lanceolata ","X",null,null,null,null,5,2]
["Listed Endangered","Terrestrial","Plant","Flowering Plant  Species","Silene perlmanii ","X",null,null,null,null,1,1]
["Listed Endangered","Terrestrial","Plant","Flowering Plant  Species","Solanum guamense",null,null,"X",null,null,7,0]
["Listed Endangered","Terrestrial","Plant","Flowering Plant  Species","Solanum incompletum ","X",null,null,null,null,5,2]
["Listed Endangered","Terrestrial","Plant","Flowering Plant  Species","Solanum nelsonii","X","X",null,null,null,9,0]
["Listed Endangered","Terrestrial","Plant","Flowering Plant  Species","Solanum sandwicense ","X",null,null,null,null,2,2]
["Listed Endangered","Terrestrial","Plant","Flowering Plant  Species","Spermolepis hawaiiensis ","X",null,null,null,null,6,4]
["Listed Endangered","Terrestrial","Plant","Flowering Plant  Species","Stenogyne angustifolia var. angustifolia","X",null,null,null,null,3,0]
["Listed Endangered","Terrestrial","Plant","Flowering Plant  Species","Stenogyne bifida ","X",null,null,null,null,1,1]
["Listed Endangered","Terrestrial","Plant","Flowering Plant  Species","Stenogyne campanulata ","X",null,null,null,null,1,1]
["Listed Endangered","Terrestrial","Plant","Flowering Plant  Species","Stenogyne cranwelliae","X",null,null,null,null,1,0]
["Listed Endangered","Terrestrial","Plant","Flowering Plant  Species","Stenogyne kaalae ssp. sherffii","X",null,null,null,null,1,0]
["Listed Endangered","Terrestrial","Plant","Flowering Plant  Species","Stenogyne kanehoana ","X",null,null,null,null,1,1]
["Listed Endangered","Terrestrial","Plant","Flowering Plant  Species","Stenogyne kauaulaensis","X",null,null,null,null,1,1]
["Listed Endangered","Terrestrial","Plant","Flowering Plant  Species","Stenogyne kealiae ","X",null,null,null,null,1,0]
["Listed Endangered","Terrestrial","Plant","Flowering Plant  Species","Tetramolopium arenarium","X",null,null,null,null,2,0]
["Listed Endangered","Terrestrial","Plant","Flowering Plant  Species","Tetramolopium capillare ","X",null,null,null,null,1,1]
["Listed Endangered","Terrestrial","Plant","Flowering Plant  Species","Tetramolopium filiforme","X",null,null,null,null,1,1]
["Listed Endangered","Terrestrial","Plant","Flowering Plant  Species","Tetramolopium lepidotum ssp. lepidotum","X",null,null,null,null,2,0]
["Listed Endangered","Terrestrial","Plant","Flowering Plant  Species","Tetramolopium remyi ","X",null,null,null,null,2,1]
["Listed Endangered","Terrestrial","Plant","Flowering Plant  Species","Tetraplasandra bisattenuata","X",null,null,null,null,1,0]
["Listed Endangered","Terrestrial","Plant","Flowering Plant  Species","Tetraplasandra flynnii","X",null,null,null,null,1,0]
["Listed Endangered","Terrestrial","Plant","Flowering Plant  Species","Tetraplasandra gymnocarpa","X",null,null,null,null,1,1]
["Listed Endangered","Terrestrial","Plant","Flowering Plant  Species","Tetraplasandra lydgatei","X",null,null,null,null,1,1]
["Listed Endangered","Terrestrial","Plant","Flowering Plant  Species","Tinospora homosepala",null,null,"X",null,null,1,0]
["Listed Endangered","Terrestrial","Plant","Flowering Plant  Species","Trematolobelia singularis ","X",null,null,null,null,1,1]
["Listed Endangered","Terrestrial","Plant","Flowering Plant  Species","Urera kaalae ","X",null,null,null,null,1,1]
["Listed Endangered","Terrestrial","Plant","Flowering Plant  Species","Vicia menziesii ","X",null,null,null,null,1,0]
["Listed Endangered","Terrestrial","Plant","Flowering Plant  Species","Vigna o-wahuensis ","X",null,null,null,null,7,5]
["Listed Endangered","Terrestrial","Plant","Flowering Plant  Species","Viola chamissoniana ssp. chamissoniana","X",null,null,null,null,1,1]
["Listed Endangered","Terrestrial","Plant","Flowering Plant  Species","Viola helenae ","X",null,null,null,null,1,1]
["Listed Endangered","Terrestrial","Plant","Flowering Plant  Species","Viola kauaensis var. wahiawaensis","X",null,null,null,null,1,1]
["Listed Endangered","Terrestrial","Plant","Flowering Plant  Species","Viola lanaiensis ","X",null,null,null,null,1,0]
["Listed Endangered","Terrestrial","Plant","Flowering Plant  Species","Viola oahuensis ","X",null,null,null,null,1,1]
["Listed Endangered","Terrestrial","Plant","Flowering Plant  Species","Wikstroemia skottsbergiana","X",null,null,null,null,1,0]
["Listed Endangered","Terrestrial","Plant","Flowering Plant  Species","Wikstroemia villosa","X",null,null,null,null,1,1]
["Listed Endangered","Terrestrial","Plant","Flowering Plant  Species","Wilkesia hobdyi ","X",null,null,null,null,1,1]
["Listed Endangered","Terrestrial","Plant","Flowering Plant  Species","Xylosma crenatum ","X",null,null,null,null,1,1]
["Listed Endangered","Terrestrial","Plant","Flowering Plant  Species","Zanthoxylum dipetalum var. tomentosum ","X",null,null,null,null,1,1]
["Listed Endangered","Terrestrial","Plant","Flowering Plant  Species","Zanthoxylum hawaiiensis","X",null,null,null,null,5,3]
["Listed Endangered","Terrestrial","Plant","Flowering Plant  Species","Zanthoxylum oahuense","X",null,null,null,null,1,1]
["Listed Threatened","Terrestrial","Plant","Conifer and Cycad Species","Cycas micronesica",null,null,"X",null,null,3,0]
["Listed Threatened","Terrestrial","Plant","Flowering Plant  Species","Argyroxiphium sandwicense ssp. macrocephalum","X",null,null,null,null,1,1]
["Listed Threatened","Terrestrial","Plant","Flowering Plant  Species","Bulbophyllum guamense",null,null,"X",null,null,4,0]
["Listed Threatened","Terrestrial","Plant","Flowering Plant  Species","Cyanea recta ","X",null,null,null,null,1,1]
["Listed Threatened","Terrestrial","Plant","Flowering Plant  Species","Cyrtandra limahuliensis","X",null,null,null,null,1,1]
["Listed Threatened","Terrestrial","Plant","Flowering Plant  Species","Dendrobium guamense",null,null,"X",null,null,4,0]
["Listed Threatened","Terrestrial","Plant","Flowering Plant  Species","Isodendrion longifolium ","X",null,null,null,null,2,2]
["Listed Threatened","Terrestrial","Plant","Flowering Plant  Species","Maesa walkeri",null,null,"X",null,null,2,0]
["Listed Threatened","Terrestrial","Plant","Flowering Plant  Species","Myrsine linearifolia ","X",null,null,null,null,1,1]
["Listed Threatened","Terrestrial","Plant","Flowering Plant  Species","Nervilia jacksoniae",null,null,"X",null,null,2,0]
["Listed Threatened","Terrestrial","Plant","Flowering Plant  Species","Peucedanum sandwicense ","X",null,null,null,null,4,4]
["Listed Threatened","Terrestrial","Plant","Flowering Plant  Species","Silene hawaiiensis ","X",null,null,null,null,1,1]
["Listed Threatened","Terrestrial","Plant","Flowering Plant  Species","Tabernaemontana rotensis",null,null,"X",null,null,2,0]
["Listed Threatened","Terrestrial","Plant","Flowering Plant  Species","Tetramolopium rockii","X",null,null,null,null,1,1]
["Listed Threatened","Terrestrial","Plant","Flowering Plant  Species","Tuberolabium guamense",null,null,"X",null,null,4,0]

{"sheet":"PIA Pervasive Weed List","index":7,"n_rows":119,"n_cols":6,"rows_kept":119,"cut":false,"hidden":false,"merged":[[0,0,1,5]]}
["For  plants not listed below that may require multiple treatments to control, contact the PIA State Grazing Lands Management Specialist or PIA State Forester."]
[]
[]
[]
[]
[]
["NRCS PIA Pervasive Weed List",null,null,null,null,"October, 2018"]
[]
["Scientific name","Common name  ",314,315,"Note","HPWRA"]
["Acacia spp.","acacias","x",null,"non-native species only"]
["Adenanthera pavonina","peacock tree, false wiliwili","x",null,null,7]
["Ageratum conyzoides","billygoat weed",null,"x",null,26]
["Amaranthus spinosus","spiny amaranth, pigweed",null,"x",null,20]
["Andropogon virginicus","broomsedge",null,"x",null,20]
["Anemone hupehensis ","Japanese anemone",null,"x",null,8.5]
["Anredera cordifolia","Madeira vine",null,"x","vine",20]
["Antigonon leptopus","coral vine",null,"x","vine",19]
["Ardisia elliptica","shoebutton ardisia","x",null,null,11]
["Arthrostemma ciliatum","pink fringe",null,"x",null,7]
["Asclepias physocarpa","balloon plant",null,"x",null,8]
["Bambusa spp. & Phyllostachys spp.","running bamboos","x",null,"non-native species only"]
["Batis maritima","pickleweed",null,"x",null,9]
["Bidens spp.","Aster family e.g. Spanish needle",null,"x","non-native species only",23]
["Buddleja asiatica","Asian butterfly bush, dog tail","x",null,null,9]
["Caesalpinia decapetala","cat's claw","x",null,null,20]
["Calliandra calothyrsus","calliandra","x",null,null,12]
["Calopogonium mucunoides","calopo, frisolilla",null,"x","vine",16]
["Casuarina spp.","ironwoods","x",null,"non-native species only"]
["Cecropia spp.","trumpet-tree & others","x",null,"non-native species only"]
["Centrosema pubescens","centro",null,"x","vine",11]
["Chromolaena odorata","bitterbush, Siam weed",null,"x",null,28]
["Cinnamomum spp.","Laurel family, e.g. camphor","x",null,"non-native species only"]
["Citharexylum caudatum","fiddlewood","x",null,null,15]
["Clerodendrum spp.","in Lamiaceae","x",null,"non-native species only"]
["Clidemia hirta","clidemia, Koster's curse","x",null,null,28]
["Clusia rosea","autograph tree","x",null,null,9]
["Coccinia grandis","ivy gourd",null,"x",null,21]
["Coffea arabica","wild coffee","x",null,null,2]
["Commelina diffusa","climbing dayflower, honohono",null,"x",null,23]
["Cynodon dactylon","Bermuda grass",null,"x",null,22]
["Delairia odorata","cape ivy, German ivy",null,"x",null,14]
["Digitartia insularis","sourgrass",null,"x",null,20]
["Ehrharta stipoides","meadow ricegrass, weeping grass",null,"x",null,19]
["Elaeagnus spp.","autum olive, Russian olive","x",null,"non-native species only"]
["Elephantopus mollis","elephant's weed, tobacco weed",null,"x",null,17]
["Eragrostis curvula","African / weeping love grass",null,"x",null,26]
["Eriobotrya japonica","loquat","x",null,null,0.5]
["Eucalyptus spp.","gum trees in myrtle family","x",null,"non-native species only"]
["Falcataria moluccana","albizia","x",null,null,8]
["Ficus spp.","figs / banyans","x",null,"non-native species only"]
["Flueggea virosa","white-berry bush","x",null,null,7]
["Fraxinus uhdei","tropical ash","x",null,null,11]
["Grevillea spp.","silk oaks","x",null,"non-native species only"]
["Hedychium spp.","gingers",null,"x","non-native species only"]
["Heliocarpus popayanensis","moho","x",null,null,7]
["Hibiscus tiliaceus","hau","x",null,"non-native species only"]
["Hura crepitans","sandbox tree, possumwood","x",null,null,8]
["Hyptis pectinata","comb hyptis",null,"x",null,14]
["Imperata cylindrica","cogon grass",null,"x",null,22]
["Indigofera suffruticosa","indigo","x",null,null,11]
["Jasminum spp.","jasmines in olive family","x",null,"non-native species only"]
["Jatropha spp.","in spurge family","x",null,"non-native species only"]
["Lantana camara","lantana","x",null,null,32]
["Leptospermum scoparium","manuka, New Zealand tea tree","x",null,null,20]
["Leucaena leucocephala","leucaena","x",null,null,15]
["Lonicera japonica","Japanese honeysuckle",null,"x",null,12]
["Macaranga mappa","bingabing","x",null,null,11]
["Macaranga tanarius","parasol leaf tree","x",null,null,12]
["Melaleuca quinquenervia","paper bark tree","x",null,null,15]
["Melastoma spp.","melastomas","x",null,"non-native species only"]
["Melia azedarach","Chinaberry tree","x",null,null,14]
["Melochia umbellata","melochia","x",null,null,7]
["Merremia spp.","wood rose, morning glory family",null,"x","vine"]
["Miconia calvescens","miconia","x",null,null,14]
["Mikania micrantha","mile-a-minute weed",null,"x","vine",25]
["Mimosa spp.","sensitive plant",null,"x","non-native species only"]
["Miscanthus floridulus","sword grass",null,"x",null,18]
["Morella faya","firetree","x",null,null,17]
["Neonotonia wightii","glycine, Tinaroo glycine",null,"x",null,16]
["Olea europaea ssp. cuspidata","African olive","x",null,null,11]
["Paederia foetida","maile pilau",null,"x","vine",21]
["Parkinsonia aculeata","Jerusalum thorn","x",null,null,20]
["Passiflora spp.","passion fruits",null,"x","vine"]
["Pennisetum clandestinum","kikuyu grass",null,"x",null,18]
["Pennisetum setaceum","fountain grass",null,"x",null,26]
["Persicaria capitata","knotweed",null,"x",null,22]
["Pinus spp.","pines","x",null,"non-native species only"]
["Pithecellobium dulce","Madras thorn, opiuma","x",null,null,14]
["Pluchea carolinensis","sourbush, cure-for-all","x",null,null,16]
["Praxelis clematidea","praxelis",null,"x",null,25]
["Prosopis spp.","mesquites, keawe","x",null,"non-native species only"]
["Psidium spp.","guavas","x",null,"non-native species only"]
["Pueraria montana var. lobata","kudzu vine",null,"x","vine",24]
["Pyracantha angustifolia","firethorn","x",null,null,13]
["Rauvolfia vomitoria","poison devil's pepper","x",null,null,21]
["Rhodomyrtus tomentosa","downy rosemyrtle","x",null,null,8]
["Rubus spp.","blackberries & raspberries","x",null,"non-native species only"]
["Sagittaria platyphylla","broad-leaf / delta arrowhead",null,"x",null,28]
["Schefflera actinophylla","octopus tree","x",null,null,13]
["Schinus terebinthifolius","Christmas berry","x",null,null,19]
["Schizachyrium condensatum","bushy beardgrass",null,"x",null,13]
["Senecio madagascariensis","fireweed",null,"x",null,23]
["Senna spp.","kolomona, sicklepod, candle bush, acapulco","x",null,"non-native species only"]
["Setaria palmifolia","palm grass, highland pitpit",null,"x",null,11]
["Solanum linnaeanum\nS. torvum","turkeyberry, apple of Sodom","x",null,"non-native species only",22]
["Spathodea campanulata","African tulip tree","x",null,null,14]
["Sphagneticola trilobata","wedelia, creeping ox-eye",null,"x",null,14]
["Stachytarpheta cayennensis","joee weed",null,"x",null,13]
["Syzygium spp.","rose apple, Java plum","x",null,"non-native species only"]
["Tabebuia heterophylla","pink trumpet-tree","x",null,null,1]
["Thunbergia grandiflora","blue trumpet vine",null,"x","vine",11]
["Tibouchina herbacea","cane tibouchina",null,"x",null,24]
["Tibouchina urvilleana","glory bush","x",null,null,10]
["Triphasia trifolia","limeberry","x",null,null,9]
["Triumfetta simitrilobata","Sacramento bur","x",null,null,15]
["Ulex europaeus","gorse","x",null,null,20]
["Urena lobata","Aramina, pink bur","x",null,null,16]
["Urochloa maxima","Guinea grass",null,"x",null,17]
["Vachellia farnesiana","klu, sweet acacia","x",null,null,14]

{"sheet":"Soils Data","index":8,"n_rows":1896,"n_cols":22,"rows_kept":1896,"cut":false,"hidden":true,"merged":[]}
["areasymbol","areaname","musym","musymflag","mukey","muname","compname","localphase","comppct_r","reskind","resdept_r","frags_0_25cm","slope_r","awc_0_50cm","flood_freq","flood_dur","flood_month","pond_freq","pond_dur","pond_month"]
["HI801","Hawaii",8,{"$f":"IF('Plant Control IR Template'!$V$2=B2,C2,\"\")","v":""},"2371777","Lava flows-Cinder land complex, 2 to 40 percent slopes","Lava flows","`a`a",45,"bedrock, lithic",39,95,15,0.2,"none",null,null,"none"]
["HI801","Hawaii",8,{"$f":"IF('Plant Control IR Template'!$V$2=B3,C3,\"\")","v":""},"2371777","Lava flows-Cinder land complex, 2 to 40 percent slopes","Cinder land",null,40,null,80,100,15,0.6,"none",null,null,"none"]
["HI801","Hawaii",9,{"$f":"IF('Plant Control IR Template'!$V$2=B4,C4,\"\")","v":""},"2371778","Rubble land, 12 to 40 percent slopes","Rubble land",null,95,null,80,0,20,null,"none",null,null,"none"]
["HI801","Hawaii",10,{"$f":"IF('Plant Control IR Template'!$V$2=B5,C5,\"\")","v":""},"2371213","Lava flows, `a`a, 2 to 20 percent slopes","Lava flows","`a`a",100,"bedrock, lithic",39,95,15,0.2,"none",null,null,"none"]
["HI801","Hawaii",11,{"$f":"IF('Plant Control IR Template'!$V$2=B6,C6,\"\")","v":""},"2371214","Lava flows, `a`a, 20 to 40 percent slopes","Lava flows","`a`a",100,"bedrock, lithic",39,95,30,0.2,"none",null,null,"none"]
["HI801","Hawaii",12,{"$f":"IF('Plant Control IR Template'!$V$2=B7,C7,\"\")","v":""},"2371215","Lava flows, pahoehoe, 2 to 20 percent slopes","Lava flows","pahoehoe",100,"bedrock, lithic",0,0,15,0,"none",null,null,"none"]
["HI801","Hawaii",13,{"$f":"IF('Plant Control IR Template'!$V$2=B8,C8,\"\")","v":""},"2371577","Lava flows, pahoehoe, 20 to 40 percent slopes","Lava flows","pahoehoe",100,"bedrock, lithic",0,0,30,0,"none",null,null,"none"]
["HI801","Hawaii",14,{"$f":"IF('Plant Control IR Template'!$V$2=B9,C9,\"\")","v":""},"2371217","Lava flows complex, 2 to 20 percent slopes","Lava flows","pahoehoe",50,"bedrock, lithic",0,0,15,0,"none",null,null,"none"]
["HI801","Hawaii",14,{"$f":"IF('Plant Control IR Template'!$V$2=B10,C10,\"\")","v":""},"2371217","Lava flows complex, 2 to 20 percent slopes","Lava flows","`a`a",50,"bedrock, lithic",39,95,15,0.2,"none",null,null,"none"]
["HI801","Hawaii",15,{"$f":"IF('Plant Control IR Template'!$V$2=B11,C11,\"\")","v":""},"2371218","Cinder land, 2 to 20 percent slopes","Cinder land",null,100,null,80,100,15,0.6,"none",null,null,"none"]
["HI801","Hawaii",16,{"$f":"IF('Plant Control IR Template'!$V$2=B12,C12,\"\")","v":""},"2371219","Cinder land, 20 to 40 percent slopes","Cinder land",null,100,null,80,100,30,0.6,"none",null,null,"none"]
["HI801","Hawaii",17,{"$f":"IF('Plant Control IR Template'!$V$2=B13,C13,\"\")","v":""},"2371581","Dumps, sanitary landfill","Dumps","sanitary landfill",100,null,80,0,40,null,"none",null,null,"none"]
["HI801","Hawaii",19,{"$f":"IF('Plant Control IR Template'!$V$2=B14,C14,\"\")","v":""},"2452754","Lava flows-Water, tide pools, complex, 0 to 2 percent slopes","Lava flows","pahoehoe",55,"bedrock, lithic",0,0,1,0,"none",null,null,"none"]
["HI801","Hawaii",19,{"$f":"IF('Plant Control IR Template'!$V$2=B15,C15,\"\")","v":""},"2452754","Lava flows-Water, tide pools, complex, 0 to 2 percent slopes","Water","tidal pools",45,null,80,0,null,null,"none",null,null,"frequent","very long","January, February, March, April, May, June, July, August, September, October, November, December"]
["HI801","Hawaii",20,{"$f":"IF('Plant Control IR Template'!$V$2=B16,C16,\"\")","v":""},"2371220","Beaches, 0 to 6 percent slopes","Beaches",null,90,null,80,0,3,null,"occasional, very rare","extremely brief","January, February, March, April, October, November, December","none"]
["HI801","Hawaii",21,{"$f":"IF('Plant Control IR Template'!$V$2=B17,C17,\"\")","v":""},"2371221","Dune land, 2 to 20 percent slopes","Dune land",null,70,null,80,0,12,null,"none",null,null,"none"]
["HI801","Hawaii",22,{"$f":"IF('Plant Control IR Template'!$V$2=B18,C18,\"\")","v":""},"2371584","Pits, quarry","Pits","quarry",100,null,80,0,60,null,"none",null,null,"none"]
["HI801","Hawaii",23,{"$f":"IF('Plant Control IR Template'!$V$2=B19,C19,\"\")","v":""},"2371585","Water, sewage treatment","Water","sewage treatment",90,null,80,0,0,null,"none",null,null,"frequent","very long","January, February, March, April, May, June, July, August, September, October, November, December"]
["HI801","Hawaii",25,{"$f":"IF('Plant Control IR Template'!$V$2=B20,C20,\"\")","v":""},"2371586","Badland, 10 to 50 percent slopes","Badland",null,85,null,80,0,25,null,"none",null,null,"none"]
["HI801","Hawaii",25,{"$f":"IF('Plant Control IR Template'!$V$2=B21,C21,\"\")","v":""},"2371586","Badland, 10 to 50 percent slopes","Waikaloa",null,15,null,80,3,25,5.0999999999999996,"none",null,null,"none"]
["HI801","Hawaii",27,{"$f":"IF('Plant Control IR Template'!$V$2=B22,C22,\"\")","v":""},"2384114","Dumps, fill land, 0 to 3 percent slopes","Dumps","fill land",100,null,80,0,1,null,"occasional, rare","very brief","January, February, March, April, November, December","none"]
["HI801","Hawaii",100,{"$f":"IF('Plant Control IR Template'!$V$2=B23,C23,\"\")","v":""},"2371587","Kaimu extremely cobbly highly decomposed plant material, 2 to 10 percent slopes","Kaimu",null,90,"bedrock, lithic",40,65,6,2.2999999999999998,"none",null,null,"none"]
["HI801","Hawaii",101,{"$f":"IF('Plant Control IR Template'!$V$2=B24,C24,\"\")","v":""},"2371588","Kaimu extremely cobbly highly decomposed plant material, 10 to 20 percent slopes","Kaimu",null,90,"bedrock, lithic",40,65,15,2.2999999999999998,"none",null,null,"none"]
["HI801","Hawaii",102,{"$f":"IF('Plant Control IR Template'!$V$2=B25,C25,\"\")","v":""},"2371589","Kaimu-Lava flows complex, 2 to 10 percent slopes","Kaimu",null,60,"bedrock, lithic",40,65,6,2.2999999999999998,"none",null,null,"none"]
["HI801","Hawaii",102,{"$f":"IF('Plant Control IR Template'!$V$2=B26,C26,\"\")","v":""},"2371589","Kaimu-Lava flows complex, 2 to 10 percent slopes","Lava flows","`a`a",35,"bedrock, lithic",39,95,6,0.2,"none",null,null,"none"]
["HI801","Hawaii",103,{"$f":"IF('Plant Control IR Template'!$V$2=B27,C27,\"\")","v":""},"2371590","Kaimu-Lava flows complex, 10 to 20 percent slopes","Kaimu",null,60,"bedrock, lithic",40,65,15,2.2999999999999998,"none",null,null,"none"]
["HI801","Hawaii",103,{"$f":"IF('Plant Control IR Template'!$V$2=B28,C28,\"\")","v":""},"2371590","Kaimu-Lava flows complex, 10 to 20 percent slopes","Lava flows","`a`a",35,"bedrock, lithic",39,95,15,0.2,"none",null,null,"none"]
["HI801","Hawaii",104,{"$f":"IF('Plant Control IR Template'!$V$2=B29,C29,\"\")","v":""},"2371591","Lava flows-Kaimu complex, 2 to 20 percent slopes","Lava flows","`a`a",60,"bedrock, lithic",39,95,12,0.2,"none",null,null,"none"]
["HI801","Hawaii",104,{"$f":"IF('Plant Control IR Template'!$V$2=B30,C30,\"\")","v":""},"2371591","Lava flows-Kaimu complex, 2 to 20 percent slopes","Kaimu",null,35,"bedrock, lithic",40,65,12,2.2999999999999998,"none",null,null,"none"]
["HI801","Hawaii",107,{"$f":"IF('Plant Control IR Template'!$V$2=B31,C31,\"\")","v":""},"2371593","Lava flows-Honokohau complex, 2 to 20 percent slopes","Lava flows","pahoehoe",60,"bedrock, lithic",0,0,11,0,"none",null,null,"none"]
["HI801","Hawaii",107,{"$f":"IF('Plant Control IR Template'!$V$2=B32,C32,\"\")","v":""},"2371593","Lava flows-Honokohau complex, 2 to 20 percent slopes","Honokohau",null,40,"bedrock, lithic",6,10,11,null,"very rare","extremely brief","January, February, March, April, May, June, July, August, September, October, November, December","none"]
["HI801","Hawaii",108,{"$f":"IF('Plant Control IR Template'!$V$2=B33,C33,\"\")","v":""},"2371594","Noio-Lava flows complex, 2 to 10 percent slopes","Noio",null,60,"bedrock, lithic",34,84,6,0.9,"none",null,null,"none"]
["HI801","Hawaii",108,{"$f":"IF('Plant Control IR Template'!$V$2=B34,C34,\"\")","v":""},"2371594","Noio-Lava flows complex, 2 to 10 percent slopes","Lava flows","`a`a",40,"bedrock, lithic",39,95,6,0.2,"none",null,null,"none"]
["HI801","Hawaii",109,{"$f":"IF('Plant Control IR Template'!$V$2=B35,C35,\"\")","v":""},"2371595","Noio-Lava flows complex, 10 to 20 percent slopes","Noio",null,60,"bedrock, lithic",34,84,15,0.9,"none",null,null,"none"]
["HI801","Hawaii",109,{"$f":"IF('Plant Control IR Template'!$V$2=B36,C36,\"\")","v":""},"2371595","Noio-Lava flows complex, 10 to 20 percent slopes","Lava flows","`a`a",40,"bedrock, lithic",39,95,15,0.2,"none",null,null,"none"]
["HI801","Hawaii",110,{"$f":"IF('Plant Control IR Template'!$V$2=B37,C37,\"\")","v":""},"2371596","Puna and Haplic Udarents soils, 2 to 10 percent slopes","Puna",null,60,"bedrock, lithic",30,69,6,1.1000000000000001,"none",null,null,"none"]
["HI801","Hawaii",110,{"$f":"IF('Plant Control IR Template'!$V$2=B38,C38,\"\")","v":""},"2371596","Puna and Haplic Udarents soils, 2 to 10 percent slopes","Haplic Udarents",null,30,null,80,75,6,0.8,"none",null,null,"none"]
["HI801","Hawaii",111,{"$f":"IF('Plant Control IR Template'!$V$2=B39,C39,\"\")","v":""},"2371597","Puna and Haplic Udarents soils, 10 to 20 percent slopes","Puna",null,60,"bedrock, lithic",30,69,15,1.1000000000000001,"none",null,null,"none"]
["HI801","Hawaii",111,{"$f":"IF('Plant Control IR Template'!$V$2=B40,C40,\"\")","v":""},"2371597","Puna and Haplic Udarents soils, 10 to 20 percent slopes","Haplic Udarents",null,30,null,80,75,15,0.8,"none",null,null,"none"]
["HI801","Hawaii",112,{"$f":"IF('Plant Control IR Template'!$V$2=B41,C41,\"\")","v":""},"2371598","Puna-Lava flows complex, 2 to 10 percent slopes","Puna",null,60,"bedrock, lithic",30,69,6,1.1000000000000001,"none",null,null,"none"]
["HI801","Hawaii",112,{"$f":"IF('Plant Control IR Template'!$V$2=B42,C42,\"\")","v":""},"2371598","Puna-Lava flows complex, 2 to 10 percent slopes","Lava flows","`a`a",35,"bedrock, lithic",39,95,6,0.2,"none",null,null,"none"]
["HI801","Hawaii",113,{"$f":"IF('Plant Control IR Template'!$V$2=B43,C43,\"\")","v":""},"2371599","Puna-Lava flows complex, 10 to 20 percent slopes","Puna",null,60,"bedrock, lithic",30,69,15,1.1000000000000001,"none",null,null,"none"]
["HI801","Hawaii",113,{"$f":"IF('Plant Control IR Template'!$V$2=B44,C44,\"\")","v":""},"2371599","Puna-Lava flows complex, 10 to 20 percent slopes","Lava flows","`a`a",35,"bedrock, lithic",39,95,15,0.2,"none",null,null,"none"]
["HI801","Hawaii",114,{"$f":"IF('Plant Control IR Template'!$V$2=B45,C45,\"\")","v":""},"2371600","Puna very cobbly highly decomposed plant material, 20 to 40 percent slopes","Puna",null,90,"bedrock, lithic",30,69,30,1.1000000000000001,"none",null,null,"none"]
["HI801","Hawaii",115,{"$f":"IF('Plant Control IR Template'!$V$2=B46,C46,\"\")","v":""},"2371601","Kapua and Haplic Ustarents soils, 2 to 10 percent slopes","Kapua",null,60,null,80,58,6,3,"none",null,null,"none"]
["HI801","Hawaii",115,{"$f":"IF('Plant Control IR Template'!$V$2=B47,C47,\"\")","v":""},"2371601","Kapua and Haplic Ustarents soils, 2 to 10 percent slopes","Haplic Ustarents",null,30,null,80,75,6,0.8,"none",null,null,"none"]
["HI801","Hawaii",116,{"$f":"IF('Plant Control IR Template'!$V$2=B48,C48,\"\")","v":""},"2371602","Kapua and Haplic Ustarents soils, 10 to 20 percent slopes","Kapua",null,60,null,80,58,15,3,"none",null,null,"none"]
["HI801","Hawaii",116,{"$f":"IF('Plant Control IR Template'!$V$2=B49,C49,\"\")","v":""},"2371602","Kapua and Haplic Ustarents soils, 10 to 20 percent slopes","Haplic Ustarents",null,30,null,80,75,15,0.8,"none",null,null,"none"]
["HI801","Hawaii",117,{"$f":"IF('Plant Control IR Template'!$V$2=B50,C50,\"\")","v":""},"2371603","Kapua-Lava flows complex, 2 to 10 percent slopes","Kapua",null,60,null,80,58,6,3,"none",null,null,"none"]
["HI801","Hawaii",117,{"$f":"IF('Plant Control IR Template'!$V$2=B51,C51,\"\")","v":""},"2371603","Kapua-Lava flows complex, 2 to 10 percent slopes","Lava flows","`a`a",35,"bedrock, lithic",39,95,6,0.2,"none",null,null,"none"]
["HI801","Hawaii",118,{"$f":"IF('Plant Control IR Template'!$V$2=B52,C52,\"\")","v":""},"2371604","Kapua-Lava flows complex, 10 to 20 percent slopes","Kapua",null,60,null,80,58,15,3,"none",null,null,"none"]
["HI801","Hawaii",118,{"$f":"IF('Plant Control IR Template'!$V$2=B53,C53,\"\")","v":""},"2371604","Kapua-Lava flows complex, 10 to 20 percent slopes","Lava flows","`a`a",35,"bedrock, lithic",39,95,15,0.2,"none",null,null,"none"]
["HI801","Hawaii",119,{"$f":"IF('Plant Control IR Template'!$V$2=B54,C54,\"\")","v":""},"2371605","Puuiki-Lava flows complex, moist, 10 to 20 percent slopes","Puuiki","moist",60,"bedrock, lithic",5,50,15,0.7,"none",null,null,"none"]
["HI801","Hawaii",119,{"$f":"IF('Plant Control IR Template'!$V$2=B55,C55,\"\")","v":""},"2371605","Puuiki-Lava flows complex, moist, 10 to 20 percent slopes","Lava flows","pahoehoe",35,"bedrock, lithic",0,0,15,0,"none",null,null,"none"]
["HI801","Hawaii",120,{"$f":"IF('Plant Control IR Template'!$V$2=B56,C56,\"\")","v":""},"2371606","Punaluu highly decomposed plant material, 2 to 10 percent slopes","Punaluu",null,90,"bedrock, lithic",6,5,6,null,"occasional","extremely brief","January, February, March, April, May, June, July, August, September, October, November, December","none"]
["HI801","Hawaii",121,{"$f":"IF('Plant Control IR Template'!$V$2=B57,C57,\"\")","v":""},"2371607","Punaluu-Lava flows complex, 2 to 10 percent slopes","Punaluu",null,60,"bedrock, lithic",6,5,6,null,"occasional","extremely brief","January, February, March, April, May, June, July, August, September, October, November, December","none"]
["HI801","Hawaii",121,{"$f":"IF('Plant Control IR Template'!$V$2=B58,C58,\"\")","v":""},"2371607","Punaluu-Lava flows complex, 2 to 10 percent slopes","Lava flows","pahoehoe",35,"bedrock, lithic",0,0,6,0,"none",null,null,"none"]
["HI801","Hawaii",122,{"$f":"IF('Plant Control IR Template'!$V$2=B59,C59,\"\")","v":""},"2371608","Punaluu-Lava flows complex, 10 to 20 percent slopes","Punaluu",null,60,"bedrock, lithic",6,5,15,null,"occasional","extremely brief","January, February, March, April, May, June, July, August, September, October, November, December","none"]
["HI801","Hawaii",122,{"$f":"IF('Plant Control IR Template'!$V$2=B60,C60,\"\")","v":""},"2371608","Punaluu-Lava flows complex, 10 to 20 percent slopes","Lava flows","pahoehoe",35,"bedrock, lithic",0,0,15,0,"none",null,null,"none"]
["HI801","Hawaii",123,{"$f":"IF('Plant Control IR Template'!$V$2=B61,C61,\"\")","v":""},"2371609","Lava flows-Punaluu complex, 2 to 20 percent slopes","Lava flows","pahoehoe",70,"bedrock, lithic",0,0,11,0,"none",null,null,"none"]
["HI801","Hawaii",123,{"$f":"IF('Plant Control IR Template'!$V$2=B62,C62,\"\")","v":""},"2371609","Lava flows-Punaluu complex, 2 to 20 percent slopes","Punaluu",null,25,"bedrock, lithic",6,5,11,null,"occasional","extremely brief","January, February, March, April, May, June, July, August, September, October, November, December","none"]
["HI801","Hawaii",124,{"$f":"IF('Plant Control IR Template'!$V$2=B63,C63,\"\")","v":""},"2371610","Punaluu highly decomposed plant material, 10 to 20 percent slopes","Punaluu",null,90,"bedrock, lithic",6,5,15,null,"occasional","extremely brief","January, February, March, April, May, June, July, August, September, October, November, December","none"]
["HI801","Hawaii",125,{"$f":"IF('Plant Control IR Template'!$V$2=B64,C64,\"\")","v":""},"2371611","Lava flows-Puuiki complex, moist, 2 to 20 percent slopes","Lava flows","pahoehoe",70,"bedrock, lithic",0,0,11,0,"none",null,null,"none"]
["HI801","Hawaii",125,{"$f":"IF('Plant Control IR Template'!$V$2=B65,C65,\"\")","v":""},"2371611","Lava flows-Puuiki complex, moist, 2 to 20 percent slopes","Puuiki","moist",25,"bedrock, lithic",5,50,11,0.7,"none",null,null,"none"]
["HI801","Hawaii",126,{"$f":"IF('Plant Control IR Template'!$V$2=B66,C66,\"\")","v":""},"2371612","Kali-Lava flows complex, 10 to 20 percent slopes","Kali",null,60,"bedrock, lithic",5,30,15,0.8,"none",null,null,"none"]
["HI801","Hawaii",126,{"$f":"IF('Plant Control IR Template'!$V$2=B67,C67,\"\")","v":""},"2371612","Kali-Lava flows complex, 10 to 20 percent slopes","Lava flows","pahoehoe",35,"bedrock, lithic",0,0,15,0,"none",null,null,"none"]
["HI801","Hawaii",127,{"$f":"IF('Plant Control IR Template'!$V$2=B68,C68,\"\")","v":""},"2371613","Puuiki-Lava flows complex, moist, 20 to 50 percent slopes","Puuiki","moist",60,"bedrock, lithic",5,50,35,0.7,"none",null,null,"none"]
["HI801","Hawaii",127,{"$f":"IF('Plant Control IR Template'!$V$2=B69,C69,\"\")","v":""},"2371613","Puuiki-Lava flows complex, moist, 20 to 50 percent slopes","Lava flows","pahoehoe",35,"bedrock, lithic",0,0,35,0,"none",null,null,"none"]
["HI801","Hawaii",129,{"$f":"IF('Plant Control IR Template'!$V$2=B70,C70,\"\")","v":""},"2371615","Puuiki-Kamawai complex, moist, 10 to 20 percent slopes","Puuiki","moist",60,"bedrock, lithic",5,50,15,0.7,"none",null,null,"none"]
["HI801","Hawaii",129,{"$f":"IF('Plant Control IR Template'!$V$2=B71,C71,\"\")","v":""},"2371615","Puuiki-Kamawai complex, moist, 10 to 20 percent slopes","Kamawai","moist",35,"bedrock, lithic",20,80,15,0.6,"none",null,null,"none"]
["HI801","Hawaii",130,{"$f":"IF('Plant Control IR Template'!$V$2=B72,C72,\"\")","v":""},"2371616","Mawae very cobbly highly decomposed plant material, 2 to 10 percent slopes","Mawae",null,90,"bedrock, lithic",40,72,6,1,"none",null,null,"none"]
["HI801","Hawaii",131,{"$f":"IF('Plant Control IR Template'!$V$2=B73,C73,\"\")","v":""},"2371617","Mawae very cobbly highly decomposed plant material, 10 to 20 percent slopes","Mawae",null,90,"bedrock, lithic",40,72,15,1,"none",null,null,"none"]
["HI801","Hawaii",132,{"$f":"IF('Plant Control IR Template'!$V$2=B74,C74,\"\")","v":""},"2371618","Mawae-Lava flows complex, 2 to 10 percent slopes","Mawae",null,60,"bedrock, lithic",40,72,6,1,"none",null,null,"none"]
["HI801","Hawaii",132,{"$f":"IF('Plant Control IR Template'!$V$2=B75,C75,\"\")","v":""},"2371618","Mawae-Lava flows complex, 2 to 10 percent slopes","Lava flows","`a`a",35,"bedrock, lithic",39,95,6,0.2,"none",null,null,"none"]
["HI801","Hawaii",133,{"$f":"IF('Plant Control IR Template'!$V$2=B76,C76,\"\")","v":""},"2371619","Mawae-Lava flows complex, 10 to 20 percent slopes","Mawae",null,60,"bedrock, lithic",40,72,15,1,"none",null,null,"none"]
["HI801","Hawaii",133,{"$f":"IF('Plant Control IR Template'!$V$2=B77,C77,\"\")","v":""},"2371619","Mawae-Lava flows complex, 10 to 20 percent slopes","Lava flows","`a`a",35,"bedrock, lithic",39,95,15,0.2,"none",null,null,"none"]
["HI801","Hawaii",134,{"$f":"IF('Plant Control IR Template'!$V$2=B78,C78,\"\")","v":""},"2371620","Kamawai-Puuiki complex, moist, 2 to 10 percent slopes","Kamawai","moist",60,"bedrock, lithic",20,80,6,0.6,"none",null,null,"none"]
["HI801","Hawaii",134,{"$f":"IF('Plant Control IR Template'!$V$2=B79,C79,\"\")","v":""},"2371620","Kamawai-Puuiki complex, moist, 2 to 10 percent slopes","Puuiki","moist",35,"bedrock, lithic",5,50,6,0.7,"none",null,null,"none"]
["HI801","Hawaii",135,{"$f":"IF('Plant Control IR Template'!$V$2=B80,C80,\"\")","v":""},"2371621","Kekake gravelly highly decomposed plant material, 2 to 10 percent slopes","Kekake",null,90,"bedrock, lithic",5,22,6,1.2,"none",null,null,"none"]
["HI801","Hawaii",136,{"$f":"IF('Plant Control IR Template'!$V$2=B81,C81,\"\")","v":""},"2371622","Kekake gravelly highly decomposed plant material, 10 to 20 percent slopes","Kekake",null,90,"bedrock, lithic",5,22,15,1.2,"none",null,null,"none"]
["HI801","Hawaii",137,{"$f":"IF('Plant Control IR Template'!$V$2=B82,C82,\"\")","v":""},"2371623","Kekake-Lava flows complex, 2 to 10 percent slopes","Kekake",null,60,"bedrock, lithic",5,22,6,1.2,"none",null,null,"none"]
["HI801","Hawaii",137,{"$f":"IF('Plant Control IR Template'!$V$2=B83,C83,\"\")","v":""},"2371623","Kekake-Lava flows complex, 2 to 10 percent slopes","Lava flows","pahoehoe",35,"bedrock, lithic",0,0,6,0,"none",null,null,"none"]
["HI801","Hawaii",138,{"$f":"IF('Plant Control IR Template'!$V$2=B84,C84,\"\")","v":""},"2371624","Kekake-Lava flows complex, 10 to 25 percent slopes","Kekake",null,60,"bedrock, lithic",5,22,15,1.2,"none",null,null,"none"]
["HI801","Hawaii",138,{"$f":"IF('Plant Control IR Template'!$V$2=B85,C85,\"\")","v":""},"2371624","Kekake-Lava flows complex, 10 to 25 percent slopes","Lava flows","pahoehoe",35,"bedrock, lithic",0,0,15,0,"none",null,null,"none"]
["HI801","Hawaii",139,{"$f":"IF('Plant Control IR Template'!$V$2=B86,C86,\"\")","v":""},"2371625","Kamawai-Puuiki complex, moist, 10 to 20 percent slopes","Kamawai","moist",60,"bedrock, lithic",20,80,15,0.6,"none",null,null,"none"]
["HI801","Hawaii",139,{"$f":"IF('Plant Control IR Template'!$V$2=B87,C87,\"\")","v":""},"2371625","Kamawai-Puuiki complex, moist, 10 to 20 percent slopes","Puuiki","moist",35,"bedrock, lithic",5,50,15,0.7,"none",null,null,"none"]
["HI801","Hawaii",140,{"$f":"IF('Plant Control IR Template'!$V$2=B88,C88,\"\")","v":""},"2371626","Kona and Haplic Udarents soils, 2 to 10 percent slopes","Kona","highly decomposed plant material",60,"bedrock, lithic",5,0,6,null,"occasional","extremely brief","January, February, March, April, May, June, July, August, September, October, November, December","none"]
["HI801","Hawaii",140,{"$f":"IF('Plant Control IR Template'!$V$2=B89,C89,\"\")","v":""},"2371626","Kona and Haplic Udarents soils, 2 to 10 percent slopes","Haplic Udarents",null,30,"bedrock, lithic",19,75,6,0.8,"none",null,null,"none"]
["HI801","Hawaii",142,{"$f":"IF('Plant Control IR Template'!$V$2=B90,C90,\"\")","v":""},"2371627","Kona and Haplic Udarents soils, 10 to 20 percent slopes","Kona",null,60,"bedrock, lithic",5,40,15,1.1000000000000001,"occasional","extremely brief","January, February, March, April, May, June, July, August, September, October, November, December","none"]
["HI801","Hawaii",142,{"$f":"IF('Plant Control IR Template'!$V$2=B91,C91,\"\")","v":""},"2371627","Kona and Haplic Udarents soils, 10 to 20 percent slopes","Haplic Udarents",null,30,"bedrock, lithic",19,75,15,0.8,"none",null,null,"none"]
["HI801","Hawaii",143,{"$f":"IF('Plant Control IR Template'!$V$2=B92,C92,\"\")","v":""},"2371628","Kona-Lava flows complex, 2 to 10 percent slopes","Kona",null,60,"bedrock, lithic",5,40,6,1.1000000000000001,"occasional","extremely brief","January, February, March, April, May, June, July, August, September, October, November, December","none"]
["HI801","Hawaii",143,{"$f":"IF('Plant Control IR Template'!$V$2=B93,C93,\"\")","v":""},"2371628","Kona-Lava flows complex, 2 to 10 percent slopes","Lava flows","pahoehoe",35,"bedrock, lithic",0,0,6,0,"none",null,null,"none"]
["HI801","Hawaii",144,{"$f":"IF('Plant Control IR Template'!$V$2=B94,C94,\"\")","v":""},"2371629","Kona-Lava flows complex, 10 to 20 percent slopes","Kona",null,60,"bedrock, lithic",5,40,15,1.1000000000000001,"occasional","extremely brief","January, February, March, April, May, June, July, August, September, October, November, December","none"]
["HI801","Hawaii",144,{"$f":"IF('Plant Control IR Template'!$V$2=B95,C95,\"\")","v":""},"2371629","Kona-Lava flows complex, 10 to 20 percent slopes","Lava flows","pahoehoe",35,"bedrock, lithic",0,0,15,0,"none",null,null,"none"]
["HI801","Hawaii",145,{"$f":"IF('Plant Control IR Template'!$V$2=B96,C96,\"\")","v":""},"2371630","Kamawai-Puuiki complex, moist, 20 to 50 percent slopes","Kamawai","moist",60,"bedrock, lithic",20,80,35,0.6,"none",null,null,"none"]
["HI801","Hawaii",145,{"$f":"IF('Plant Control IR Template'!$V$2=B97,C97,\"\")","v":""},"2371630","Kamawai-Puuiki complex, moist, 20 to 50 percent slopes","Puuiki","moist",35,"bedrock, lithic",5,50,35,0.7,"none",null,null,"none"]
["HI801","Hawaii",146,{"$f":"IF('Plant Control IR Template'!$V$2=B98,C98,\"\")","v":""},"2371631","Lava flows-Kona complex, 10 to 20 percent slopes","Lava flows","pahoehoe",70,"bedrock, lithic",0,0,15,0,"none",null,null,"none"]
["HI801","Hawaii",146,{"$f":"IF('Plant Control IR Template'!$V$2=B99,C99,\"\")","v":""},"2371631","Lava flows-Kona complex, 10 to 20 percent slopes","Kona",null,25,"bedrock, lithic",5,40,15,1.1000000000000001,"occasional","extremely brief","January, February, March, April, May, June, July, August, September, October, November, December","none"]
["HI801","Hawaii",147,{"$f":"IF('Plant Control IR Template'!$V$2=B100,C100,\"\")","v":""},"2371632","Kona very cobbly highly decomposed plant material, 20 to 40 percent slopes","Kona",null,90,"bedrock, lithic",5,40,30,1.1000000000000001,"occasional","extremely brief","January, February, March, April, May, June, July, August, September, October, November, December","none"]
["HI801","Hawaii",148,{"$f":"IF('Plant Control IR Template'!$V$2=B101,C101,\"\")","v":""},"2371633","Kona-Napoopoo complex, 2 to 10 percent slopes","Kona","highly decomposed plant material",70,"bedrock, lithic",5,0,6,null,"occasional","extremely brief","January, February, March, April, May, June, July, August, September, October, November, December","none"]
["HI801","Hawaii",148,{"$f":"IF('Plant Control IR Template'!$V$2=B102,C102,\"\")","v":""},"2371633","Kona-Napoopoo complex, 2 to 10 percent slopes","Napoopoo","hydrous silt loam",26,"bedrock, lithic",19,22,6,2,"occasional","extremely brief","January, February, March, April, May, June, July, August, September, October, November, December","none"]
["HI801","Hawaii",149,{"$f":"IF('Plant Control IR Template'!$V$2=B103,C103,\"\")","v":""},"2371634","Kona-Napoopoo complex, 10 to 20 percent slopes","Kona","highly decomposed plant material",70,"bedrock, lithic",5,0,15,null,"occasional","extremely brief","January, February, March, April, May, June, July, August, September, October, November, December","none"]
["HI801","Hawaii",149,{"$f":"IF('Plant Control IR Template'!$V$2=B104,C104,\"\")","v":""},"2371634","Kona-Napoopoo complex, 10 to 20 percent slopes","Napoopoo","hydrous silt loam",26,"bedrock, lithic",19,22,15,2,"occasional","extremely brief","January, February, March, April, May, June, July, August, September, October, November, December","none"]
["HI801","Hawaii",150,{"$f":"IF('Plant Control IR Template'!$V$2=B105,C105,\"\")","v":""},"2371635","Puuikaaka-Lava flows complex, 2 to 10 percent slopes","Puuikaaka",null,60,"bedrock, lithic",6,50,6,0.5,"none",null,null,"none"]
["HI801","Hawaii",150,{"$f":"IF('Plant Control IR Template'!$V$2=B106,C106,\"\")","v":""},"2371635","Puuikaaka-Lava flows complex, 2 to 10 percent slopes","Lava flows","pahoehoe",35,"bedrock, lithic",0,0,6,0,"none",null,null,"none"]
["HI801","Hawaii",151,{"$f":"IF('Plant Control IR Template'!$V$2=B107,C107,\"\")","v":""},"2371636","Puuikaaka-Lava flows complex, 10 to 20 percent slopes","Puuikaaka",null,60,"bedrock, lithic",6,50,15,0.5,"none",null,null,"none"]
["HI801","Hawaii",151,{"$f":"IF('Plant Control IR Template'!$V$2=B108,C108,\"\")","v":""},"2371636","Puuikaaka-Lava flows complex, 10 to 20 percent slopes","Lava flows","pahoehoe",35,"bedrock, lithic",0,0,15,0,"none",null,null,"none"]
["HI801","Hawaii",152,{"$f":"IF('Plant Control IR Template'!$V$2=B109,C109,\"\")","v":""},"2371637","Lava flows-Puuikaaka complex, 2 to 20 percent slopes","Lava flows","pahoehoe",70,"bedrock, lithic",0,0,10,0,"none",null,null,"none"]
["HI801","Hawaii",152,{"$f":"IF('Plant Control IR Template'!$V$2=B110,C110,\"\")","v":""},"2371637","Lava flows-Puuikaaka complex, 2 to 20 percent slopes","Puuikaaka",null,25,"bedrock, lithic",6,50,10,0.5,"none",null,null,"none"]
["HI801","Hawaii",153,{"$f":"IF('Plant Control IR Template'!$V$2=B111,C111,\"\")","v":""},"2371638","Kamawai extremely cobbly medial highly decomposed plant material, moist, 10 to 20 percent slopes","Kamawai","moist",90,"bedrock, lithic",20,80,15,0.6,"none",null,null,"none"]
["HI801","Hawaii",154,{"$f":"IF('Plant Control IR Template'!$V$2=B112,C112,\"\")","v":""},"2371639","Puuiki-Lava flows complex, moist, 2 to 10 percent slopes","Puuiki","moist",60,"bedrock, lithic",5,50,6,0.7,"none",null,null,"none"]
["HI801","Hawaii",154,{"$f":"IF('Plant Control IR Template'!$V$2=B113,C113,\"\")","v":""},"2371639","Puuiki-Lava flows complex, moist, 2 to 10 percent slopes","Lava flows","pahoehoe",35,"bedrock, lithic",0,0,6,0,"none",null,null,"none"]
["HI801","Hawaii",155,{"$f":"IF('Plant Control IR Template'!$V$2=B114,C114,\"\")","v":""},"2371640","Kamawai extremely cobbly medial highly decomposed plant material, moist, 2 to 10 percent slopes","Kamawai","moist",90,"bedrock, lithic",20,80,6,0.6,"none",null,null,"none"]
["HI801","Hawaii",156,{"$f":"IF('Plant Control IR Template'!$V$2=B115,C115,\"\")","v":""},"2371641","Napuu extremely cobbly medial highly decomposed plant material, 2 to 10 percent slopes","Napuu",null,90,"bedrock, lithic",15,85,6,0.4,"none",null,null,"none"]
["HI801","Hawaii",157,{"$f":"IF('Plant Control IR Template'!$V$2=B116,C116,\"\")","v":""},"2371642","Napuu extremely cobbly medial highly decomposed plant material, 10 to 20 percent slopes","Napuu",null,90,"bedrock, lithic",15,85,15,0.4,"none",null,null,"none"]
["HI801","Hawaii",158,{"$f":"IF('Plant Control IR Template'!$V$2=B117,C117,\"\")","v":""},"2371643","Lava flows-Napuu complex, 2 to 20 percent slopes","Lava flows","`a`a",70,"bedrock, lithic",39,95,10,0.2,"none",null,null,"none"]
["HI801","Hawaii",158,{"$f":"IF('Plant Control IR Template'!$V$2=B118,C118,\"\")","v":""},"2371643","Lava flows-Napuu complex, 2 to 20 percent slopes","Napuu",null,25,"bedrock, lithic",15,85,10,0.4,"none",null,null,"none"]
["HI801","Hawaii",159,{"$f":"IF('Plant Control IR Template'!$V$2=B119,C119,\"\")","v":""},"2371644","Napuu extremely cobbly medial highly decomposed plant material, 40 to 70 percent slopes","Napuu",null,90,"bedrock, lithic",15,85,55,0.4,"none",null,null,"none"]
["HI801","Hawaii",160,{"$f":"IF('Plant Control IR Template'!$V$2=B120,C120,\"\")","v":""},"2371645","Kekake-Mawae complex, 2 to 10 percent slopes","Kekake",null,60,"bedrock, lithic",5,22,6,1.2,"none",null,null,"none"]
["HI801","Hawaii",160,{"$f":"IF('Plant Control IR Template'!$V$2=B121,C121,\"\")","v":""},"2371645","Kekake-Mawae complex, 2 to 10 percent slopes","Mawae",null,35,"bedrock, lithic",40,72,6,1,"none",null,null,"none"]
["HI801","Hawaii",161,{"$f":"IF('Plant Control IR Template'!$V$2=B122,C122,\"\")","v":""},"2371646","Kekake-Mawae complex, 10 to 20 percent slopes","Kekake",null,60,"bedrock, lithic",5,22,15,1.2,"none",null,null,"none"]
["HI801","Hawaii",161,{"$f":"IF('Plant Control IR Template'!$V$2=B123,C123,\"\")","v":""},"2371646","Kekake-Mawae complex, 10 to 20 percent slopes","Mawae",null,35,"bedrock, lithic",40,72,15,1,"none",null,null,"none"]
["HI801","Hawaii",162,{"$f":"IF('Plant Control IR Template'!$V$2=B124,C124,\"\")","v":""},"2371647","Lava flows-Kekake complex, 2 to 10 percent slopes","Lava flows","pahoehoe",70,"bedrock, lithic",0,0,6,0,"none",null,null,"none"]
["HI801","Hawaii",162,{"$f":"IF('Plant Control IR Template'!$V$2=B125,C125,\"\")","v":""},"2371647","Lava flows-Kekake complex, 2 to 10 percent slopes","Kekake",null,25,"bedrock, lithic",5,22,6,1.2,"none",null,null,"none"]
["HI801","Hawaii",163,{"$f":"IF('Plant Control IR Template'!$V$2=B126,C126,\"\")","v":""},"2371648","Lava flows-Kekake complex, 10 to 20 percent slopes","Lava flows","pahoehoe",70,"bedrock, lithic",0,0,15,0,"none",null,null,"none"]
["HI801","Hawaii",163,{"$f":"IF('Plant Control IR Template'!$V$2=B127,C127,\"\")","v":""},"2371648","Lava flows-Kekake complex, 10 to 20 percent slopes","Kekake",null,25,"bedrock, lithic",5,22,15,1.2,"none",null,null,"none"]
["HI801","Hawaii",164,{"$f":"IF('Plant Control IR Template'!$V$2=B128,C128,\"\")","v":""},"2371649","Lava flows-Kekake complex, 2 to 20 percent slopes","Lava flows","pahoehoe",80,"bedrock, lithic",0,0,11,0,"none",null,null,"none"]
["HI801","Hawaii",164,{"$f":"IF('Plant Control IR Template'!$V$2=B129,C129,\"\")","v":""},"2371649","Lava flows-Kekake complex, 2 to 20 percent slopes","Kekake",null,20,"bedrock, lithic",5,22,11,1.2,"none",null,null,"none"]
["HI801","Hawaii",165,{"$f":"IF('Plant Control IR Template'!$V$2=B130,C130,\"\")","v":""},"2371650","Puuiki-Lava flows complex, 2 to 10 percent slopes","Puuiki",null,60,"bedrock, lithic",5,50,6,0.7,"none",null,null,"none"]
["HI801","Hawaii",165,{"$f":"IF('Plant Control IR Template'!$V$2=B131,C131,\"\")","v":""},"2371650","Puuiki-Lava flows complex, 2 to 10 percent slopes","Lava flows","pahoehoe",35,"bedrock, lithic",0,0,6,0,"none",null,null,"none"]
["HI801","Hawaii",166,{"$f":"IF('Plant Control IR Template'!$V$2=B132,C132,\"\")","v":""},"2371651","Puuiki-Lava flows complex, 10 to 20 percent slopes","Puuiki",null,60,"bedrock, lithic",5,50,15,0.7,"none",null,null,"none"]
["HI801","Hawaii",166,{"$f":"IF('Plant Control IR Template'!$V$2=B133,C133,\"\")","v":""},"2371651","Puuiki-Lava flows complex, 10 to 20 percent slopes","Lava flows","pahoehoe",35,"bedrock, lithic",0,0,15,0,"none",null,null,"none"]
["HI801","Hawaii",167,{"$f":"IF('Plant Control IR Template'!$V$2=B134,C134,\"\")","v":""},"2371652","Lava flows-Puuiki complex, 2 to 20 percent slopes","Lava flows","pahoehoe",70,"bedrock, lithic",0,0,11,0,"none",null,null,"none"]
["HI801","Hawaii",167,{"$f":"IF('Plant Control IR Template'!$V$2=B135,C135,\"\")","v":""},"2371652","Lava flows-Puuiki complex, 2 to 20 percent slopes","Puuiki",null,25,"bedrock, lithic",5,50,11,0.7,"none",null,null,"none"]
["HI801","Hawaii",169,{"$f":"IF('Plant Control IR Template'!$V$2=B136,C136,\"\")","v":""},"2371222","Iwalani-Lava flows complex, moist, 2 to 10 percent slopes","Iwalani","moist",60,"bedrock, lithic",10,5,6,1.5,"none",null,null,"none"]
["HI801","Hawaii",169,{"$f":"IF('Plant Control IR Template'!$V$2=B137,C137,\"\")","v":""},"2371222","Iwalani-Lava flows complex, moist, 2 to 10 percent slopes","Lava flows","pahoehoe",40,"bedrock, lithic",0,0,6,0,"none",null,null,"none"]
["HI801","Hawaii",170,{"$f":"IF('Plant Control IR Template'!$V$2=B138,C138,\"\")","v":""},"2371654","Puuiki-Kamawai complex, 2 to 10 percent slopes","Puuiki",null,60,"bedrock, lithic",5,50,6,0.7,"none",null,null,"none"]
["HI801","Hawaii",170,{"$f":"IF('Plant Control IR Template'!$V$2=B139,C139,\"\")","v":""},"2371654","Puuiki-Kamawai complex, 2 to 10 percent slopes","Kamawai",null,35,"bedrock, lithic",20,80,6,0.6,"none",null,null,"none"]
["HI801","Hawaii",172,{"$f":"IF('Plant Control IR Template'!$V$2=B140,C140,\"\")","v":""},"2371655","Kamawai-Puuiki complex, 2 to 10 percent slopes","Kamawai",null,60,"bedrock, lithic",20,80,6,0.6,"none",null,null,"none"]
["HI801","Hawaii",172,{"$f":"IF('Plant Control IR Template'!$V$2=B141,C141,\"\")","v":""},"2371655","Kamawai-Puuiki complex, 2 to 10 percent slopes","Puuiki",null,35,"bedrock, lithic",5,50,6,0.7,"none",null,null,"none"]
["HI801","Hawaii",173,{"$f":"IF('Plant Control IR Template'!$V$2=B142,C142,\"\")","v":""},"2371656","Kamawai-Puuiki complex, 10 to 20 percent slopes","Kamawai",null,60,"bedrock, lithic",20,80,15,0.6,"none",null,null,"none"]
["HI801","Hawaii",173,{"$f":"IF('Plant Control IR Template'!$V$2=B143,C143,\"\")","v":""},"2371656","Kamawai-Puuiki complex, 10 to 20 percent slopes","Puuiki",null,35,"bedrock, lithic",5,50,15,0.7,"none",null,null,"none"]
["HI801","Hawaii",175,{"$f":"IF('Plant Control IR Template'!$V$2=B144,C144,\"\")","v":""},"2371657","Kamawai extremely cobbly medial highly decomposed plant material, 2 to 10 percent slopes","Kamawai",null,90,"bedrock, lithic",20,80,6,0.6,"none",null,null,"none"]
["HI801","Hawaii",176,{"$f":"IF('Plant Control IR Template'!$V$2=B145,C145,\"\")","v":""},"2371658","Kamawai extremely cobbly medial highly decomposed plant material, 10 to 20 percent slopes","Kamawai",null,90,"bedrock, lithic",20,80,15,0.6,"none",null,null,"none"]
["HI801","Hawaii",177,{"$f":"IF('Plant Control IR Template'!$V$2=B146,C146,\"\")","v":""},"2371659","Lava flows-Kamawai complex, 2 to 20 percent slopes","Lava flows","`a`a",60,"bedrock, lithic",39,95,11,0.2,"none",null,null,"none"]
["HI801","Hawaii",177,{"$f":"IF('Plant Control IR Template'!$V$2=B147,C147,\"\")","v":""},"2371659","Lava flows-Kamawai complex, 2 to 20 percent slopes","Kamawai",null,35,"bedrock, lithic",20,80,11,0.6,"none",null,null,"none"]
["HI801","Hawaii",178,{"$f":"IF('Plant Control IR Template'!$V$2=B148,C148,\"\")","v":""},"2371660","Kamawai extremely cobbly highly organic medial silt loam, 20 to 50 percent slopes","Kamawai",null,90,"bedrock, lithic",20,80,35,0.6,"none",null,null,"none"]
["HI801","Hawaii",179,{"$f":"IF('Plant Control IR Template'!$V$2=B149,C149,\"\")","v":""},"2371223","Iwalani-Lava flows complex, moist, 10 to 20 percent slopes","Iwalani","moist",70,"bedrock, lithic",10,5,15,1.5,"none",null,null,"none"]
["HI801","Hawaii",179,{"$f":"IF('Plant Control IR Template'!$V$2=B150,C150,\"\")","v":""},"2371223","Iwalani-Lava flows complex, moist, 10 to 20 percent slopes","Lava flows","pahoehoe",30,"bedrock, lithic",0,0,15,0,"none",null,null,"none"]
["HI801","Hawaii",180,{"$f":"IF('Plant Control IR Template'!$V$2=B151,C151,\"\")","v":""},"2371661","Lava flows-Halekula complex, moist, 2 to 20 percent slope","Lava flows","`a`a",60,"bedrock, lithic",39,95,11,0.2,"none",null,null,"none"]
["HI801","Hawaii",180,{"$f":"IF('Plant Control IR Template'!$V$2=B152,C152,\"\")","v":""},"2371661","Lava flows-Halekula complex, moist, 2 to 20 percent slope","Halekula","moist",35,"bedrock, lithic",27,53,11,1.4,"none",null,null,"none"]
["HI801","Hawaii",201,{"$f":"IF('Plant Control IR Template'!$V$2=B153,C153,\"\")","v":""},"2371662","Honaunau hydrous silt loam, 2 to 10 percent slopes","Honaunau",null,90,"bedrock, lithic",26,0,6,2.6,"occasional","extremely brief","January, February, March, April, May, June, July, August, September, October, November, December","none"]
["HI801","Hawaii",202,{"$f":"IF('Plant Control IR Template'!$V$2=B154,C154,\"\")","v":""},"2371663","Honaunau hydrous silt loam, 10 to 20 percent slopes","Honaunau",null,90,"bedrock, lithic",26,0,15,2.6,"occasional","extremely brief","January, February, March, April, May, June, July, August, September, October, November, December","none"]
["HI801","Hawaii",204,{"$f":"IF('Plant Control IR Template'!$V$2=B155,C155,\"\")","v":""},"2371664","Honaunau cobbly hydrous silt loam, 10 to 20 percent slopes","Honaunau","cobbly",90,"bedrock, lithic",26,10,15,2.6,"occasional","extremely brief","January, February, March, April, May, June, July, August, September, October, November, December","none"]
["HI801","Hawaii",213,{"$f":"IF('Plant Control IR Template'!$V$2=B156,C156,\"\")","v":""},"2371667","Nanaia-Lava flows complex, moist, 2 to 10 percent slopes","Nanaia","moist",60,"bedrock, lithic",6,5,6,0.7,"none",null,null,"none"]
["HI801","Hawaii",213,{"$f":"IF('Plant Control IR Template'!$V$2=B157,C157,\"\")","v":""},"2371667","Nanaia-Lava flows complex, moist, 2 to 10 percent slopes","Lava flows","pahoehoe",35,"bedrock, lithic",0,0,6,0,"none",null,null,"none"]
["HI801","Hawaii",221,{"$f":"IF('Plant Control IR Template'!$V$2=B158,C158,\"\")","v":""},"2371675","Kainaliu silty clay loam, 10 to 20 percent slopes","Kainaliu","silty clay loam",90,"bedrock, lithic",39,34,15,2,"occasional","extremely brief","January, February, March, April, May, June, July, August, September, October, November, December","none"]
["HI801","Hawaii",223,{"$f":"IF('Plant Control IR Template'!$V$2=B159,C159,\"\")","v":""},"2371677","Kainaliu cobbly silty clay loam, 10 to 20 percent slopes","Kainaliu",null,90,"bedrock, lithic",39,42,15,2,"occasional","extremely brief","January, February, March, April, May, June, July, August, September, October, November, December","none"]
["HI801","Hawaii",224,{"$f":"IF('Plant Control IR Template'!$V$2=B160,C160,\"\")","v":""},"2371678","Kainaliu-Lava flows complex, 2 to 10 percent slopes","Kainaliu",null,70,"bedrock, lithic",39,42,6,2,"occasional","extremely brief","January, February, March, April, May, June, July, August, September, October, November, December","none"]
["HI801","Hawaii",224,{"$f":"IF('Plant Control IR Template'!$V$2=B161,C161,\"\")","v":""},"2371678","Kainaliu-Lava flows complex, 2 to 10 percent slopes","Lava flows","`a`a",25,"bedrock, lithic",39,95,6,0.2,"none",null,null,"none"]
["HI801","Hawaii",225,{"$f":"IF('Plant Control IR Template'!$V$2=B162,C162,\"\")","v":""},"2371679","Kainaliu-Lava flows complex, 10 to 20 percent slopes","Kainaliu",null,70,"bedrock, lithic",39,42,15,2,"occasional","extremely brief","January, February, March, April, May, June, July, August, September, October, November, December","none"]
["HI801","Hawaii",225,{"$f":"IF('Plant Control IR Template'!$V$2=B163,C163,\"\")","v":""},"2371679","Kainaliu-Lava flows complex, 10 to 20 percent slopes","Lava flows","`a`a",25,"bedrock, lithic",39,95,15,0.2,"none",null,null,"none"]
["HI801","Hawaii",226,{"$f":"IF('Plant Control IR Template'!$V$2=B164,C164,\"\")","v":""},"2371680","Kainaliu cobbly silty clay loam, 20 to 40 percent slopes","Kainaliu",null,90,"bedrock, lithic",39,42,30,2,"occasional","extremely brief","January, February, March, April, May, June, July, August, September, October, November, December","none"]
["HI801","Hawaii",227,{"$f":"IF('Plant Control IR Template'!$V$2=B165,C165,\"\")","v":""},"2371681","Kainaliu-Waiaha complex, 10 to 20 percent slopes","Kainaliu",null,60,"bedrock, lithic",39,42,15,2,"occasional","extremely brief","January, February, March, April, May, June, July, August, September, October, November, December","none"]
["HI801","Hawaii",227,{"$f":"IF('Plant Control IR Template'!$V$2=B166,C166,\"\")","v":""},"2371681","Kainaliu-Waiaha complex, 10 to 20 percent slopes","Waiaha",null,35,"bedrock, lithic",15,37,15,1.3,"occasional","extremely brief","January, February, March, April, May, June, July, August, September, October, November, December","none"]
["HI801","Hawaii",231,{"$f":"IF('Plant Control IR Template'!$V$2=B167,C167,\"\")","v":""},"2371683","Honuaulu hydrous silt loam, 10 to 20 percent slopes","Honuaulu",null,90,"bedrock, lithic",29,18,15,1.7,"occasional","extremely brief","January, February, March, April, May, June, July, August, September, October, November, December","none"]
["HI801","Hawaii",232,{"$f":"IF('Plant Control IR Template'!$V$2=B168,C168,\"\")","v":""},"2371684","Honuaulu cobbly hydrous silt loam, 2 to 10 percent slopes","Honuaulu","cobbly",90,"bedrock, lithic",29,21,6,1.7,"occasional","extremely brief","January, February, March, April, May, June, July, August, September, October, November, December","none"]
["HI801","Hawaii",233,{"$f":"IF('Plant Control IR Template'!$V$2=B169,C169,\"\")","v":""},"2371685","Honuaulu cobbly hydrous silt loam, 10 to 20 percent slopes","Honuaulu","cobbly",90,"bedrock, lithic",29,21,15,1.7,"occasional","extremely brief","January, February, March, April, May, June, July, August, September, October, November, December","none"]
["HI801","Hawaii",234,{"$f":"IF('Plant Control IR Template'!$V$2=B170,C170,\"\")","v":""},"2371686","Honuaulu cobbly hydrous silt loam, 20 to 40 percent slopes","Honuaulu","cobbly",90,"bedrock, lithic",29,21,30,1.7,"occasional","extremely brief","January, February, March, April, May, June, July, August, September, October, November, December","none"]
["HI801","Hawaii",235,{"$f":"IF('Plant Control IR Template'!$V$2=B171,C171,\"\")","v":""},"2371687","Honuaulu-Kealakekua complex, 10 to 20 percent slopes","Honuaulu",null,50,"bedrock, lithic",29,18,15,1.7,"occasional","extremely brief","January, February, March, April, May, June, July, August, September, October, November, December","none"]
["HI801","Hawaii",235,{"$f":"IF('Plant Control IR Template'!$V$2=B172,C172,\"\")","v":""},"2371687","Honuaulu-Kealakekua complex, 10 to 20 percent slopes","Kealakekua",null,35,"bedrock, lithic",31,0,15,2.6,"occasional","extremely brief","January, February, March, April, May, June, July, August, September, October, November, December","none"]
["HI801","Hawaii",236,{"$f":"IF('Plant Control IR Template'!$V$2=B173,C173,\"\")","v":""},"2371688","Honuaulu-Kealakekua complex, 2 to 10 percent slopes","Honuaulu",null,50,"bedrock, lithic",29,18,6,1.7,"occasional","extremely brief","January, February, March, April, May, June, July, August, September, October, November, December","none"]
["HI801","Hawaii",236,{"$f":"IF('Plant Control IR Template'!$V$2=B174,C174,\"\")","v":""},"2371688","Honuaulu-Kealakekua complex, 2 to 10 percent slopes","Kealakekua",null,35,"bedrock, lithic",31,0,6,2.6,"occasional","extremely brief","January, February, March, April, May, June, July, August, September, October, November, December","none"]
["HI801","Hawaii",242,{"$f":"IF('Plant Control IR Template'!$V$2=B175,C175,\"\")","v":""},"2371689","Waiaha medial silt loam, 2 to 10 percent slopes","Waiaha","medial silt loam",90,"bedrock, lithic",15,13,6,1.6,"occasional","extremely brief","January, February, March, April, May, June, July, August, September, October, November, December","none"]
["HI801","Hawaii",243,{"$f":"IF('Plant Control IR Template'!$V$2=B176,C176,\"\")","v":""},"2371690","Waiaha medial silt loam, 10 to 20 percent slopes","Waiaha","medial silt loam",90,"bedrock, lithic",15,13,15,1.6,"occasional","extremely brief","January, February, March, April, May, June, July, August, September, October, November, December","none"]
["HI801","Hawaii",244,{"$f":"IF('Plant Control IR Template'!$V$2=B177,C177,\"\")","v":""},"2371691","Waiaha cobbly medial silt loam, 2 to 10 percent slopes","Waiaha",null,90,"bedrock, lithic",15,37,6,1.3,"occasional","extremely brief","January, February, March, April, May, June, July, August, September, October, November, December","none"]
["HI801","Hawaii",245,{"$f":"IF('Plant Control IR Template'!$V$2=B178,C178,\"\")","v":""},"2371692","Waiaha cobbly medial silt loam, 10 to 20 percent slopes","Waiaha",null,90,"bedrock, lithic",15,37,15,1.3,"occasional","extremely brief","January, February, March, April, May, June, July, August, September, October, November, December","none"]
["HI801","Hawaii",248,{"$f":"IF('Plant Control IR Template'!$V$2=B179,C179,\"\")","v":""},"2371694","Waiaha-Lava flows complex, 40 to 99 percent slopes","Waiaha",null,60,"bedrock, lithic",15,37,70,1.3,"occasional","extremely brief","January, February, March, April, May, June, July, August, September, October, November, December","none"]
["HI801","Hawaii",248,{"$f":"IF('Plant Control IR Template'!$V$2=B180,C180,\"\")","v":""},"2371694","Waiaha-Lava flows complex, 40 to 99 percent slopes","Lava flows",null,35,null,80,0,70,null,"none",null,null,"none"]
["HI801","Hawaii",249,{"$f":"IF('Plant Control IR Template'!$V$2=B181,C181,\"\")","v":""},"2371695","Waiaha-Punaluu-Lava flows complex, 2 to 10 percent slopes","Waiaha","medial silt loam",50,"bedrock, lithic",15,13,6,1.6,"occasional","extremely brief","January, February, March, April, May, June, July, August, September, October, November, December","none"]
["HI801","Hawaii",249,{"$f":"IF('Plant Control IR Template'!$V$2=B182,C182,\"\")","v":""},"2371695","Waiaha-Punaluu-Lava flows complex, 2 to 10 percent slopes","Punaluu",null,30,"bedrock, lithic",6,5,6,null,"occasional","extremely brief","January, February, March, April, May, June, July, August, September, October, November, December","none"]
["HI801","Hawaii",249,{"$f":"IF('Plant Control IR Template'!$V$2=B183,C183,\"\")","v":""},"2371695","Waiaha-Punaluu-Lava flows complex, 2 to 10 percent slopes","Lava flows","pahoehoe",15,"bedrock, lithic",0,0,6,0,"none",null,null,"none"]
["HI801","Hawaii",250,{"$f":"IF('Plant Control IR Template'!$V$2=B184,C184,\"\")","v":""},"2371696","Waiaha-Punaluu-Lava flows complex, 10 to 20 percent slopes","Waiaha","medial silt loam",50,"bedrock, lithic",15,13,15,1.6,"occasional","extremely brief","January, February, March, April, May, June, July, August, September, October, November, December","none"]
["HI801","Hawaii",250,{"$f":"IF('Plant Control IR Template'!$V$2=B185,C185,\"\")","v":""},"2371696","Waiaha-Punaluu-Lava flows complex, 10 to 20 percent slopes","Punaluu",null,30,"bedrock, lithic",6,5,15,null,"occasional","extremely brief","January, February, March, April, May, June, July, August, September, October, November, December","none"]
["HI801","Hawaii",250,{"$f":"IF('Plant Control IR Template'!$V$2=B186,C186,\"\")","v":""},"2371696","Waiaha-Punaluu-Lava flows complex, 10 to 20 percent slopes","Lava flows","pahoehoe",20,"bedrock, lithic",0,0,15,0,"none",null,null,"none"]
["HI801","Hawaii",252,{"$f":"IF('Plant Control IR Template'!$V$2=B187,C187,\"\")","v":""},"2371697","Napoopoo hydrous silt loam, 10 to 20 percent slopes","Napoopoo","hydrous silt loam",90,"bedrock, lithic",19,22,15,2,"occasional","extremely brief","January, February, March, April, May, June, July, August, September, October, November, December","none"]
["HI801","Hawaii",253,{"$f":"IF('Plant Control IR Template'!$V$2=B188,C188,\"\")","v":""},"2371698","Napoopoo cobbly hydrous silt loam, 2 to 10 percent slopes","Napoopoo",null,90,"bedrock, lithic",19,28,6,1.9,"occasional","extremely brief","January, February, March, April, May, June, July, August, September, October, November, December","none"]
["HI801","Hawaii",254,{"$f":"IF('Plant Control IR Template'!$V$2=B189,C189,\"\")","v":""},"2371699","Napoopoo cobbly hydrous silt loam, 10 to 20 percent slopes","Napoopoo",null,90,"bedrock, lithic",19,28,15,1.9,"occasional","extremely brief","January, February, March, April, May, June, July, August, September, October, November, December","none"]
["HI801","Hawaii",256,{"$f":"IF('Plant Control IR Template'!$V$2=B190,C190,\"\")","v":""},"2371700","Napoopoo-Lava flows complex, 10 to 20 percent slopes","Napoopoo",null,70,"bedrock, lithic",19,28,15,1.9,"occasional","extremely brief","January, February, March, April, May, June, July, August, September, October, November, December","none"]
["HI801","Hawaii",256,{"$f":"IF('Plant Control IR Template'!$V$2=B191,C191,\"\")","v":""},"2371700","Napoopoo-Lava flows complex, 10 to 20 percent slopes","Lava flows",null,25,null,80,0,15,null,"none",null,null,"none"]
["HI801","Hawaii",257,{"$f":"IF('Plant Control IR Template'!$V$2=B192,C192,\"\")","v":""},"2371701","Napoopoo cobbly hydrous silt loam, 20 to 40 percent slopes","Napoopoo",null,90,"bedrock, lithic",19,28,30,1.9,"occasional","extremely brief","January, February, March, April, May, June, July, August, September, October, November, December","none"]
["HI801","Hawaii",258,{"$f":"IF('Plant Control IR Template'!$V$2=B193,C193,\"\")","v":""},"2371702","Napoopoo-Honuaulu complex, 10 to 20 percent slopes","Napoopoo",null,60,"bedrock, lithic",19,28,15,1.9,"occasional","extremely brief","January, February, March, April, May, June, July, August, September, October, November, December","none"]
["HI801","Hawaii",258,{"$f":"IF('Plant Control IR Template'!$V$2=B194,C194,\"\")","v":""},"2371702","Napoopoo-Honuaulu complex, 10 to 20 percent slopes","Honuaulu","cobbly",35,"bedrock, lithic",29,21,15,1.7,"occasional","extremely brief","January, February, March, April, May, June, July, August, September, October, November, December","none"]
["HI801","Hawaii",259,{"$f":"IF('Plant Control IR Template'!$V$2=B195,C195,\"\")","v":""},"2371703","Napoopoo-Honuaulu complex, 20 to 40 percent slopes","Napoopoo",null,60,"bedrock, lithic",19,28,30,1.9,"occasional","extremely brief","January, February, March, April, May, June, July, August, September, October, November, December","none"]
["HI801","Hawaii",259,{"$f":"IF('Plant Control IR Template'!$V$2=B196,C196,\"\")","v":""},"2371703","Napoopoo-Honuaulu complex, 20 to 40 percent slopes","Honuaulu","cobbly",35,"bedrock, lithic",29,21,30,1.7,"occasional","extremely brief","January, February, March, April, May, June, July, August, September, October, November, December","none"]
["HI801","Hawaii",260,{"$f":"IF('Plant Control IR Template'!$V$2=B197,C197,\"\")","v":""},"2371704","Kealakekua hydrous silty clay loam, 2 to 10 percent slopes","Kealakekua",null,90,"bedrock, lithic",31,0,6,2.6,"occasional","extremely brief","January, February, March, April, May, June, July, August, September, October, November, December","none"]
["HI801","Hawaii",261,{"$f":"IF('Plant Control IR Template'!$V$2=B198,C198,\"\")","v":""},"2371705","Kealakekua hydrous silty clay loam, 10 to 20 percent slopes","Kealakekua",null,90,"bedrock, lithic",31,0,15,2.6,"occasional","extremely brief","January, February, March, April, May, June, July, August, September, October, November, December","none"]
["HI801","Hawaii",264,{"$f":"IF('Plant Control IR Template'!$V$2=B199,C199,\"\")","v":""},"2371706","Kealakekua cobbly hydrous silty clay loam, 2 to 10 percent slopes","Kealakekua","cobbly",90,"bedrock, lithic",31,25,6,2.2000000000000002,"occasional","extremely brief","January, February, March, April, May, June, July, August, September, October, November, December","none"]
["HI801","Hawaii",265,{"$f":"IF('Plant Control IR Template'!$V$2=B200,C200,\"\")","v":""},"2371707","Kealakekua cobbly hydrous silty clay loam, 10 to 20 percent slopes","Kealakekua","cobbly",90,"bedrock, lithic",31,25,15,2.2000000000000002,"occasional","extremely brief","January, February, March, April, May, June, July, August, September, October, November, December","none"]
["HI801","Hawaii",266,{"$f":"IF('Plant Control IR Template'!$V$2=B201,C201,\"\")","v":""},"2371708","Kealakekua cobbly hydrous silty clay loam, 20 to 40 percent slopes","Kealakekua","cobbly",90,"bedrock, lithic",31,25,30,2.2000000000000002,"occasional","extremely brief","January, February, March, April, May, June, July, August, September, October, November, December","none"]
["HI801","Hawaii",271,{"$f":"IF('Plant Control IR Template'!$V$2=B202,C202,\"\")","v":""},"2371228","Lava flows-Kanohina complex, 2 to 20 percent slopes","Lava flows","pahoehoe",60,"bedrock, lithic",0,0,11,0,"none",null,null,"none"]
["HI801","Hawaii",271,{"$f":"IF('Plant Control IR Template'!$V$2=B203,C203,\"\")","v":""},"2371228","Lava flows-Kanohina complex, 2 to 20 percent slopes","Kanohina",null,40,"bedrock, lithic",6,0,11,0.6,"none",null,null,"none"]
["HI801","Hawaii",272,{"$f":"IF('Plant Control IR Template'!$V$2=B204,C204,\"\")","v":""},"2371229","Kanohina ashy very fine sandy loam, 2 to 10 percent slopes","Kanohina",null,90,"bedrock, lithic",6,0,6,0.6,"none",null,null,"none"]
["HI801","Hawaii",275,{"$f":"IF('Plant Control IR Template'!$V$2=B205,C205,\"\")","v":""},"2371230","Kapulehu-Lava flows complex, 2 to 10 percent slopes","Kapulehu",null,60,"bedrock, lithic",26,55,6,1.3,"none",null,null,"none"]
["HI801","Hawaii",275,{"$f":"IF('Plant Control IR Template'!$V$2=B206,C206,\"\")","v":""},"2371230","Kapulehu-Lava flows complex, 2 to 10 percent slopes","Lava flows","`a`a",40,"bedrock, lithic",39,95,6,0.2,"none",null,null,"none"]
["HI801","Hawaii",276,{"$f":"IF('Plant Control IR Template'!$V$2=B207,C207,\"\")","v":""},"2371231","Kapulehu very cobbly medial silt loam, 2 to 10 percent slopes","Kapulehu",null,95,"bedrock, lithic",26,55,6,1.3,"none",null,null,"none"]
["HI801","Hawaii",277,{"$f":"IF('Plant Control IR Template'!$V$2=B208,C208,\"\")","v":""},"2371232","Kapulehu very cobbly medial silt loam, 10 to 20 percent slopes","Kapulehu",null,95,"bedrock, lithic",26,55,15,1.3,"none",null,null,"none"]
["HI801","Hawaii",280,{"$f":"IF('Plant Control IR Template'!$V$2=B209,C209,\"\")","v":""},"2371233","Nanaia-Lava flows complex, 2 to 10 percent slopes","Nanaia",null,60,"bedrock, lithic",6,5,6,0.7,"none",null,null,"none"]
["HI801","Hawaii",280,{"$f":"IF('Plant Control IR Template'!$V$2=B210,C210,\"\")","v":""},"2371233","Nanaia-Lava flows complex, 2 to 10 percent slopes","Lava flows","pahoehoe",35,"bedrock, lithic",0,0,6,0,"none",null,null,"none"]
["HI801","Hawaii",281,{"$f":"IF('Plant Control IR Template'!$V$2=B211,C211,\"\")","v":""},"2371713","Lava flows-Nanaia complex, 2 to 20 percent slopes","Lava flows","pahoehoe",60,"bedrock, lithic",0,0,11,0,"none",null,null,"none"]
["HI801","Hawaii",281,{"$f":"IF('Plant Control IR Template'!$V$2=B212,C212,\"\")","v":""},"2371713","Lava flows-Nanaia complex, 2 to 20 percent slopes","Nanaia",null,35,"bedrock, lithic",6,5,11,0.7,"none",null,null,"none"]
["HI801","Hawaii",290,{"$f":"IF('Plant Control IR Template'!$V$2=B213,C213,\"\")","v":""},"2371235","Keaa cobbly medial loam, 2 to 10 percent slopes","Keaa",null,90,"bedrock, lithic",18,37,6,1.5,"none",null,null,"none"]
["HI801","Hawaii",291,{"$f":"IF('Plant Control IR Template'!$V$2=B214,C214,\"\")","v":""},"2371236","Keaa cobbly medial loam, 10 to 20 percent slopes","Keaa",null,90,"bedrock, lithic",18,37,15,1.5,"none",null,null,"none"]
["HI801","Hawaii",292,{"$f":"IF('Plant Control IR Template'!$V$2=B215,C215,\"\")","v":""},"2371237","Keaa-Kiolakaa complex, 2 to 10 percent slopes","Keaa",null,60,"bedrock, lithic",18,37,6,1.5,"none",null,null,"none"]
["HI801","Hawaii",292,{"$f":"IF('Plant Control IR Template'!$V$2=B216,C216,\"\")","v":""},"2371237","Keaa-Kiolakaa complex, 2 to 10 percent slopes","Kiolakaa",null,35,"bedrock, lithic",25,14,6,1.9,"none",null,null,"none"]
["HI801","Hawaii",300,{"$f":"IF('Plant Control IR Template'!$V$2=B217,C217,\"\")","v":""},"2371238","Kamaoa medial loam, 2 to 10 percent slopes","Kamaoa",null,90,"bedrock, lithic",68,0,6,2.6,"none",null,null,"none"]
["HI801","Hawaii",301,{"$f":"IF('Plant Control IR Template'!$V$2=B218,C218,\"\")","v":""},"2371239","Kamaoa cobbly medial loam, 50 to 70 percent slopes","Kamaoa","cobbly",90,"bedrock, lithic",68,18,60,2.6,"none",null,null,"none"]
["HI801","Hawaii",305,{"$f":"IF('Plant Control IR Template'!$V$2=B219,C219,\"\")","v":""},"2371240","Kiolakaa medial loam, 2 to 10 percent slopes","Kiolakaa",null,90,"bedrock, lithic",25,14,6,1.9,"none",null,null,"none"]
["HI801","Hawaii",310,{"$f":"IF('Plant Control IR Template'!$V$2=B220,C220,\"\")","v":""},"2371719","Auwaiakeakua extremely cobbly silt loam, 2 to 10 percent slopes","Auwaiakeakua",null,90,"bedrock, lithic",33,79,6,1,"none",null,null,"none"]
["HI801","Hawaii",311,{"$f":"IF('Plant Control IR Template'!$V$2=B221,C221,\"\")","v":""},"2371720","Auwaiakeakua extremely cobbly silt loam, 10 to 20 percent slopes","Auwaiakeakua",null,90,"bedrock, lithic",33,79,15,1,"none",null,null,"none"]
["HI801","Hawaii",312,{"$f":"IF('Plant Control IR Template'!$V$2=B222,C222,\"\")","v":""},"2401297","Lava flows-Auwaiakeakua complex, 2 to 20 percent slopes","Lava flows","`a`a",60,"bedrock, lithic",39,95,15,0.2,"none",null,null,"none"]
["HI801","Hawaii",312,{"$f":"IF('Plant Control IR Template'!$V$2=B223,C223,\"\")","v":""},"2401297","Lava flows-Auwaiakeakua complex, 2 to 20 percent slopes","Auwaiakeakua",null,40,"bedrock, lithic",33,79,15,1,"none",null,null,"none"]
["HI801","Hawaii",316,{"$f":"IF('Plant Control IR Template'!$V$2=B224,C224,\"\")","v":""},"2371721","Lava flows-Kiholo complex, 2 to 20 percent slopes","Lava flows","pahoehoe",70,"bedrock, lithic",0,0,11,0,"none",null,null,"none"]
["HI801","Hawaii",316,{"$f":"IF('Plant Control IR Template'!$V$2=B225,C225,\"\")","v":""},"2371721","Lava flows-Kiholo complex, 2 to 20 percent slopes","Kiholo",null,30,"bedrock, lithic",8,4,11,1.6,"very rare","extremely brief","January, February, March, April, May, June, July, August, September, October, November, December","none"]
["HI801","Hawaii",317,{"$f":"IF('Plant Control IR Template'!$V$2=B226,C226,\"\")","v":""},"2371722","Kiholo-Lava flows complex, 2 to 10 percent slopes","Kiholo",null,60,"bedrock, lithic",8,4,6,1.6,"very rare","extremely brief","January, February, March, April, May, June, July, August, September, October, November, December","none"]
["HI801","Hawaii",317,{"$f":"IF('Plant Control IR Template'!$V$2=B227,C227,\"\")","v":""},"2371722","Kiholo-Lava flows complex, 2 to 10 percent slopes","Lava flows","pahoehoe",40,"bedrock, lithic",0,0,6,0,"none",null,null,"none"]
["HI801","Hawaii",330,{"$f":"IF('Plant Control IR Template'!$V$2=B228,C228,\"\")","v":""},"2371723","Kahaumanu-Lava flows complex, 2 to 10 percent slopes","Kahaumanu",null,60,"bedrock, lithic",15,20,6,1.8,"none",null,null,"none"]
["HI801","Hawaii",330,{"$f":"IF('Plant Control IR Template'!$V$2=B229,C229,\"\")","v":""},"2371723","Kahaumanu-Lava flows complex, 2 to 10 percent slopes","Lava flows","pahoehoe",40,"bedrock, lithic",0,0,6,0,"none",null,null,"none"]
["HI801","Hawaii",331,{"$f":"IF('Plant Control IR Template'!$V$2=B230,C230,\"\")","v":""},"2371724","Kahaumanu-Lava flows complex, 10 to 20 percent slopes","Kahaumanu",null,60,"bedrock, lithic",15,20,15,1.8,"none",null,null,"none"]
["HI801","Hawaii",331,{"$f":"IF('Plant Control IR Template'!$V$2=B231,C231,\"\")","v":""},"2371724","Kahaumanu-Lava flows complex, 10 to 20 percent slopes","Lava flows","pahoehoe",40,"bedrock, lithic",0,0,15,0,"none",null,null,"none"]
["HI801","Hawaii",332,{"$f":"IF('Plant Control IR Template'!$V$2=B232,C232,\"\")","v":""},"2371725","Lava flows-Kahaumanu complex, 2 to 20 percent slopes","Lava flows","pahoehoe",70,"bedrock, lithic",0,0,11,0,"none",null,null,"none"]
["HI801","Hawaii",332,{"$f":"IF('Plant Control IR Template'!$V$2=B233,C233,\"\")","v":""},"2371725","Lava flows-Kahaumanu complex, 2 to 20 percent slopes","Kahaumanu",null,30,"bedrock, lithic",15,20,11,1.8,"none",null,null,"none"]
["HI801","Hawaii",333,{"$f":"IF('Plant Control IR Template'!$V$2=B234,C234,\"\")","v":""},"2371794","Puu Pa very cobbly medial very fine sandy loam, 6 to 12 percent slopes","Puu Pa",null,100,"bedrock, lithic",50,38,9,3.9,"none",null,null,"none"]
["HI801","Hawaii",334,{"$f":"IF('Plant Control IR Template'!$V$2=B235,C235,\"\")","v":""},"2371795","Puu Pa very cobbly medial very fine sandy loam, 12 to 20 percent slopes","Puu Pa",null,100,"bedrock, lithic",50,38,16,3.9,"none",null,null,"none"]
["HI801","Hawaii",335,{"$f":"IF('Plant Control IR Template'!$V$2=B236,C236,\"\")","v":""},"2371796","Waikaloa-Puu Pa complex, 10 to 20 percent slopes","Waikaloa",null,70,null,80,3,15,5.0999999999999996,"none",null,null,"none"]
["HI801","Hawaii",335,{"$f":"IF('Plant Control IR Template'!$V$2=B237,C237,\"\")","v":""},"2371796","Waikaloa-Puu Pa complex, 10 to 20 percent slopes","Puu Pa","medial very fine sandy loam",30,"bedrock, lithic",50,28,15,4.0999999999999996,"none",null,null,"none"]
["HI801","Hawaii",336,{"$f":"IF('Plant Control IR Template'!$V$2=B238,C238,\"\")","v":""},"2371797","Puako fine sandy loam, 0 to 6 percent slopes","Puako",null,100,null,80,0,3,4.8,"occasional","very brief","January, February, March, April, May, June, July, August, September, October, November, December","none"]
["HI801","Hawaii",337,{"$f":"IF('Plant Control IR Template'!$V$2=B239,C239,\"\")","v":""},"2371798","Waikaloa-Puu Pa complex, 2 to 10 percent slopes","Waikaloa",null,70,null,80,3,6,5.0999999999999996,"none",null,null,"none"]
["HI801","Hawaii",337,{"$f":"IF('Plant Control IR Template'!$V$2=B240,C240,\"\")","v":""},"2371798","Waikaloa-Puu Pa complex, 2 to 10 percent slopes","Puu Pa","medial very fine sandy loam",28,"bedrock, lithic",50,28,6,4.0999999999999996,"none",null,null,"none"]
["HI801","Hawaii",340,{"$f":"IF('Plant Control IR Template'!$V$2=B241,C241,\"\")","v":""},"2371726","Waawaa medial silt loam, 2 to 10 percent slopes","Waawaa",null,100,null,80,0,6,3,"none",null,null,"none"]
["HI801","Hawaii",341,{"$f":"IF('Plant Control IR Template'!$V$2=B242,C242,\"\")","v":""},"2371727","Waawaa medial silt loam, 10 to 20 percent slopes","Waawaa",null,100,null,80,0,15,3,"none",null,null,"none"]
["HI801","Hawaii",342,{"$f":"IF('Plant Control IR Template'!$V$2=B243,C243,\"\")","v":""},"2371728","Waawaa medial silt loam, 40 to 70 percent slopes","Waawaa",null,100,null,80,0,55,3,"none",null,null,"none"]
["HI801","Hawaii",345,{"$f":"IF('Plant Control IR Template'!$V$2=B244,C244,\"\")","v":""},"2371799","Waikaloa medial very fine sandy loam, 2 to 10 percent slopes","Waikaloa",null,90,null,80,3,6,5.0999999999999996,"none",null,null,"none"]
["HI801","Hawaii",346,{"$f":"IF('Plant Control IR Template'!$V$2=B245,C245,\"\")","v":""},"2371729","Waikaloa medial very fine sandy loam, 10 to 20 percent slopes","Waikaloa",null,90,null,80,3,15,5.0999999999999996,"none",null,null,"none"]
["HI801","Hawaii",347,{"$f":"IF('Plant Control IR Template'!$V$2=B246,C246,\"\")","v":""},"2371801","Waikaloa medial very fine sandy loam, 20 to 50 percent slopes","Waikaloa",null,90,null,80,3,35,5.0999999999999996,"none",null,null,"none"]
["HI801","Hawaii",350,{"$f":"IF('Plant Control IR Template'!$V$2=B247,C247,\"\")","v":""},"2371730","Nanuku extremely cobbly silt loam, 2 to 10 percent slopes","Nanuku",null,90,"bedrock, lithic",30,78,6,0.9,"none",null,null,"none"]
["HI801","Hawaii",351,{"$f":"IF('Plant Control IR Template'!$V$2=B248,C248,\"\")","v":""},"2371803","Nanuku extremely cobbly silt loam, 10 to 20 percent slopes","Nanuku",null,90,"bedrock, lithic",30,78,15,0.9,"none",null,null,"none"]
["HI801","Hawaii",352,{"$f":"IF('Plant Control IR Template'!$V$2=B249,C249,\"\")","v":""},"2371804","Lava flows-Nanuku complex, 2 to 20 percent slopes","Lava flows","`a`a",60,"bedrock, lithic",39,95,11,0.2,"none",null,null,"none"]
["HI801","Hawaii",352,{"$f":"IF('Plant Control IR Template'!$V$2=B250,C250,\"\")","v":""},"2371804","Lava flows-Nanuku complex, 2 to 20 percent slopes","Nanuku",null,40,"bedrock, lithic",30,78,11,0.9,"none",null,null,"none"]
["HI801","Hawaii",356,{"$f":"IF('Plant Control IR Template'!$V$2=B251,C251,\"\")","v":""},"2371731","Akahipuu very cobbly medial silt loam, 2 to 10 percent slopes","Akahipuu",null,90,"bedrock, lithic",38,56,6,1.4,"none",null,null,"none"]
["HI801","Hawaii",357,{"$f":"IF('Plant Control IR Template'!$V$2=B252,C252,\"\")","v":""},"2371732","Akahipuu very cobbly medial silt loam, 10 to 20 percent slopes","Akahipuu",null,90,"bedrock, lithic",38,56,15,1.4,"none",null,null,"none"]
["HI801","Hawaii",370,{"$f":"IF('Plant Control IR Template'!$V$2=B253,C253,\"\")","v":""},"2371807","Waikui-Hapuna complex, 2 to 10 percent slopes","Waikui",null,70,null,80,52,9,3.9,"none",null,null,"none"]
["HI801","Hawaii",370,{"$f":"IF('Plant Control IR Template'!$V$2=B254,C254,\"\")","v":""},"2371807","Waikui-Hapuna complex, 2 to 10 percent slopes","Hapuna",null,30,"petrocalcic",12,52,9,2.7,"none",null,null,"none"]
["HI801","Hawaii",371,{"$f":"IF('Plant Control IR Template'!$V$2=B255,C255,\"\")","v":""},"2371808","Waikui-Hapuna complex, 10 to 20 percent slopes","Waikui",null,70,null,80,52,16,3.9,"none",null,null,"none"]
["HI801","Hawaii",371,{"$f":"IF('Plant Control IR Template'!$V$2=B256,C256,\"\")","v":""},"2371808","Waikui-Hapuna complex, 10 to 20 percent slopes","Hapuna",null,30,"petrocalcic",12,52,16,2.7,"none",null,null,"none"]
["HI801","Hawaii",373,{"$f":"IF('Plant Control IR Template'!$V$2=B257,C257,\"\")","v":""},"2371810","Hapuna-Waikui-Lalamilo complex, 0 to 20 percent slopes","Hapuna",null,35,"petrocalcic",12,52,10,2.7,"none",null,null,"none"]
["HI801","Hawaii",373,{"$f":"IF('Plant Control IR Template'!$V$2=B258,C258,\"\")","v":""},"2371810","Hapuna-Waikui-Lalamilo complex, 0 to 20 percent slopes","Waikui",null,35,null,80,52,10,3.9,"none",null,null,"none"]
["HI801","Hawaii",373,{"$f":"IF('Plant Control IR Template'!$V$2=B259,C259,\"\")","v":""},"2371810","Hapuna-Waikui-Lalamilo complex, 0 to 20 percent slopes","Lalamilo",null,20,"duripan",45,6,10,5,"rare","extremely brief",null,"none"]
["HI801","Hawaii",374,{"$f":"IF('Plant Control IR Template'!$V$2=B260,C260,\"\")","v":""},"2371811","Rock outcrop-Waikui-Hapuna complex, 2 to 70 percent slopes","Rock outcrop","basalt",40,null,80,0,20,null,"none",null,null,"none"]
["HI801","Hawaii",374,{"$f":"IF('Plant Control IR Template'!$V$2=B261,C261,\"\")","v":""},"2371811","Rock outcrop-Waikui-Hapuna complex, 2 to 70 percent slopes","Waikui",null,30,null,80,52,20,3.9,"none",null,null,"none"]
["HI801","Hawaii",374,{"$f":"IF('Plant Control IR Template'!$V$2=B262,C262,\"\")","v":""},"2371811","Rock outcrop-Waikui-Hapuna complex, 2 to 70 percent slopes","Hapuna",null,20,"petrocalcic",12,52,20,2.7,"none",null,null,"none"]
["HI801","Hawaii",375,{"$f":"IF('Plant Control IR Template'!$V$2=B263,C263,\"\")","v":""},"2371812","Kawaihae very cobbly very fine sandy loam, 6 to 12 percent slopes","Kawaihae",null,95,"bedrock, lithic",33,18,9,3.2,"none",null,null,"none"]
["HI801","Hawaii",376,{"$f":"IF('Plant Control IR Template'!$V$2=B264,C264,\"\")","v":""},"2371813","Kawaihae very cobbly very fine sandy loam, 12 to 20 percent slopes","Kawaihae",null,90,"bedrock, lithic",33,18,16,3.2,"none",null,null,"none"]
["HI801","Hawaii",377,{"$f":"IF('Plant Control IR Template'!$V$2=B265,C265,\"\")","v":""},"2371814","Kawaihae very cobbly silt loam,  6 to 20 percent slopes","Kawaihae","eroded",90,"bedrock, lithic",31,50,13,2.2000000000000002,"none",null,null,"none"]
["HI801","Hawaii",379,{"$f":"IF('Plant Control IR Template'!$V$2=B266,C266,\"\")","v":""},"2371815","Rock outcrop-Kamakoa complex, 6 to 20 percent slopes","Rock outcrop","basalt",70,null,80,0,12,null,"none",null,null,"none"]
["HI801","Hawaii",379,{"$f":"IF('Plant Control IR Template'!$V$2=B267,C267,\"\")","v":""},"2371815","Rock outcrop-Kamakoa complex, 6 to 20 percent slopes","Kamakoa",null,25,null,80,1,12,3.5,"occasional, rare","very brief","January, February, November, December","none"]
["HI801","Hawaii",380,{"$f":"IF('Plant Control IR Template'!$V$2=B268,C268,\"\")","v":""},"2371816","Kamakoa very fine sandy loam, 2 to 10 percent slopes","Kamakoa",null,95,null,80,1,3,3.5,"rare, occasional","very brief","January, February, November, December","none"]
["HI801","Hawaii",381,{"$f":"IF('Plant Control IR Template'!$V$2=B269,C269,\"\")","v":""},"2371817","Waimea medial very fine sandy loam, 6 to 12 percent slopes","Waimea","medial very fine sandy loam",100,"bedrock, lithic",42,4,9,5,"none",null,null,"none"]
["HI801","Hawaii",382,{"$f":"IF('Plant Control IR Template'!$V$2=B270,C270,\"\")","v":""},"2371818","Waimea medial very fine sandy loam, 12 to 20 percent slopes","Waimea","medial very fine sandy loam",100,"bedrock, lithic",42,4,16,5,"none",null,null,"none"]
["HI801","Hawaii",383,{"$f":"IF('Plant Control IR Template'!$V$2=B271,C271,\"\")","v":""},"2371819","Waimea medial very fine sandy loam, 0 to 6 percent slopes","Waimea","medial very fine sandy loam",100,"bedrock, lithic",42,4,3,5,"none",null,null,"none"]
["HI801","Hawaii",384,{"$f":"IF('Plant Control IR Template'!$V$2=B272,C272,\"\")","v":""},"2371820","Waimea medial very fine sandy loam, 20 to 50 percent slopes","Waimea","medial very fine sandy loam",100,"bedrock, lithic",42,4,35,5,"none",null,null,"none"]
["HI801","Hawaii",385,{"$f":"IF('Plant Control IR Template'!$V$2=B273,C273,\"\")","v":""},"2371733","Hua hydrous silt loam, 2 to 10 percent slopes","Hua",null,90,"bedrock, lithic",8,9,6,0.9,"occasional","extremely brief","January, February, March, April, May, June, July, August, September, October, November, December","occasional","very brief","January, February, March, April, May, June, July, August, September, October, November, December"]
["HI801","Hawaii",386,{"$f":"IF('Plant Control IR Template'!$V$2=B274,C274,\"\")","v":""},"2371734","Hua hydrous silt loam, 10 to 20 percent slopes","Hua",null,90,"bedrock, lithic",8,9,15,0.9,"occasional","extremely brief","January, February, March, April, May, June, July, August, September, October, November, December","occasional","very brief","January, February, March, April, May, June, July, August, September, October, November, December"]
["HI801","Hawaii",387,{"$f":"IF('Plant Control IR Template'!$V$2=B275,C275,\"\")","v":""},"2371735","Hua-Honaunau complex, 2 to 10 percent slopes","Hua",null,60,"bedrock, lithic",8,9,6,0.9,"occasional","extremely brief","January, February, March, April, May, June, July, August, September, October, November, December","occasional","very brief","January, February, March, April, May, June, July, August, September, October, November, December"]
["HI801","Hawaii",387,{"$f":"IF('Plant Control IR Template'!$V$2=B276,C276,\"\")","v":""},"2371735","Hua-Honaunau complex, 2 to 10 percent slopes","Honaunau",null,35,"bedrock, lithic",26,0,6,2.6,"occasional","extremely brief","January, February, March, April, May, June, July, August, September, October, November, December","none"]
["HI801","Hawaii",388,{"$f":"IF('Plant Control IR Template'!$V$2=B277,C277,\"\")","v":""},"2371736","Hua-Honaunau complex, 10 to 20 percent slopes","Hua",null,60,"bedrock, lithic",8,9,15,0.9,"occasional","extremely brief","January, February, March, April, May, June, July, August, September, October, November, December","occasional","very brief","January, February, March, April, May, June, July, August, September, October, November, December"]
["HI801","Hawaii",388,{"$f":"IF('Plant Control IR Template'!$V$2=B278,C278,\"\")","v":""},"2371736","Hua-Honaunau complex, 10 to 20 percent slopes","Honaunau",null,35,"bedrock, lithic",26,0,15,2.6,"occasional","extremely brief","January, February, March, April, May, June, July, August, September, October, November, December","none"]
["HI801","Hawaii",389,{"$f":"IF('Plant Control IR Template'!$V$2=B279,C279,\"\")","v":""},"2371737","Hua-Honaunau complex, 20 to 40 percent slopes","Hua",null,60,"bedrock, lithic",8,9,30,0.9,"occasional","extremely brief","January, February, March, April, May, June, July, August, September, October, November, December","occasional","very brief","January, February, March, April, May, June, July, August, September, October, November, December"]
["HI801","Hawaii",389,{"$f":"IF('Plant Control IR Template'!$V$2=B280,C280,\"\")","v":""},"2371737","Hua-Honaunau complex, 20 to 40 percent slopes","Honaunau",null,35,"bedrock, lithic",26,0,30,2.6,"occasional","extremely brief","January, February, March, April, May, June, July, August, September, October, November, December","none"]
["HI801","Hawaii",390,{"$f":"IF('Plant Control IR Template'!$V$2=B281,C281,\"\")","v":""},"2371738","Manahaa hydrous silt loam, 2 to 10 percent slopes","Manahaa",null,90,"bedrock, lithic",25,0,6,3,"occasional","extremely brief","January, February, March, April, May, June, July, August, September, October, November, December","none"]
["HI801","Hawaii",391,{"$f":"IF('Plant Control IR Template'!$V$2=B282,C282,\"\")","v":""},"2371739","Manahaa hydrous silt loam, 10 to 20 percent slopes","Manahaa",null,90,"bedrock, lithic",25,0,15,3,"occasional","extremely brief","January, February, March, April, May, June, July, August, September, October, November, December","none"]
["HI801","Hawaii",394,{"$f":"IF('Plant Control IR Template'!$V$2=B283,C283,\"\")","v":""},"2371741","Hokukano-Lava flows complex, 2 to 10 percent slopes","Hokukano",null,60,"bedrock, lithic",20,9,6,2.6,"occasional","extremely brief","January, February, March, April, May, June, July, August, September, October, November, December","none"]
["HI801","Hawaii",394,{"$f":"IF('Plant Control IR Template'!$V$2=B284,C284,\"\")","v":""},"2371741","Hokukano-Lava flows complex, 2 to 10 percent slopes","Lava flows","pahoehoe",35,"bedrock, lithic",0,0,6,0,"none",null,null,"none"]
["HI801","Hawaii",395,{"$f":"IF('Plant Control IR Template'!$V$2=B285,C285,\"\")","v":""},"2371742","Hokukano-Lava flows complex, 10 to 20 percent slopes","Hokukano",null,60,"bedrock, lithic",20,9,15,2.6,"occasional","extremely brief","January, February, March, April, May, June, July, August, September, October, November, December","none"]
["HI801","Hawaii",395,{"$f":"IF('Plant Control IR Template'!$V$2=B286,C286,\"\")","v":""},"2371742","Hokukano-Lava flows complex, 10 to 20 percent slopes","Lava flows","pahoehoe",35,"bedrock, lithic",0,0,15,0,"none",null,null,"none"]
["HI801","Hawaii",396,{"$f":"IF('Plant Control IR Template'!$V$2=B287,C287,\"\")","v":""},"2371743","Hokukano medial silt loam, 2 to 10 percent slopes","Hokukano",null,90,"bedrock, lithic",20,9,6,2.6,"occasional","extremely brief","January, February, March, April, May, June, July, August, September, October, November, December","none"]
["HI801","Hawaii",397,{"$f":"IF('Plant Control IR Template'!$V$2=B288,C288,\"\")","v":""},"2371744","Hokukano medial silt loam, 10 to 20 percent slopes","Hokukano",null,90,"bedrock, lithic",20,9,15,2.6,"occasional","extremely brief","January, February, March, April, May, June, July, August, September, October, November, December","none"]
["HI801","Hawaii",398,{"$f":"IF('Plant Control IR Template'!$V$2=B289,C289,\"\")","v":""},"2371745","Hokukano-Manahaa complex, 2 to 10 percent slopes","Hokukano",null,50,"bedrock, lithic",20,9,6,2.6,"occasional","extremely brief","January, February, March, April, May, June, July, August, September, October, November, December","none"]
["HI801","Hawaii",398,{"$f":"IF('Plant Control IR Template'!$V$2=B290,C290,\"\")","v":""},"2371745","Hokukano-Manahaa complex, 2 to 10 percent slopes","Manahaa",null,40,"bedrock, lithic",25,0,6,3,"occasional","extremely brief","January, February, March, April, May, June, July, August, September, October, November, December","none"]
["HI801","Hawaii",399,{"$f":"IF('Plant Control IR Template'!$V$2=B291,C291,\"\")","v":""},"2371746","Hokukano-Manahaa complex, 10 to 20 percent slopes","Hokukano",null,50,"bedrock, lithic",20,9,15,2.6,"occasional","extremely brief","January, February, March, April, May, June, July, August, September, October, November, December","none"]
["HI801","Hawaii",399,{"$f":"IF('Plant Control IR Template'!$V$2=B292,C292,\"\")","v":""},"2371746","Hokukano-Manahaa complex, 10 to 20 percent slopes","Manahaa",null,40,"bedrock, lithic",25,0,15,3,"occasional","extremely brief","January, February, March, April, May, June, July, August, September, October, November, December","none"]
["HI801","Hawaii",400,{"$f":"IF('Plant Control IR Template'!$V$2=B293,C293,\"\")","v":""},"2371747","Manahaa hydrous silt loam, 20 to 50 percent slopes","Manahaa",null,90,"bedrock, lithic",25,0,35,3,"occasional","extremely brief","January, February, March, April, May, June, July, August, September, October, November, December","none"]
["HI801","Hawaii",401,{"$f":"IF('Plant Control IR Template'!$V$2=B294,C294,\"\")","v":""},"2371748","Ihuanu-Lava flows, `a`a complex, 10 to 20 percent slopes","Ihuanu",null,60,"bedrock, lithic",22,60,15,1.2,"none",null,null,"none"]
["HI801","Hawaii",401,{"$f":"IF('Plant Control IR Template'!$V$2=B295,C295,\"\")","v":""},"2371748","Ihuanu-Lava flows, `a`a complex, 10 to 20 percent slopes","Lava flows","`a`a",40,"bedrock, lithic",39,95,15,0.2,"none",null,null,"none"]
["HI801","Hawaii",402,{"$f":"IF('Plant Control IR Template'!$V$2=B296,C296,\"\")","v":""},"2371242","Ihuanu very cobbly medial silt loam, 10 to 20 percent slopes","Ihuanu",null,95,"bedrock, lithic",22,60,15,1.2,"none",null,null,"none"]
["HI801","Hawaii",403,{"$f":"IF('Plant Control IR Template'!$V$2=B297,C297,\"\")","v":""},"2371243","Ihuanu very cobbly medial silt loam, 2 to 10 percent slopes","Ihuanu",null,95,"bedrock, lithic",22,60,6,1.2,"none",null,null,"none"]
["HI801","Hawaii",405,{"$f":"IF('Plant Control IR Template'!$V$2=B298,C298,\"\")","v":""},"2371244","Iwalani medial loam, 10 to 20 percent slopes","Iwalani",null,90,"bedrock, lithic",10,5,15,1.5,"none",null,null,"none"]
["HI801","Hawaii",406,{"$f":"IF('Plant Control IR Template'!$V$2=B299,C299,\"\")","v":""},"2371245","Lava flows-Iwalani complex, 10 to 20 percent slopes","Lava flows","pahoehoe",70,"bedrock, lithic",0,0,15,0,"none",null,null,"none"]
["HI801","Hawaii",406,{"$f":"IF('Plant Control IR Template'!$V$2=B300,C300,\"\")","v":""},"2371245","Lava flows-Iwalani complex, 10 to 20 percent slopes","Iwalani",null,30,"bedrock, lithic",10,5,15,1.5,"none",null,null,"none"]
["HI801","Hawaii",407,{"$f":"IF('Plant Control IR Template'!$V$2=B301,C301,\"\")","v":""},"2371246","Iwalani-Lava flows complex, 2 to 10 percent slopes","Iwalani",null,60,"bedrock, lithic",10,5,6,1.5,"none",null,null,"none"]
["HI801","Hawaii",407,{"$f":"IF('Plant Control IR Template'!$V$2=B302,C302,\"\")","v":""},"2371246","Iwalani-Lava flows complex, 2 to 10 percent slopes","Lava flows","pahoehoe",40,"bedrock, lithic",0,0,6,0,"none",null,null,"none"]
["HI801","Hawaii",408,{"$f":"IF('Plant Control IR Template'!$V$2=B303,C303,\"\")","v":""},"2371247","Iwalani-Lava flows complex, 10 to 20 percent slopes","Iwalani",null,70,"bedrock, lithic",10,5,15,1.5,"none",null,null,"none"]
["HI801","Hawaii",408,{"$f":"IF('Plant Control IR Template'!$V$2=B304,C304,\"\")","v":""},"2371247","Iwalani-Lava flows complex, 10 to 20 percent slopes","Lava flows","pahoehoe",30,"bedrock, lithic",0,0,15,0,"none",null,null,"none"]
["HI801","Hawaii",409,{"$f":"IF('Plant Control IR Template'!$V$2=B305,C305,\"\")","v":""},"2371248","Iwalani medial loam, 3 to 10 percent slopes","Iwalani",null,95,"bedrock, lithic",10,5,6,1.5,"none",null,null,"none"]
["HI801","Hawaii",410,{"$f":"IF('Plant Control IR Template'!$V$2=B306,C306,\"\")","v":""},"2371750","Nawahine gravelly medial silt loam, 20 to 50 percent slopes","Nawahine",null,100,"abrupt textural change",20,48,35,1.1000000000000001,"none",null,null,"none"]
["HI801","Hawaii",411,{"$f":"IF('Plant Control IR Template'!$V$2=B307,C307,\"\")","v":""},"2371821","Mahukona silty clay loam, 3 to 12 percent slopes","Mahukona",null,85,"bedrock, paralithic",36,2,8,2.8,"none",null,null,"none"]
["HI801","Hawaii",412,{"$f":"IF('Plant Control IR Template'!$V$2=B308,C308,\"\")","v":""},"2371822","Mahukona very stony silty clay loam, 6 to 12 percent slopes","Mahukona","very stony",85,"bedrock, paralithic",36,27,9,2.8,"none",null,null,"none"]
["HI801","Hawaii",413,{"$f":"IF('Plant Control IR Template'!$V$2=B309,C309,\"\")","v":""},"2371823","Hawi very stony silty clay, 6 to 12 percent slopes","Hawi","very stony",95,null,80,38,9,2.6,"none",null,null,"none"]
["HI801","Hawaii",414,{"$f":"IF('Plant Control IR Template'!$V$2=B310,C310,\"\")","v":""},"2371824","Hawi silty clay, 0 to 3 percent slopes","Hawi",null,95,null,80,0,2,2.6,"none",null,null,"none"]
["HI801","Hawaii",415,{"$f":"IF('Plant Control IR Template'!$V$2=B311,C311,\"\")","v":""},"2371825","Hawi silty clay, 3 to 12 percent slopes","Hawi",null,95,null,80,0,8,2.6,"none",null,null,"none"]
["HI801","Hawaii",416,{"$f":"IF('Plant Control IR Template'!$V$2=B312,C312,\"\")","v":""},"2371826","Kohala silty clay, 3 to 12 percent slopes","Kohala",null,100,"bedrock, paralithic",39,4,8,2.8,"none",null,null,"none"]
["HI801","Hawaii",417,{"$f":"IF('Plant Control IR Template'!$V$2=B313,C313,\"\")","v":""},"2371827","Waimea medial silt loam, 6 to 12 percent slopes","Waimea",null,85,"bedrock, lithic",42,4,9,5,"none",null,null,"none"]
["HI801","Hawaii",418,{"$f":"IF('Plant Control IR Template'!$V$2=B314,C314,\"\")","v":""},"2371828","Waimea medial silt loam, 12 to 20 percent slopes","Waimea",null,85,"bedrock, lithic",42,4,16,5,"none",null,null,"none"]
["HI801","Hawaii",419,{"$f":"IF('Plant Control IR Template'!$V$2=B315,C315,\"\")","v":""},"2371829","Waimea medial silt loam, 20 to 50 percent slopes","Waimea",null,85,"bedrock, lithic",42,4,35,5,"none",null,null,"none"]
["HI801","Hawaii",420,{"$f":"IF('Plant Control IR Template'!$V$2=B316,C316,\"\")","v":""},"2371830","Palapalai hydrous silt loam, 6 to 12 percent slopes","Palapalai",null,90,null,80,0,9,3,"none",null,null,"none"]
["HI801","Hawaii",421,{"$f":"IF('Plant Control IR Template'!$V$2=B317,C317,\"\")","v":""},"2371831","Palapalai hydrous silt loam, 12 to 20 percent slopes","Palapalai",null,90,null,80,0,16,3,"none",null,null,"none"]
["HI801","Hawaii",422,{"$f":"IF('Plant Control IR Template'!$V$2=B318,C318,\"\")","v":""},"2371832","Palapalai hydrous silt loam, 20 to 50 percent slopes","Palapalai",null,100,null,80,0,35,3,"none",null,null,"none"]
["HI801","Hawaii",423,{"$f":"IF('Plant Control IR Template'!$V$2=B319,C319,\"\")","v":""},"2371833","Palapalai hydrous silty clay loam, 6 to 12 percent slopes","Palapalai","hydrous silty clay loam",100,null,80,0,9,3.2,"none",null,null,"none"]
["HI801","Hawaii",424,{"$f":"IF('Plant Control IR Template'!$V$2=B320,C320,\"\")","v":""},"2371834","Kahua-Kehena complex, 6 to 20 percent slopes","Kahua",null,60,"placic",8,0,13,2.5,"none",null,null,"occasional","very brief,","January, February, March, October, November, December"]
["HI801","Hawaii",424,{"$f":"IF('Plant Control IR Template'!$V$2=B321,C321,\"\")","v":""},"2371834","Kahua-Kehena complex, 6 to 20 percent slopes","Kehena",null,30,"bedrock, lithic",37,0,13,5.9,"none",null,null,"none"]
["HI801","Hawaii",425,{"$f":"IF('Plant Control IR Template'!$V$2=B322,C322,\"\")","v":""},"2371835","Kahua mucky medial silt loam, 20 to 50 percent slopes","Kahua",null,90,"placic",8,0,35,2.5,"none",null,null,"occasional","very brief,","January, February, March, October, November, December"]
["HI801","Hawaii",426,{"$f":"IF('Plant Control IR Template'!$V$2=B323,C323,\"\")","v":""},"2401298","Amalu-Kahua-Kehena complex, 3 to 20 percent slopes","Amalu",null,50,"placic",16,2,12,4.3,"none",null,null,"occasional","very brief,","January, February, March, October, November, December"]
["HI801","Hawaii",426,{"$f":"IF('Plant Control IR Template'!$V$2=B324,C324,\"\")","v":""},"2401298","Amalu-Kahua-Kehena complex, 3 to 20 percent slopes","Kahua",null,25,"placic",8,0,12,3.4,"none",null,null,"occasional","very brief,","January, February, March, October, November, December"]
["HI801","Hawaii",426,{"$f":"IF('Plant Control IR Template'!$V$2=B325,C325,\"\")","v":""},"2401298","Amalu-Kahua-Kehena complex, 3 to 20 percent slopes","Kehena",null,25,"bedrock, lithic",26,5,12,4.9000000000000004,"none",null,null,"none"]
["HI801","Hawaii",427,{"$f":"IF('Plant Control IR Template'!$V$2=B326,C326,\"\")","v":""},"2401398","Amalu-Kehena complex, 20 to 50 percent slopes","Amalu",null,60,"placic",16,2,35,4.3,"none",null,null,"occasional","very brief,","January, February, March, October, November, December"]
["HI801","Hawaii",427,{"$f":"IF('Plant Control IR Template'!$V$2=B327,C327,\"\")","v":""},"2401398","Amalu-Kehena complex, 20 to 50 percent slopes","Kehena",null,30,"bedrock, lithic",26,5,35,4.9000000000000004,"none",null,null,"none"]
["HI801","Hawaii",428,{"$f":"IF('Plant Control IR Template'!$V$2=B328,C328,\"\")","v":""},"2401400","Kehena-Kahua complex, 3 to 20 percent slopes","Kehena",null,55,"bedrock, lithic",37,0,12,5.9,"none",null,null,"none"]
["HI801","Hawaii",428,{"$f":"IF('Plant Control IR Template'!$V$2=B329,C329,\"\")","v":""},"2401400","Kehena-Kahua complex, 3 to 20 percent slopes","Kahua",null,30,"placic",8,0,12,2.5,"none",null,null,"occasional","very brief,","January, February, March, October, November, December"]
["HI801","Hawaii",429,{"$f":"IF('Plant Control IR Template'!$V$2=B330,C330,\"\")","v":""},"2401401","Kehena-Niulii-Rock outcrop complex, 70 to 100 percent slopes","Kehena",null,40,"bedrock, lithic",37,0,85,5.9,"none",null,null,"none"]
["HI801","Hawaii",429,{"$f":"IF('Plant Control IR Template'!$V$2=B331,C331,\"\")","v":""},"2401401","Kehena-Niulii-Rock outcrop complex, 70 to 100 percent slopes","Rock outcrop","basalt",30,null,80,0,85,null,"none",null,null,"none"]
["HI801","Hawaii",429,{"$f":"IF('Plant Control IR Template'!$V$2=B332,C332,\"\")","v":""},"2401401","Kehena-Niulii-Rock outcrop complex, 70 to 100 percent slopes","Niulii",null,30,"bedrock, lithic",30,8,85,4.5,"none",null,null,"none"]
["HI801","Hawaii",430,{"$f":"IF('Plant Control IR Template'!$V$2=B333,C333,\"\")","v":""},"2401402","Typic Endoaquepts, 0 to 1 percent slopes","Typic Endoaquepts",null,100,null,80,0,1,2.2999999999999998,"frequent","long","January, February, March, April, May, June, July, August, September, October, November, December","frequent","long","January, February, March, April, May, June, July, August, September, October, November, December"]
["HI801","Hawaii",431,{"$f":"IF('Plant Control IR Template'!$V$2=B334,C334,\"\")","v":""},"2401403","Hanalei complex, 0 to 2 percent slopes","Hanalei",null,70,null,80,1,1,3.2,"frequent, occasional","very brief","January, February, March, April, May, June, July, August, September, October, November, December","occasional, rare","very brief","January, February, March, April, November, December"]
["HI801","Hawaii",431,{"$f":"IF('Plant Control IR Template'!$V$2=B335,C335,\"\")","v":""},"2401403","Hanalei complex, 0 to 2 percent slopes","Hanalei","ponded",30,null,80,2,1,3.7,"frequent","long","January, February, March, April, May, June, July, August, September, October, November, December","frequent","long","January, February, March, April, May, June, July, August, September, October, November, December"]
["HI801","Hawaii",432,{"$f":"IF('Plant Control IR Template'!$V$2=B336,C336,\"\")","v":""},"2401404","Niulii-Rock outcrop complex, 35 to 70 percent slopes","Niulii",null,70,"bedrock, lithic",30,8,50,4.5,"none",null,null,"none"]
["HI801","Hawaii",432,{"$f":"IF('Plant Control IR Template'!$V$2=B337,C337,\"\")","v":""},"2401404","Niulii-Rock outcrop complex, 35 to 70 percent slopes","Rock outcrop","basalt",30,null,80,0,50,null,"none",null,null,"none"]
["HI801","Hawaii",433,{"$f":"IF('Plant Control IR Template'!$V$2=B338,C338,\"\")","v":""},"2401407","Ainakea-Rock outcrop complex, 35 to 70 percent slopes","Ainakea",null,70,"bedrock, paralithic",30,7,55,5.5,"none",null,null,"none"]
["HI801","Hawaii",433,{"$f":"IF('Plant Control IR Template'!$V$2=B339,C339,\"\")","v":""},"2401407","Ainakea-Rock outcrop complex, 35 to 70 percent slopes","Rock outcrop","basalt",30,null,80,0,55,null,"none",null,null,"none"]
["HI801","Hawaii",434,{"$f":"IF('Plant Control IR Template'!$V$2=B340,C340,\"\")","v":""},"2401410","Kehena medial silty clay loam, 6 to 12 percent slopes","Kehena",null,100,"bedrock, lithic",37,0,9,5.9,"none",null,null,"none"]
["HI801","Hawaii",435,{"$f":"IF('Plant Control IR Template'!$V$2=B341,C341,\"\")","v":""},"2401411","Kohala silty clay, 0 to 3 percent slopes","Kohala",null,100,"bedrock, paralithic",39,4,2,2.8,"none",null,null,"none"]
["HI801","Hawaii",436,{"$f":"IF('Plant Control IR Template'!$V$2=B342,C342,\"\")","v":""},"2401412","Kohala silty clay, 12 to 20 percent slopes","Kohala",null,100,"bedrock, paralithic",39,4,16,2.8,"none",null,null,"none"]
["HI801","Hawaii",437,{"$f":"IF('Plant Control IR Template'!$V$2=B343,C343,\"\")","v":""},"2401413","Kohala silty clay, 20 to 35 percent slopes","Kohala",null,100,"bedrock, paralithic",39,4,25,2.8,"none",null,null,"none"]
["HI801","Hawaii",438,{"$f":"IF('Plant Control IR Template'!$V$2=B344,C344,\"\")","v":""},"2401414","Kohala silty clay, 35 to 70 percent slopes","Kohala",null,100,"bedrock, paralithic",39,4,50,2.8,"none",null,null,"none"]
["HI801","Hawaii",439,{"$f":"IF('Plant Control IR Template'!$V$2=B345,C345,\"\")","v":""},"2401415","Ainakea medial silty clay loam, 3 to 12 percent slopes","Ainakea",null,100,"bedrock, paralithic",30,7,8,5.5,"none",null,null,"none"]
["HI801","Hawaii",440,{"$f":"IF('Plant Control IR Template'!$V$2=B346,C346,\"\")","v":""},"2401416","Ainakea medial silty clay loam, 12 to 20 percent slopes","Ainakea",null,100,"bedrock, paralithic",30,7,15,5.5,"none",null,null,"none"]
["HI801","Hawaii",441,{"$f":"IF('Plant Control IR Template'!$V$2=B347,C347,\"\")","v":""},"2401417","Ainakea medial silty clay loam, 20 to 35 percent slopes","Ainakea",null,100,"bedrock, paralithic",30,7,28,5.5,"none",null,null,"none"]
["HI801","Hawaii",442,{"$f":"IF('Plant Control IR Template'!$V$2=B348,C348,\"\")","v":""},"2401418","Niulii medial silty clay loam, 6 to 12 percent slopes","Niulii",null,100,"bedrock, lithic",30,8,9,4.5,"none",null,null,"none"]
["HI801","Hawaii",443,{"$f":"IF('Plant Control IR Template'!$V$2=B349,C349,\"\")","v":""},"2401419","Niulii medial silty clay loam, 12 to 20 percent slopes","Niulii",null,100,"bedrock, lithic",30,8,16,4.5,"none",null,null,"none"]
["HI801","Hawaii",444,{"$f":"IF('Plant Control IR Template'!$V$2=B350,C350,\"\")","v":""},"2401420","Niulii medial silty clay loam, 20 to 35 percent slopes","Niulii",null,100,"bedrock, lithic",30,8,28,4.5,"none",null,null,"none"]
["HI801","Hawaii",445,{"$f":"IF('Plant Control IR Template'!$V$2=B351,C351,\"\")","v":""},"2401421","Ainakea-Rock outcrop complex, 70 to 100 percent slopes","Ainakea",null,70,"bedrock, paralithic",30,7,85,5.5,"none",null,null,"none"]
["HI801","Hawaii",445,{"$f":"IF('Plant Control IR Template'!$V$2=B352,C352,\"\")","v":""},"2401421","Ainakea-Rock outcrop complex, 70 to 100 percent slopes","Rock outcrop","basalt",20,null,80,0,85,null,"none",null,null,"none"]
["HI801","Hawaii",446,{"$f":"IF('Plant Control IR Template'!$V$2=B353,C353,\"\")","v":""},"2401422","Pololu extremely stony very fine sandy loam, 3 to 12 percent slopes","Pololu",null,100,null,80,75,6,2.5,"occasional, none","very brief,","January, February, March, April, October, November, December","none"]
["HI801","Hawaii",447,{"$f":"IF('Plant Control IR Template'!$V$2=B354,C354,\"\")","v":""},"2401423","Niulii-Rock outcrop complex, 70 to 100 percent slopes","Niulii",null,70,"bedrock, lithic",30,8,85,4.5,"none",null,null,"none"]
["HI801","Hawaii",447,{"$f":"IF('Plant Control IR Template'!$V$2=B355,C355,\"\")","v":""},"2401423","Niulii-Rock outcrop complex, 70 to 100 percent slopes","Rock outcrop","basalt",20,null,80,0,85,null,"none",null,null,"none"]
["HI801","Hawaii",448,{"$f":"IF('Plant Control IR Template'!$V$2=B356,C356,\"\")","v":""},"2371751","Puukala-Kekake-Lava flows complex, 2 to 10 percent slopes","Puukala","cobbly medial silt loam",40,"bedrock, lithic",18,29,6,2.4,"very rare","extremely brief","January, February, March, April, May, June, July, August, September, October, November, December","none"]
["HI801","Hawaii",448,{"$f":"IF('Plant Control IR Template'!$V$2=B357,C357,\"\")","v":""},"2371751","Puukala-Kekake-Lava flows complex, 2 to 10 percent slopes","Kekake",null,30,"bedrock, lithic",5,22,6,1.2,"none",null,null,"none"]
["HI801","Hawaii",448,{"$f":"IF('Plant Control IR Template'!$V$2=B358,C358,\"\")","v":""},"2371751","Puukala-Kekake-Lava flows complex, 2 to 10 percent slopes","Lava flows","pahoehoe",30,"bedrock, lithic",0,0,6,0,"none",null,null,"none"]
["HI801","Hawaii",449,{"$f":"IF('Plant Control IR Template'!$V$2=B359,C359,\"\")","v":""},"2371752","Puukala-Kekake-Lava flows complex, 10 to 20 percent slopes","Puukala","cobbly medial silt loam",40,"bedrock, lithic",18,29,15,2.4,"very rare","extremely brief","January, February, March, April, May, June, July, August, September, October, November, December","none"]
["HI801","Hawaii",449,{"$f":"IF('Plant Control IR Template'!$V$2=B360,C360,\"\")","v":""},"2371752","Puukala-Kekake-Lava flows complex, 10 to 20 percent slopes","Lava flows","pahoehoe",30,"bedrock, lithic",0,0,15,0,"none",null,null,"none"]
["HI801","Hawaii",449,{"$f":"IF('Plant Control IR Template'!$V$2=B361,C361,\"\")","v":""},"2371752","Puukala-Kekake-Lava flows complex, 10 to 20 percent slopes","Kekake",null,30,"bedrock, lithic",5,22,6,1.2,"none",null,null,"none"]
["HI801","Hawaii",450,{"$f":"IF('Plant Control IR Template'!$V$2=B362,C362,\"\")","v":""},"2371753","Puukala medial silt loam, 2 to 10 percent slopes","Puukala",null,90,"bedrock, lithic",18,23,6,2.4,"very rare","extremely brief","January, February, March, April, May, June, July, August, September, October, November, December","none"]
["HI801","Hawaii",451,{"$f":"IF('Plant Control IR Template'!$V$2=B363,C363,\"\")","v":""},"2371754","Puukala medial silt loam, 10 to 20 percent slopes","Puukala",null,90,"bedrock, lithic",18,23,15,2.4,"very rare","extremely brief","January, February, March, April, May, June, July, August, September, October, November, December","none"]
["HI801","Hawaii",452,{"$f":"IF('Plant Control IR Template'!$V$2=B364,C364,\"\")","v":""},"2371755","Puukala-Kealoha complex, 2 to 10 percent slopes","Puukala","cobbly medial silt loam",50,"bedrock, lithic",18,29,6,2.4,"very rare","extremely brief","January, February, March, April, May, June, July, August, September, October, November, December","none"]
["HI801","Hawaii",452,{"$f":"IF('Plant Control IR Template'!$V$2=B365,C365,\"\")","v":""},"2371755","Puukala-Kealoha complex, 2 to 10 percent slopes","Kealoha",null,40,"bedrock, lithic",50,45,6,1.7,"none",null,null,"none"]
["HI801","Hawaii",453,{"$f":"IF('Plant Control IR Template'!$V$2=B366,C366,\"\")","v":""},"2371756","Puukala-Kealoha complex, 10 to 20 percent slopes","Puukala","cobbly medial silt loam",50,"bedrock, lithic",18,29,15,2.4,"very rare","extremely brief","January, February, March, April, May, June, July, August, September, October, November, December","none"]
["HI801","Hawaii",453,{"$f":"IF('Plant Control IR Template'!$V$2=B367,C367,\"\")","v":""},"2371756","Puukala-Kealoha complex, 10 to 20 percent slopes","Kealoha",null,40,"bedrock, lithic",50,45,15,1.7,"none",null,null,"none"]
["HI801","Hawaii",454,{"$f":"IF('Plant Control IR Template'!$V$2=B368,C368,\"\")","v":""},"2371757","Kealoha very gravelly medial silt loam, 2 to 10 percent slopes","Kealoha",null,90,"bedrock, lithic",50,45,6,1.7,"none",null,null,"none"]
["HI801","Hawaii",455,{"$f":"IF('Plant Control IR Template'!$V$2=B369,C369,\"\")","v":""},"2371758","Kealoha very gravelly medial silt loam, 10 to 20 percent slopes","Kealoha",null,90,"bedrock, lithic",50,45,15,1.7,"none",null,null,"none"]
["HI801","Hawaii",456,{"$f":"IF('Plant Control IR Template'!$V$2=B370,C370,\"\")","v":""},"2452571","Typic Ustipsamments, 0 to 15 percent slopes","Typic Ustipsamments",null,100,null,80,4,8,1.2,"rare","very brief",null,"none"]
["HI801","Hawaii",457,{"$f":"IF('Plant Control IR Template'!$V$2=B371,C371,\"\")","v":""},"2371759","Hookena very cobbly medial silt loam, 10 to 20 percent slopes","Hookena",null,90,null,80,35,15,1.6,"rare","extremely brief",null,"none"]
["HI801","Hawaii",458,{"$f":"IF('Plant Control IR Template'!$V$2=B372,C372,\"\")","v":""},"2371760","Kealoha very gravelly medial silt loam, 20 to 50 percent slopes","Kealoha",null,90,"bedrock, lithic",50,45,35,1.7,"none",null,null,"none"]
["HI801","Hawaii",459,{"$f":"IF('Plant Control IR Template'!$V$2=B373,C373,\"\")","v":""},"2452572","Kemole stony medial silt loam, 12 to 20 percent slopes","Kemole","stony medial silt loam",95,null,80,41,16,2.2000000000000002,"none",null,null,"none"]
["HI801","Hawaii",460,{"$f":"IF('Plant Control IR Template'!$V$2=B374,C374,\"\")","v":""},"2371761","Hapuu very gravelly medial silt loam, 2 to 10 percent slopes","Hapuu","very gravelly",90,"bedrock, lithic",43,63,6,0.9,"none",null,null,"none"]
["HI801","Hawaii",461,{"$f":"IF('Plant Control IR Template'!$V$2=B375,C375,\"\")","v":""},"2371762","Hapuu very gravelly medial silt loam, 10 to 20 percent slopes","Hapuu","very gravelly",90,"bedrock, lithic",43,63,15,0.9,"none",null,null,"none"]
["HI801","Hawaii",462,{"$f":"IF('Plant Control IR Template'!$V$2=B376,C376,\"\")","v":""},"2371763","Hapuu extremely gravelly medial silt loam, 2 to 10 percent slopes","Hapuu",null,90,"bedrock, lithic",43,73,6,0.7,"none",null,null,"none"]
["HI801","Hawaii",463,{"$f":"IF('Plant Control IR Template'!$V$2=B377,C377,\"\")","v":""},"2371764","Hapuu extremely gravelly medial silt loam, 10 to 20 percent slopes","Hapuu",null,90,"bedrock, lithic",43,73,15,0.7,"none",null,null,"none"]
["HI801","Hawaii",464,{"$f":"IF('Plant Control IR Template'!$V$2=B378,C378,\"\")","v":""},"2452573","Kemole stony medial silt loam, 6 to 12 percent slopes","Kemole","stony medial silt loam",95,null,80,41,9,2.2000000000000002,"none",null,null,"none"]
["HI801","Hawaii",465,{"$f":"IF('Plant Control IR Template'!$V$2=B379,C379,\"\")","v":""},"2452574","Paauhau medial silty clay loam, 0 to 10 percent slopes","Paauhau",null,100,"bedrock, paralithic",41,5,6,4.9000000000000004,"none",null,null,"none"]
["HI801","Hawaii",466,{"$f":"IF('Plant Control IR Template'!$V$2=B380,C380,\"\")","v":""},"2371765","Nenenui-Lava flows complex, 2 to 10 percent slopes","Nenenui",null,60,"bedrock, lithic",6,95,6,0.1,"none",null,null,"none"]
["HI801","Hawaii",466,{"$f":"IF('Plant Control IR Template'!$V$2=B381,C381,\"\")","v":""},"2371765","Nenenui-Lava flows complex, 2 to 10 percent slopes","Lava flows","pahoehoe",40,"bedrock, lithic",0,0,6,0,"none",null,null,"none"]
["HI801","Hawaii",467,{"$f":"IF('Plant Control IR Template'!$V$2=B382,C382,\"\")","v":""},"2371766","Nenenui-Lava flows complex, 10 to 20 percent slopes","Nenenui",null,60,"bedrock, lithic",6,95,15,0.1,"none",null,null,"none"]
["HI801","Hawaii",467,{"$f":"IF('Plant Control IR Template'!$V$2=B383,C383,\"\")","v":""},"2371766","Nenenui-Lava flows complex, 10 to 20 percent slopes","Lava flows","pahoehoe",40,"bedrock, lithic",0,0,15,0,"none",null,null,"none"]
["HI801","Hawaii",468,{"$f":"IF('Plant Control IR Template'!$V$2=B384,C384,\"\")","v":""},"2452575","Maile hydrous silt loam, 0 to 6 percent slopes","Maile",null,90,null,80,6,2,3,"none",null,null,"none"]
["HI801","Hawaii",469,{"$f":"IF('Plant Control IR Template'!$V$2=B385,C385,\"\")","v":""},"2452576","Paauhau medial silty clay loam, 20 to 35 percent slopes","Paauhau",null,100,"bedrock, paralithic",41,5,28,4.9000000000000004,"none",null,null,"none"]
["HI801","Hawaii",470,{"$f":"IF('Plant Control IR Template'!$V$2=B386,C386,\"\")","v":""},"2371767","Ohianui extremely gravelly ashy loamy sand, 2 to 10 percent slopes","Ohianui",null,90,"bedrock, lithic",24,70,6,0.5,"none",null,null,"none"]
["HI801","Hawaii",471,{"$f":"IF('Plant Control IR Template'!$V$2=B387,C387,\"\")","v":""},"2371768","Ohianui extremely gravelly ashy loamy sand, 10 to 20 percent slopes","Ohianui",null,90,"bedrock, lithic",24,70,15,0.5,"none",null,null,"none"]
["HI801","Hawaii",472,{"$f":"IF('Plant Control IR Template'!$V$2=B388,C388,\"\")","v":""},"2452577","Paauhau- Rock outcrop complex, 35 to 70 percent slopes","Paauhau",null,70,"bedrock, paralithic",41,5,55,4.9000000000000004,"none",null,null,"none"]
["HI801","Hawaii",472,{"$f":"IF('Plant Control IR Template'!$V$2=B389,C389,\"\")","v":""},"2452577","Paauhau- Rock outcrop complex, 35 to 70 percent slopes","Rock outcrop","basalt",30,null,80,0,55,null,"none",null,null,"none"]
["HI801","Hawaii",473,{"$f":"IF('Plant Control IR Template'!$V$2=B390,C390,\"\")","v":""},"2452578","Kukaiau medial silty clay loam, 0 to 10 percent slopes","Kukaiau",null,100,"bedrock, lithic",50,2,6,4.5,"none",null,null,"none"]
["HI801","Hawaii",474,{"$f":"IF('Plant Control IR Template'!$V$2=B391,C391,\"\")","v":""},"2452579","Kukaiau medial silty clay loam, 10 to 20 percent slopes","Kukaiau",null,100,"bedrock, lithic",50,2,16,4.5,"none",null,null,"none"]
["HI801","Hawaii",475,{"$f":"IF('Plant Control IR Template'!$V$2=B392,C392,\"\")","v":""},"2452580","Kukaiau medial silty clay loam, 20 to 35 percent slopes","Kukaiau",null,100,"bedrock, lithic",50,2,28,4.5,"none",null,null,"none"]
["HI801","Hawaii",476,{"$f":"IF('Plant Control IR Template'!$V$2=B393,C393,\"\")","v":""},"2371769","Huikau ashy loamy sand, 2 to 10 percent slopes","Huikau","ashy loamy sand",90,"abrupt textural change",45,7,6,1.4,"none",null,null,"none"]
["HI801","Hawaii",477,{"$f":"IF('Plant Control IR Template'!$V$2=B394,C394,\"\")","v":""},"2371770","Huikau ashy loamy sand, 10 to 20 percent slopes","Huikau","ashy loamy sand",90,"abrupt textural change",45,7,15,1.4,"none",null,null,"none"]
["HI801","Hawaii",478,{"$f":"IF('Plant Control IR Template'!$V$2=B395,C395,\"\")","v":""},"2452581","Kukaiau-Rock outcrop complex, 35 to 70 percent slopes","Kukaiau",null,70,"bedrock, lithic",50,2,55,4.5,"none",null,null,"none"]
["HI801","Hawaii",478,{"$f":"IF('Plant Control IR Template'!$V$2=B396,C396,\"\")","v":""},"2452581","Kukaiau-Rock outcrop complex, 35 to 70 percent slopes","Rock outcrop","basalt",30,null,80,0,55,null,"none",null,null,"none"]
["HI801","Hawaii",481,{"$f":"IF('Plant Control IR Template'!$V$2=B397,C397,\"\")","v":""},"2371772","Halekula very cobbly medial silt loam, 10 to 20 percent slopes","Halekula",null,90,"bedrock, lithic",27,53,15,1.4,"none",null,null,"none"]
["HI801","Hawaii",483,{"$f":"IF('Plant Control IR Template'!$V$2=B398,C398,\"\")","v":""},"2371773","Halekula very cobbly medial silt loam, 20 to 50 percent slopes","Halekula",null,90,"bedrock, lithic",27,53,35,1.4,"none",null,null,"none"]
["HI801","Hawaii",485,{"$f":"IF('Plant Control IR Template'!$V$2=B399,C399,\"\")","v":""},"2371836","Kemole extremely stony medial very fine sandy loam, 12 to 20 percent slopes","Kemole",null,90,null,80,67,16,2.2000000000000002,"none",null,null,"none"]
["HI801","Hawaii",486,{"$f":"IF('Plant Control IR Template'!$V$2=B400,C400,\"\")","v":""},"2371837","Kemole extremely stony medial very fine sandy loam, 6 to 12 percent slopes","Kemole",null,90,null,80,67,9,2.2000000000000002,"none",null,null,"none"]
["HI801","Hawaii",487,{"$f":"IF('Plant Control IR Template'!$V$2=B401,C401,\"\")","v":""},"2401424","Kikoni medial very fine sandy loam, 0 to 6 percent slopes","Kikoni",null,100,null,80,0,3,4.3,"none",null,null,"none"]
["HI801","Hawaii",488,{"$f":"IF('Plant Control IR Template'!$V$2=B402,C402,\"\")","v":""},"2401425","Kikoni medial very fine sandy loam, 6 to 12 percent slopes","Kikoni",null,100,null,80,0,9,4.3,"none",null,null,"none"]
["HI801","Hawaii",489,{"$f":"IF('Plant Control IR Template'!$V$2=B403,C403,\"\")","v":""},"2401426","Maile hydrous silt loam, 6 to 20 percent slopes","Maile",null,90,null,80,6,13,3,"none",null,null,"none"]
["HI801","Hawaii",490,{"$f":"IF('Plant Control IR Template'!$V$2=B404,C404,\"\")","v":""},"2371774","Okoe extremely cobbly medial silt loam, 2 to 10 percent slopes","Okoe",null,90,"bedrock, lithic",36,72,6,0.9,"none",null,null,"none"]
["HI801","Hawaii",491,{"$f":"IF('Plant Control IR Template'!$V$2=B405,C405,\"\")","v":""},"2371775","Okoe extremely cobbly medial silt loam, 10 to 20 percent slopes","Okoe",null,90,"bedrock, lithic",36,72,15,0.9,"none",null,null,"none"]
["HI801","Hawaii",493,{"$f":"IF('Plant Control IR Template'!$V$2=B406,C406,\"\")","v":""},"2401428","Kikoni medial silt loam,  0 to 3 percent slopes","Kikoni","medial silt loam",100,null,80,0,2,4.8,"none",null,null,"none"]
["HI801","Hawaii",502,{"$f":"IF('Plant Control IR Template'!$V$2=B407,C407,\"\")","v":""},"2371249","Kaalualu cobbly medial loamy sand, 2 to 10 percent slopes","Kaalualu",null,95,"abrupt textural change",24,39,6,2,"none",null,null,"none"]
["HI801","Hawaii",503,{"$f":"IF('Plant Control IR Template'!$V$2=B408,C408,\"\")","v":""},"2371250","Kaalualu cobbly medial loamy sand, 10 to 20 percent slopes","Kaalualu",null,95,"abrupt textural change",24,39,15,2,"none",null,null,"none"]
["HI801","Hawaii",504,{"$f":"IF('Plant Control IR Template'!$V$2=B409,C409,\"\")","v":""},"2371251","Kaalualu extremely cobbly medial loamy sand, 2 to 10 percent slopes","Kaalualu","extremely cobbly",95,"abrupt textural change",24,65,6,1.3,"none",null,null,"none"]
["HI801","Hawaii",505,{"$f":"IF('Plant Control IR Template'!$V$2=B410,C410,\"\")","v":""},"2371252","Kaalualu-Pakini complex, 2 to 10 percent slopes","Kaalualu",null,60,"abrupt textural change",24,39,6,2,"none",null,null,"none"]
["HI801","Hawaii",505,{"$f":"IF('Plant Control IR Template'!$V$2=B411,C411,\"\")","v":""},"2371252","Kaalualu-Pakini complex, 2 to 10 percent slopes","Pakini",null,40,null,80,5,4,2,"none",null,null,"none"]
["HI801","Hawaii",507,{"$f":"IF('Plant Control IR Template'!$V$2=B412,C412,\"\")","v":""},"2371254","Pakini medial very fine sandy loam, 10 to 20 percent slopes","Pakini",null,95,null,80,5,15,2,"none",null,null,"none"]
["HI801","Hawaii",510,{"$f":"IF('Plant Control IR Template'!$V$2=B413,C413,\"\")","v":""},"2371255","Pakini-Kaalualu complex, 50 to 70 percent slopes","Pakini",null,60,null,80,5,60,2,"none",null,null,"none"]
["HI801","Hawaii",510,{"$f":"IF('Plant Control IR Template'!$V$2=B414,C414,\"\")","v":""},"2371255","Pakini-Kaalualu complex, 50 to 70 percent slopes","Kaalualu",null,40,"abrupt textural change",24,39,60,2,"none",null,null,"none"]
["HI801","Hawaii",511,{"$f":"IF('Plant Control IR Template'!$V$2=B415,C415,\"\")","v":""},"2371256","Akihi very cobbly hydrous silt loam, 10 to 20 percent slopes","Akihi",null,100,"bedrock, lithic",35,35,15,2.2999999999999998,"none",null,null,"none"]
["HI801","Hawaii",512,{"$f":"IF('Plant Control IR Template'!$V$2=B416,C416,\"\")","v":""},"2371257","Akihi very cobbly hydrous silt loam, 2 to 10 percent slopes","Akihi",null,100,"bedrock, lithic",35,35,6,2.2999999999999998,"none",null,null,"none"]
["HI801","Hawaii",513,{"$f":"IF('Plant Control IR Template'!$V$2=B417,C417,\"\")","v":""},"2371258","Hilea hydrous silty clay loam, 10 to 20 percent slopes","Hilea",null,100,"bedrock, lithic",19,8,15,3.6,"none",null,null,"none"]
["HI801","Hawaii",514,{"$f":"IF('Plant Control IR Template'!$V$2=B418,C418,\"\")","v":""},"2371259","Hilea hydrous silty clay loam, 3 to 10 percent slopes","Hilea",null,100,"bedrock, lithic",19,8,6,3.6,"none",null,null,"none"]
["HI801","Hawaii",515,{"$f":"IF('Plant Control IR Template'!$V$2=B419,C419,\"\")","v":""},"2371260","Pahipa-Puali association, 2 to 20 percent slopes","Pahipa",null,45,"bedrock, lithic",39,10,12,2.9,"none",null,null,"none"]
["HI801","Hawaii",515,{"$f":"IF('Plant Control IR Template'!$V$2=B420,C420,\"\")","v":""},"2371260","Pahipa-Puali association, 2 to 20 percent slopes","Puali",null,45,"bedrock, lithic",18,0,12,2.7,"none",null,null,"none"]
["HI801","Hawaii",516,{"$f":"IF('Plant Control IR Template'!$V$2=B421,C421,\"\")","v":""},"2371261","Alapai hydrous silty clay loam, 3 to 10 percent slopes","Alapai",null,100,null,80,1,6,3.9,"none",null,null,"none"]
["HI801","Hawaii",517,{"$f":"IF('Plant Control IR Template'!$V$2=B422,C422,\"\")","v":""},"2371262","Alapai hydrous silty clay loam, 10 to 20 percent slopes","Alapai",null,100,null,80,1,15,3.9,"none",null,null,"none"]
["HI801","Hawaii",518,{"$f":"IF('Plant Control IR Template'!$V$2=B423,C423,\"\")","v":""},"2371263","Alapai hydrous silty clay loam, 20 to 35 percent slopes","Alapai",null,100,null,80,1,28,3.9,"none",null,null,"none"]
["HI801","Hawaii",519,{"$f":"IF('Plant Control IR Template'!$V$2=B424,C424,\"\")","v":""},"2371264","Lalaau very cobbly highly decomposed plant material, 2 to 10 percent slopes","Lalaau",null,95,"bedrock, lithic",53,77,6,0.8,"none",null,null,"none"]
["HI801","Hawaii",520,{"$f":"IF('Plant Control IR Template'!$V$2=B425,C425,\"\")","v":""},"2371265","Naalehu medial silty clay loam, 35 to 70 percent slopes","Naalehu",null,100,null,80,2,55,3.9,"none",null,null,"none"]
["HI801","Hawaii",521,{"$f":"IF('Plant Control IR Template'!$V$2=B426,C426,\"\")","v":""},"2371266","Naalehu medial silty clay loam, 3 to 10 percent slopes","Naalehu",null,100,null,80,2,6,3.9,"none",null,null,"none"]
["HI801","Hawaii",522,{"$f":"IF('Plant Control IR Template'!$V$2=B427,C427,\"\")","v":""},"2371267","Naalehu medial silty clay loam, 10 to 20 percent slopes","Naalehu",null,100,null,80,2,15,3.9,"none",null,null,"none"]
["HI801","Hawaii",523,{"$f":"IF('Plant Control IR Template'!$V$2=B428,C428,\"\")","v":""},"2371268","Naalehu medial silty clay loam, 20 to 35 percent slopes","Naalehu",null,100,null,80,2,30,3.9,"none",null,null,"none"]
["HI801","Hawaii",527,{"$f":"IF('Plant Control IR Template'!$V$2=B429,C429,\"\")","v":""},"2371272","Alapai hydrous silty clay loam, 35 to 70 percent slopes","Alapai","lower precipitation",100,null,80,2,55,3.9,"none",null,null,"none"]
["HI801","Hawaii",528,{"$f":"IF('Plant Control IR Template'!$V$2=B430,C430,\"\")","v":""},"2371273","Alapai hydrous silty clay loam, 0 to 3 percent slopes","Alapai",null,100,null,80,1,1,3.9,"none",null,null,"none"]
["HI801","Hawaii",529,{"$f":"IF('Plant Control IR Template'!$V$2=B431,C431,\"\")","v":""},"2371274","Honuapo-Hilea complex, 10 to 20 percent slopes","Honuapo",null,70,"bedrock, lithic",39,0,15,3.9,"occasional","extremely brief","January, February, March, April, May, June, July, August, September, October, November, December","none"]
["HI801","Hawaii",529,{"$f":"IF('Plant Control IR Template'!$V$2=B432,C432,\"\")","v":""},"2371274","Honuapo-Hilea complex, 10 to 20 percent slopes","Hilea",null,30,"bedrock, lithic",19,8,15,3.6,"none",null,null,"none"]
["HI801","Hawaii",530,{"$f":"IF('Plant Control IR Template'!$V$2=B433,C433,\"\")","v":""},"2371275","Hilea-Lava flows complex, 3 to 10 percent slopes","Hilea","cobbly",70,"bedrock, lithic",19,20,6,3.6,"none",null,null,"none"]
["HI801","Hawaii",530,{"$f":"IF('Plant Control IR Template'!$V$2=B434,C434,\"\")","v":""},"2371275","Hilea-Lava flows complex, 3 to 10 percent slopes","Lava flows","pahoehoe",30,"bedrock, lithic",0,0,6,0,"none",null,null,"none"]
["HI801","Hawaii",531,{"$f":"IF('Plant Control IR Template'!$V$2=B435,C435,\"\")","v":""},"2371276","Hilea-Lava flows complex, 10 to 20 percent slopes","Hilea","cobbly",70,"bedrock, lithic",19,20,15,3.6,"none",null,null,"none"]
["HI801","Hawaii",531,{"$f":"IF('Plant Control IR Template'!$V$2=B436,C436,\"\")","v":""},"2371276","Hilea-Lava flows complex, 10 to 20 percent slopes","Lava flows","pahoehoe",30,"bedrock, lithic",0,0,15,0,"none",null,null,"none"]
["HI801","Hawaii",532,{"$f":"IF('Plant Control IR Template'!$V$2=B437,C437,\"\")","v":""},"2371277","Honuapo hydrous silt loam, 3 to 10 percent slopes","Honuapo",null,100,"bedrock, lithic",39,0,6,3.9,"occasional","extremely brief","January, February, March, April, May, June, July, August, September, October, November, December","none"]
["HI801","Hawaii",533,{"$f":"IF('Plant Control IR Template'!$V$2=B438,C438,\"\")","v":""},"2371278","Honuapo-Hilea complex, 20 to 35 percent slopes","Honuapo",null,70,"bedrock, lithic",39,0,28,3.9,"occasional","extremely brief","January, February, March, April, May, June, July, August, September, October, November, December","none"]
["HI801","Hawaii",533,{"$f":"IF('Plant Control IR Template'!$V$2=B439,C439,\"\")","v":""},"2371278","Honuapo-Hilea complex, 20 to 35 percent slopes","Hilea",null,30,"bedrock, lithic",19,8,28,3.6,"none",null,null,"none"]
["HI801","Hawaii",534,{"$f":"IF('Plant Control IR Template'!$V$2=B440,C440,\"\")","v":""},"2371279","Kahaluu-Lava flows complex, 2 to 10 percent slopes","Kahaluu",null,60,"bedrock, lithic",5,0,6,null,"none",null,null,"none"]
["HI801","Hawaii",534,{"$f":"IF('Plant Control IR Template'!$V$2=B441,C441,\"\")","v":""},"2371279","Kahaluu-Lava flows complex, 2 to 10 percent slopes","Lava flows","pahoehoe",40,"bedrock, lithic",0,0,6,0,"none",null,null,"none"]
["HI801","Hawaii",535,{"$f":"IF('Plant Control IR Template'!$V$2=B442,C442,\"\")","v":""},"2371280","Lithic Haplotorrands-Lava flows complex, 2 to 10 percent slopes","Lithic Haplotorrands",null,70,"bedrock, lithic",9,3,6,1.8,"none",null,null,"none"]
["HI801","Hawaii",535,{"$f":"IF('Plant Control IR Template'!$V$2=B443,C443,\"\")","v":""},"2371280","Lithic Haplotorrands-Lava flows complex, 2 to 10 percent slopes","Lava flows","pahoehoe",30,"bedrock, lithic",0,0,6,0,"none",null,null,"none"]
["HI801","Hawaii",536,{"$f":"IF('Plant Control IR Template'!$V$2=B444,C444,\"\")","v":""},"2371281","Puueo extremely cobbly medial silt loam, 2 to 10 percent slopes","Puueo",null,90,"bedrock, lithic",30,68,6,2.9,"none",null,null,"none"]
["HI801","Hawaii",538,{"$f":"IF('Plant Control IR Template'!$V$2=B445,C445,\"\")","v":""},"2371283","Naalehu medial silt loam, 0 to 3 percent slopes","Naalehu",null,100,null,80,2,2,3.9,"none",null,null,"none"]
["HI801","Hawaii",539,{"$f":"IF('Plant Control IR Template'!$V$2=B446,C446,\"\")","v":""},"2371284","Kanohina-Lava flows complex, 10 to 20 percent slopes","Kanohina","cobbly",70,"bedrock, lithic",15,25,15,1.8,"none",null,null,"none"]
["HI801","Hawaii",539,{"$f":"IF('Plant Control IR Template'!$V$2=B447,C447,\"\")","v":""},"2371284","Kanohina-Lava flows complex, 10 to 20 percent slopes","Lava flows","pahoehoe",30,"bedrock, lithic",0,0,15,0,"none",null,null,"none"]
["HI801","Hawaii",540,{"$f":"IF('Plant Control IR Template'!$V$2=B448,C448,\"\")","v":""},"2371285","Kanohina-Lava flows complex, 20 to 35 percent slopes","Kanohina","cobbly",70,"bedrock, lithic",15,25,28,1.8,"none",null,null,"none"]
["HI801","Hawaii",540,{"$f":"IF('Plant Control IR Template'!$V$2=B449,C449,\"\")","v":""},"2371285","Kanohina-Lava flows complex, 20 to 35 percent slopes","Lava flows","pahoehoe",30,"bedrock, lithic",0,0,28,0,"none",null,null,"none"]
["HI801","Hawaii",541,{"$f":"IF('Plant Control IR Template'!$V$2=B450,C450,\"\")","v":""},"2371286","Lava flows-Puueo complex, 2 to 20 percent slopes","Lava flows","`a`a",70,"bedrock, lithic",39,95,11,0.2,"none",null,null,"none"]
["HI801","Hawaii",541,{"$f":"IF('Plant Control IR Template'!$V$2=B451,C451,\"\")","v":""},"2371286","Lava flows-Puueo complex, 2 to 20 percent slopes","Puueo",null,30,"bedrock, lithic",30,68,11,2.9,"none",null,null,"none"]
["HI801","Hawaii",551,{"$f":"IF('Plant Control IR Template'!$V$2=B452,C452,\"\")","v":""},"2371287","Puiwa medial loam, 2 to 20 percent slopes","Puiwa",null,88,"bedrock, lithic",38,0,12,5.0999999999999996,"none",null,null,"none"]
["HI801","Hawaii",552,{"$f":"IF('Plant Control IR Template'!$V$2=B453,C453,\"\")","v":""},"2371288","Keamoku medial silt loam, 10 to 20 percent slopes","Keamoku",null,88,null,80,0,12,4.9000000000000004,"none",null,null,"none"]
["HI801","Hawaii",553,{"$f":"IF('Plant Control IR Template'!$V$2=B454,C454,\"\")","v":""},"2371289","Kuanene medial fine sandy loam, 3 to 20 percent slopes","Kuanene",null,85,"bedrock, lithic",17,0,12,3.7,"rare","very brief",null,"none"]
["HI801","Hawaii",554,{"$f":"IF('Plant Control IR Template'!$V$2=B455,C455,\"\")","v":""},"2371290","Kapulehu-Lava flows-Lithic Ustipsamments complex, 2 to 20 percent slopes","Kapulehu",null,60,"bedrock, lithic",26,55,15,1.3,"none",null,null,"none"]
["HI801","Hawaii",554,{"$f":"IF('Plant Control IR Template'!$V$2=B456,C456,\"\")","v":""},"2371290","Kapulehu-Lava flows-Lithic Ustipsamments complex, 2 to 20 percent slopes","Lava flows","pahoehoe",20,"bedrock, lithic",0,0,5,0,"none",null,null,"none"]
["HI801","Hawaii",554,{"$f":"IF('Plant Control IR Template'!$V$2=B457,C457,\"\")","v":""},"2371290","Kapulehu-Lava flows-Lithic Ustipsamments complex, 2 to 20 percent slopes","Lithic Ustipsamments",null,20,"bedrock, lithic",10,0,5,1,"none",null,null,"none"]
["HI801","Hawaii",555,{"$f":"IF('Plant Control IR Template'!$V$2=B458,C458,\"\")","v":""},"2371291","Lava flows-Kuanene complex, 20 to 35 percent slopes","Kuanene",null,55,"bedrock, lithic",17,0,30,3.7,"none",null,null,"none"]
["HI801","Hawaii",555,{"$f":"IF('Plant Control IR Template'!$V$2=B459,C459,\"\")","v":""},"2371291","Lava flows-Kuanene complex, 20 to 35 percent slopes","Lava flows","pahoehoe",45,"bedrock, lithic",0,0,30,0,"none",null,null,"none"]
["HI801","Hawaii",557,{"$f":"IF('Plant Control IR Template'!$V$2=B460,C460,\"\")","v":""},"2371292","Udifluvents-Kuanene complex, 2 to 10 percent slopes","Udifluvents",null,50,"bedrock, lithic",30,60,8,2,"occasional, rare","very brief","January, February, March, April, May, October, November, December","none"]
["HI801","Hawaii",557,{"$f":"IF('Plant Control IR Template'!$V$2=B461,C461,\"\")","v":""},"2371292","Udifluvents-Kuanene complex, 2 to 10 percent slopes","Kuanene",null,45,"bedrock, lithic",17,0,8,3.7,"rare","very brief",null,"none"]
["HI801","Hawaii",558,{"$f":"IF('Plant Control IR Template'!$V$2=B462,C462,\"\")","v":""},"2371293","Akihi-Alapai complex, 40 to 70 percent slopes","Akihi",null,50,"bedrock, lithic",35,35,60,2.2999999999999998,"none",null,null,"none"]
["HI801","Hawaii",558,{"$f":"IF('Plant Control IR Template'!$V$2=B463,C463,\"\")","v":""},"2371293","Akihi-Alapai complex, 40 to 70 percent slopes","Alapai",null,35,null,80,1,60,3.9,"none",null,null,"none"]
["HI801","Hawaii",559,{"$f":"IF('Plant Control IR Template'!$V$2=B464,C464,\"\")","v":""},"2371294","Alapai-Akihi complex, 10 to 20 percent slopes","Alapai",null,55,null,80,1,15,3.9,"none",null,null,"none"]
["HI801","Hawaii",559,{"$f":"IF('Plant Control IR Template'!$V$2=B465,C465,\"\")","v":""},"2371294","Alapai-Akihi complex, 10 to 20 percent slopes","Akihi",null,45,"bedrock, lithic",35,35,15,2.2999999999999998,"none",null,null,"none"]
["HI801","Hawaii",561,{"$f":"IF('Plant Control IR Template'!$V$2=B466,C466,\"\")","v":""},"2371296","Akihi-Alapai complex, 3 to 10 percent slopes","Akihi",null,60,"bedrock, lithic",35,35,6,2.2999999999999998,"none",null,null,"none"]
["HI801","Hawaii",561,{"$f":"IF('Plant Control IR Template'!$V$2=B467,C467,\"\")","v":""},"2371296","Akihi-Alapai complex, 3 to 10 percent slopes","Alapai",null,40,null,80,2,6,3.9,"none",null,null,"none"]
["HI801","Hawaii",562,{"$f":"IF('Plant Control IR Template'!$V$2=B468,C468,\"\")","v":""},"2371297","Akihi-Alapai complex, 10 to 20 percent slopes","Akihi",null,60,"bedrock, lithic",35,35,16,2.2999999999999998,"none",null,null,"none"]
["HI801","Hawaii",562,{"$f":"IF('Plant Control IR Template'!$V$2=B469,C469,\"\")","v":""},"2371297","Akihi-Alapai complex, 10 to 20 percent slopes","Alapai",null,30,null,80,2,16,3.9,"none",null,null,"none"]
["HI801","Hawaii",563,{"$f":"IF('Plant Control IR Template'!$V$2=B470,C470,\"\")","v":""},"2371298","Alapai-Akihi complex, 20 to 35 percent slopes","Alapai",null,55,null,80,1,25,3.9,"none",null,null,"none"]
["HI801","Hawaii",563,{"$f":"IF('Plant Control IR Template'!$V$2=B471,C471,\"\")","v":""},"2371298","Alapai-Akihi complex, 20 to 35 percent slopes","Akihi",null,45,"bedrock, lithic",35,35,25,2.2999999999999998,"none",null,null,"none"]
["HI801","Hawaii",565,{"$f":"IF('Plant Control IR Template'!$V$2=B472,C472,\"\")","v":""},"2371300","Ustifluvents-Lava flows complex,, 3 to 10 percent slopes, occasionally flooded","Ustifluvents",null,60,"bedrock, lithic",26,60,5,2,"occasional, rare","very brief","January, February, March, April, May, October, November, December","none"]
["HI801","Hawaii",565,{"$f":"IF('Plant Control IR Template'!$V$2=B473,C473,\"\")","v":""},"2371300","Ustifluvents-Lava flows complex,, 3 to 10 percent slopes, occasionally flooded","Lava flows","pahoehoe",40,"bedrock, lithic",0,0,5,0,"none",null,null,"none"]
["HI801","Hawaii",567,{"$f":"IF('Plant Control IR Template'!$V$2=B474,C474,\"\")","v":""},"2371302","Puueo-Naalehu complex, 3 to 10 percent slopes","Puueo",null,65,"bedrock, lithic",30,68,6,2.9,"none",null,null,"none"]
["HI801","Hawaii",567,{"$f":"IF('Plant Control IR Template'!$V$2=B475,C475,\"\")","v":""},"2371302","Puueo-Naalehu complex, 3 to 10 percent slopes","Naalehu",null,35,null,80,2,6,3.9,"none",null,null,"none"]
["HI801","Hawaii",568,{"$f":"IF('Plant Control IR Template'!$V$2=B476,C476,\"\")","v":""},"2371303","Honuapo hydrous silt loam, 10 to 20 percent slopes","Honuapo",null,85,"bedrock, lithic",39,0,16,3.9,"occasional","extremely brief","January, February, March, April, May, June, July, August, September, October, November, December","none"]
["HI801","Hawaii",569,{"$f":"IF('Plant Control IR Template'!$V$2=B477,C477,\"\")","v":""},"2371304","Puueo extremely cobbly medial silt loam, 10 to 20 percent slopes","Puueo",null,90,"bedrock, lithic",30,68,16,2.9,"none",null,null,"none"]
["HI801","Hawaii",570,{"$f":"IF('Plant Control IR Template'!$V$2=B478,C478,\"\")","v":""},"2371305","Kanohina-Ustifluvents-Lava flows complex, 3 to 10 percent slopes","Kanohina",null,50,"bedrock, lithic",6,0,6,0.6,"none",null,null,"none"]
["HI801","Hawaii",570,{"$f":"IF('Plant Control IR Template'!$V$2=B479,C479,\"\")","v":""},"2371305","Kanohina-Ustifluvents-Lava flows complex, 3 to 10 percent slopes","Ustifluvents",null,30,"bedrock, lithic",26,60,4,2,"occasional, rare","very brief","January, February, March, April, May, October, November, December","none"]
["HI801","Hawaii",570,{"$f":"IF('Plant Control IR Template'!$V$2=B480,C480,\"\")","v":""},"2371305","Kanohina-Ustifluvents-Lava flows complex, 3 to 10 percent slopes","Lava flows","pahoehoe",20,"bedrock, lithic",0,0,5,0,"none",null,null,"none"]
["HI801","Hawaii",571,{"$f":"IF('Plant Control IR Template'!$V$2=B481,C481,\"\")","v":""},"2371306","Ustifluvents-Lava flows-Naalehu complex, 3 to 10 percent slopes, occasionally flooded","Ustifluvents",null,35,"bedrock, lithic",26,60,4,2,"occasional, rare","very brief","January, February, March, April, May, October, November, December","none"]
["HI801","Hawaii",571,{"$f":"IF('Plant Control IR Template'!$V$2=B482,C482,\"\")","v":""},"2371306","Ustifluvents-Lava flows-Naalehu complex, 3 to 10 percent slopes, occasionally flooded","Naalehu","occasionally flooded",30,null,80,2,3,3.9,"occasional","very brief","January, February, March, April, May, June, July, August, September, October, November, December","occasional","brief","January, February, March, April, May, June, July, August, September, October, November, December"]
["HI801","Hawaii",571,{"$f":"IF('Plant Control IR Template'!$V$2=B483,C483,\"\")","v":""},"2371306","Ustifluvents-Lava flows-Naalehu complex, 3 to 10 percent slopes, occasionally flooded","Lava flows","pahoehoe",30,"bedrock, lithic",0,0,6,0,"none",null,null,"none"]
["HI801","Hawaii",572,{"$f":"IF('Plant Control IR Template'!$V$2=B484,C484,\"\")","v":""},"2371307","Puu Oo medial silt loam, 10 to 20 percent slopes","Puu Oo",null,100,"bedrock, paralithic",27,0,14,5.2,"none",null,null,"none"]
["HI801","Hawaii",573,{"$f":"IF('Plant Control IR Template'!$V$2=B485,C485,\"\")","v":""},"2371308","Kaholimo medial silt loam, 10 to 20 percent slopes","Kaholimo",null,95,"bedrock, lithic",13,0,13,3.2,"none",null,null,"none"]
["HI801","Hawaii",574,{"$f":"IF('Plant Control IR Template'!$V$2=B486,C486,\"\")","v":""},"2371309","Ihuanu-Lava flows, pahoehoe complex, 10 to 20 percent slopes","Ihuanu",null,55,"bedrock, lithic",22,60,15,1.2,"none",null,null,"none"]
["HI801","Hawaii",574,{"$f":"IF('Plant Control IR Template'!$V$2=B487,C487,\"\")","v":""},"2371309","Ihuanu-Lava flows, pahoehoe complex, 10 to 20 percent slopes","Lava flows","pahoehoe",35,"bedrock, lithic",0,0,15,0,"none",null,null,"none"]
["HI801","Hawaii",575,{"$f":"IF('Plant Control IR Template'!$V$2=B488,C488,\"\")","v":""},"2371310","Humic Durustands, 2 to 10 percent slopes","Humic Durustands",null,95,"bedrock, lithic",26,0,8,3.7,"none",null,null,"none"]
["HI801","Hawaii",576,{"$f":"IF('Plant Control IR Template'!$V$2=B489,C489,\"\")","v":""},"2371311","Puali-Puu Oo-Pahipa association, 2 to 20 percent slopes","Puali",null,35,"bedrock, lithic",18,0,12,2.7,"none",null,null,"none"]
["HI801","Hawaii",576,{"$f":"IF('Plant Control IR Template'!$V$2=B490,C490,\"\")","v":""},"2371311","Puali-Puu Oo-Pahipa association, 2 to 20 percent slopes","Puu Oo",null,35,"bedrock, paralithic",27,0,12,5.2,"none",null,null,"none"]
["HI801","Hawaii",576,{"$f":"IF('Plant Control IR Template'!$V$2=B491,C491,\"\")","v":""},"2371311","Puali-Puu Oo-Pahipa association, 2 to 20 percent slopes","Pahipa",null,25,"bedrock, lithic",39,10,12,2.9,"none",null,null,"none"]
["HI801","Hawaii",577,{"$f":"IF('Plant Control IR Template'!$V$2=B492,C492,\"\")","v":""},"2371312","Pahipa-Puu Oo association, 2 to 20 percent slopes","Pahipa",null,70,"bedrock, lithic",39,10,12,2.9,"none",null,null,"none"]
["HI801","Hawaii",577,{"$f":"IF('Plant Control IR Template'!$V$2=B493,C493,\"\")","v":""},"2371312","Pahipa-Puu Oo association, 2 to 20 percent slopes","Puu Oo",null,25,"bedrock, paralithic",27,0,12,5.2,"none",null,null,"none"]
["HI801","Hawaii",578,{"$f":"IF('Plant Control IR Template'!$V$2=B494,C494,\"\")","v":""},"2371313","Puu Oo-Kaholimo association, 2 to 20 percent slopes","Puu Oo",null,55,"bedrock, paralithic",27,0,12,5.2,"none",null,null,"none"]
["HI801","Hawaii",578,{"$f":"IF('Plant Control IR Template'!$V$2=B495,C495,\"\")","v":""},"2371313","Puu Oo-Kaholimo association, 2 to 20 percent slopes","Kaholimo",null,40,"bedrock, lithic",13,0,12,3.2,"none",null,null,"none"]
["HI801","Hawaii",579,{"$f":"IF('Plant Control IR Template'!$V$2=B496,C496,\"\")","v":""},"2371314","Kaholimo-Lava flows complex, 20 to 40 percent slopes","Kaholimo",null,60,"bedrock, lithic",13,0,25,3.2,"none",null,null,"none"]
["HI801","Hawaii",579,{"$f":"IF('Plant Control IR Template'!$V$2=B497,C497,\"\")","v":""},"2371314","Kaholimo-Lava flows complex, 20 to 40 percent slopes","Lava flows","pahoehoe",30,"bedrock, lithic",0,0,35,0,"none",null,null,"none"]
["HI801","Hawaii",601,{"$f":"IF('Plant Control IR Template'!$V$2=B498,C498,\"\")","v":""},"2371316","Kaholimo-Lava flows complex, 3 to 10 percent slopes","Kaholimo",null,75,"bedrock, lithic",13,0,3,3.2,"none",null,null,"none"]
["HI801","Hawaii",601,{"$f":"IF('Plant Control IR Template'!$V$2=B499,C499,\"\")","v":""},"2371316","Kaholimo-Lava flows complex, 3 to 10 percent slopes","Lava flows","pahoehoe",25,"bedrock, lithic",0,0,3,0,"none",null,null,"none"]
["HI801","Hawaii",602,{"$f":"IF('Plant Control IR Template'!$V$2=B500,C500,\"\")","v":""},"2371317","Keamoku stony medial loam, 3 to 10 percent slopes","Keamoku","stony",90,null,80,25,4,4.4000000000000004,"none",null,null,"none"]
["HI801","Hawaii",603,{"$f":"IF('Plant Control IR Template'!$V$2=B501,C501,\"\")","v":""},"2371318","Pekailio stony medial loam, 3 to 10 percent slopes","Pekailio",null,100,null,80,30,4,3.8,"none",null,null,"none"]
["HI801","Hawaii",604,{"$f":"IF('Plant Control IR Template'!$V$2=B502,C502,\"\")","v":""},"2371319","Hydric Endoaquands, 0 to 3 percent slopes","Hydric Endoaquands",null,85,"bedrock, lithic",29,0,1,4,"none",null,null,"frequent","very brief","January, February, March, April, May, June, July, August, September, October, November, December"]
["HI801","Hawaii",605,{"$f":"IF('Plant Control IR Template'!$V$2=B503,C503,\"\")","v":""},"2371320","Kaholimo-Ki complex, 3 to 10 percent slopes","Kaholimo",null,60,"bedrock, lithic",13,0,3,3.2,"none",null,null,"none"]
["HI801","Hawaii",605,{"$f":"IF('Plant Control IR Template'!$V$2=B504,C504,\"\")","v":""},"2371320","Kaholimo-Ki complex, 3 to 10 percent slopes","Ki",null,35,null,80,15,5,3.2,"none",null,null,"none"]
["HI801","Hawaii",606,{"$f":"IF('Plant Control IR Template'!$V$2=B505,C505,\"\")","v":""},"2371321","Puaulu-Hilea-Pekailio complex, 40 to 70 percent slopes","Puaulu",null,35,"densic material",12,6,60,4.9000000000000004,"none",null,null,"none"]
["HI801","Hawaii",606,{"$f":"IF('Plant Control IR Template'!$V$2=B506,C506,\"\")","v":""},"2371321","Puaulu-Hilea-Pekailio complex, 40 to 70 percent slopes","Hilea",null,35,"bedrock, lithic",7,8,40,1.4,"none",null,null,"none"]
["HI801","Hawaii",606,{"$f":"IF('Plant Control IR Template'!$V$2=B507,C507,\"\")","v":""},"2371321","Puaulu-Hilea-Pekailio complex, 40 to 70 percent slopes","Pekailio",null,30,null,80,30,60,3.8,"none",null,null,"none"]
["HI801","Hawaii",607,{"$f":"IF('Plant Control IR Template'!$V$2=B508,C508,\"\")","v":""},"2371322","Kaholimo-Ki complex, 10 to 20 percent slopes","Kaholimo",null,60,"bedrock, lithic",13,0,10,3.2,"none",null,null,"none"]
["HI801","Hawaii",607,{"$f":"IF('Plant Control IR Template'!$V$2=B509,C509,\"\")","v":""},"2371322","Kaholimo-Ki complex, 10 to 20 percent slopes","Ki",null,35,null,80,15,10,3.2,"none",null,null,"none"]
["HI801","Hawaii",608,{"$f":"IF('Plant Control IR Template'!$V$2=B510,C510,\"\")","v":""},"2371323","Kau-Lalo complex, 3 to 10 percent slopes","Kau",null,50,"bedrock, lithic",40,14,4,4.2,"none",null,null,"none"]
["HI801","Hawaii",608,{"$f":"IF('Plant Control IR Template'!$V$2=B511,C511,\"\")","v":""},"2371323","Kau-Lalo complex, 3 to 10 percent slopes","Lalo",null,40,null,80,3,4,5.8,"none",null,null,"none"]
["HI801","Hawaii",609,{"$f":"IF('Plant Control IR Template'!$V$2=B512,C512,\"\")","v":""},"2371324","Piihonua hydrous silty clay loam, 20 to 35 percent slopes","Piihonua",null,100,"bedrock, lithic",47,0,25,5,"none",null,null,"none"]
["HI801","Hawaii",610,{"$f":"IF('Plant Control IR Template'!$V$2=B513,C513,\"\")","v":""},"2371325","Piihonua hydrous silty clay loam, 0 to 3 percent slopes","Piihonua",null,100,"bedrock, lithic",47,0,2,5,"none",null,null,"none"]
["HI801","Hawaii",611,{"$f":"IF('Plant Control IR Template'!$V$2=B514,C514,\"\")","v":""},"2371326","Kulani hydrous highly organic loam, 10 to 20 percent slopes","Kulani",null,100,"placic",7,8,15,3.3,"none",null,null,"none"]
["HI801","Hawaii",612,{"$f":"IF('Plant Control IR Template'!$V$2=B515,C515,\"\")","v":""},"2371327","Kulani hydrous highly organic loam, 3 to 10 percent slopes","Kulani",null,90,"placic",7,8,5,3.3,"none",null,null,"none"]
["HI801","Hawaii",613,{"$f":"IF('Plant Control IR Template'!$V$2=B516,C516,\"\")","v":""},"2371328","Kiloa extremely cobbly highly decomposed plant material, 3 to 10 percent slopes","Kiloa",null,95,"bedrock, lithic",60,65,4,1.7,"none",null,null,"none"]
["HI801","Hawaii",614,{"$f":"IF('Plant Control IR Template'!$V$2=B517,C517,\"\")","v":""},"2371329","Waiakea hydrous loam, 2 to 20 percent slopes","Waiakea",null,95,"bedrock, lithic",39,13,4,4.5999999999999996,"none",null,null,"none"]
["HI801","Hawaii",615,{"$f":"IF('Plant Control IR Template'!$V$2=B518,C518,\"\")","v":""},"2371330","Kau hydrous silt loam, 3 to 10 percent slopes","Kau",null,100,"bedrock, lithic",40,14,4,4.2,"none",null,null,"none"]
["HI801","Hawaii",616,{"$f":"IF('Plant Control IR Template'!$V$2=B519,C519,\"\")","v":""},"2371331","Kahaluu highly decomposed plant material, 3 to 10 percent slopes","Kahaluu",null,90,"bedrock, lithic",10,5,4,0,"none",null,null,"none"]
["HI801","Hawaii",617,{"$f":"IF('Plant Control IR Template'!$V$2=B520,C520,\"\")","v":""},"2371332","Kaholimo medial silt loam, 3 to 10 percent slopes","Kaholimo",null,90,"bedrock, lithic",13,0,3,3.2,"none",null,null,"none"]
["HI801","Hawaii",619,{"$f":"IF('Plant Control IR Template'!$V$2=B521,C521,\"\")","v":""},"2371334","Kiloa-Lava flows complex, 3 to 10 percent slopes","Kiloa",null,50,"bedrock, lithic",60,65,4,1.7,"none",null,null,"none"]
["HI801","Hawaii",619,{"$f":"IF('Plant Control IR Template'!$V$2=B522,C522,\"\")","v":""},"2371334","Kiloa-Lava flows complex, 3 to 10 percent slopes","Lava flows","`a`a",50,"bedrock, lithic",39,95,4,0.2,"none",null,null,"none"]
["HI801","Hawaii",621,{"$f":"IF('Plant Control IR Template'!$V$2=B523,C523,\"\")","v":""},"2371336","Eheuiki-Pekailio complex, 3 to 10 percent slopes","Eheuiki",null,60,null,80,1,4,6.3,"none",null,null,"none"]
["HI801","Hawaii",621,{"$f":"IF('Plant Control IR Template'!$V$2=B524,C524,\"\")","v":""},"2371336","Eheuiki-Pekailio complex, 3 to 10 percent slopes","Pekailio",null,40,null,80,30,4,3.8,"none",null,null,"none"]
["HI801","Hawaii",622,{"$f":"IF('Plant Control IR Template'!$V$2=B525,C525,\"\")","v":""},"2371337","Kopua-Makaala complex, 3 to 10 percent slopes","Kopua",null,65,"bedrock, lithic",19,9,3,3.6,"none",null,null,"occasional",",very brief","September, October, November"]
["HI801","Hawaii",622,{"$f":"IF('Plant Control IR Template'!$V$2=B526,C526,\"\")","v":""},"2371337","Kopua-Makaala complex, 3 to 10 percent slopes","Makaala",null,30,"bedrock, lithic",29,9,3,5.9,"none",null,null,"none"]
["HI801","Hawaii",623,{"$f":"IF('Plant Control IR Template'!$V$2=B527,C527,\"\")","v":""},"2371338","Keei very cobbly slightly decomposed plant material, 3 to 10 percent slopes","Keei","very cobbly",85,"bedrock, lithic",5,35,4,0.7,"none",null,null,"none"]
["HI801","Hawaii",624,{"$f":"IF('Plant Control IR Template'!$V$2=B528,C528,\"\")","v":""},"2371339","Kopua-Ihope complex, 3 to 10 percent slopes","Kopua",null,70,"bedrock, lithic",17,4,3,4.4000000000000004,"none",null,null,"occasional",",very brief","September, October, November"]
["HI801","Hawaii",624,{"$f":"IF('Plant Control IR Template'!$V$2=B529,C529,\"\")","v":""},"2371339","Kopua-Ihope complex, 3 to 10 percent slopes","Ihope","hydrous silt loam",20,"bedrock, lithic",17,0,3,3.6,"none",null,null,"frequent","very brief","January, February, March, April, May, June, July, August, September, October, November, December"]
["HI801","Hawaii",625,{"$f":"IF('Plant Control IR Template'!$V$2=B530,C530,\"\")","v":""},"2371340","Hao medial loam, 3 to 10 percent slopes","Hao",null,90,"placic",15,0,4,4.5,"none",null,null,"frequent, occasional","brief,","January, February, March, November, December"]
["HI801","Hawaii",626,{"$f":"IF('Plant Control IR Template'!$V$2=B531,C531,\"\")","v":""},"2371341","Lalaau-Lava flows complex, 2 to 20 percent slopes","Lava flows","`a`a",45,"bedrock, lithic",39,95,6,0.2,"none",null,null,"none"]
["HI801","Hawaii",626,{"$f":"IF('Plant Control IR Template'!$V$2=B532,C532,\"\")","v":""},"2371341","Lalaau-Lava flows complex, 2 to 20 percent slopes","Lalaau",null,45,"bedrock, lithic",53,77,6,0.8,"none",null,null,"none"]
["HI801","Hawaii",627,{"$f":"IF('Plant Control IR Template'!$V$2=B533,C533,\"\")","v":""},"2371342","Kahaluu-lava flows-Ainahou complex, 2 to 10 percent slopes","Kahaluu",null,35,"bedrock, lithic",10,5,6,0,"none",null,null,"none"]
["HI801","Hawaii",627,{"$f":"IF('Plant Control IR Template'!$V$2=B534,C534,\"\")","v":""},"2371342","Kahaluu-lava flows-Ainahou complex, 2 to 10 percent slopes","Lava flows","pahoehoe",35,"bedrock, lithic",0,0,6,0,"none",null,null,"none"]
["HI801","Hawaii",627,{"$f":"IF('Plant Control IR Template'!$V$2=B535,C535,\"\")","v":""},"2371342","Kahaluu-lava flows-Ainahou complex, 2 to 10 percent slopes","Ainahou",null,30,"bedrock, lithic",9,0,3,2,"none",null,null,"frequent","brief,very brief","January, February, March, April, May, June, July, August, September, October, November, December"]
["HI801","Hawaii",628,{"$f":"IF('Plant Control IR Template'!$V$2=B536,C536,\"\")","v":""},"2371343","Papai extremely cobbly highly decomposed plant material, 2 to 10 percent slopes","Papai",null,95,"bedrock, lithic",53,65,4,1.7,"none",null,null,"none"]
["HI801","Hawaii",629,{"$f":"IF('Plant Control IR Template'!$V$2=B537,C537,\"\")","v":""},"2371344","Panaewa very cobbly hydrous loam, 2 to 10 percent slopes","Panaewa",null,80,"bedrock, lithic",16,65,3,2.8,"none",null,null,"occasional",",very brief","October, November"]
["HI801","Hawaii",630,{"$f":"IF('Plant Control IR Template'!$V$2=B538,C538,\"\")","v":""},"2371345","Nanaia-Ohaikea complex, 2 to 10 percent slopes","Ohaikea",null,45,"bedrock, lithic",30,1,4,4.8,"none",null,null,"none"]
["HI801","Hawaii",630,{"$f":"IF('Plant Control IR Template'!$V$2=B539,C539,\"\")","v":""},"2371345","Nanaia-Ohaikea complex, 2 to 10 percent slopes","Nanaia","medial loam",45,"bedrock, lithic",6,2,4,0.7,"none",null,null,"none"]
["HI801","Hawaii",631,{"$f":"IF('Plant Control IR Template'!$V$2=B540,C540,\"\")","v":""},"2371346","Kapapala medial loam, 2 to 10 percent slopes","Kapapala",null,90,"bedrock, lithic",43,1,4,4.5,"none",null,null,"none"]
["HI801","Hawaii",632,{"$f":"IF('Plant Control IR Template'!$V$2=B541,C541,\"\")","v":""},"2371347","Kapapala medial loam, 20 to 40 percent slopes","Kapapala",null,85,"bedrock, lithic",43,1,30,4.5,"none",null,null,"none"]
["HI801","Hawaii",634,{"$f":"IF('Plant Control IR Template'!$V$2=B542,C542,\"\")","v":""},"2371348","Ohaikea highly organic medial loam, 2 to 10 percent slopes","Ohaikea",null,85,"bedrock, lithic",30,1,4,4.8,"none",null,null,"none"]
["HI801","Hawaii",636,{"$f":"IF('Plant Control IR Template'!$V$2=B543,C543,\"\")","v":""},"2371349","Nanaia-Lava flows complex, 20 to 40 percent slopes","Nanaia","medial loam",60,"bedrock, lithic",6,2,25,0.7,"none",null,null,"none"]
["HI801","Hawaii",636,{"$f":"IF('Plant Control IR Template'!$V$2=B544,C544,\"\")","v":""},"2371349","Nanaia-Lava flows complex, 20 to 40 percent slopes","Lava flows","pahoehoe",40,"bedrock, lithic",0,0,35,0,"none",null,null,"none"]
["HI801","Hawaii",637,{"$f":"IF('Plant Control IR Template'!$V$2=B545,C545,\"\")","v":""},"2371350","Papai-Urban land complex, 2 to 10 percent slopes","Papai",null,50,"bedrock, lithic",53,65,4,1.7,"none",null,null,"none"]
["HI801","Hawaii",637,{"$f":"IF('Plant Control IR Template'!$V$2=B546,C546,\"\")","v":""},"2371350","Papai-Urban land complex, 2 to 10 percent slopes","Urban land",null,45,null,80,0,4,null,"none",null,null,"none"]
["HI801","Hawaii",638,{"$f":"IF('Plant Control IR Template'!$V$2=B547,C547,\"\")","v":""},"2371351","Panaewa-Urban land complex, 2 to 10 percent slopes","Urban land",null,45,null,80,0,3,null,"none",null,null,"none"]
["HI801","Hawaii",638,{"$f":"IF('Plant Control IR Template'!$V$2=B548,C548,\"\")","v":""},"2371351","Panaewa-Urban land complex, 2 to 10 percent slopes","Panaewa",null,45,"bedrock, lithic",16,65,3,2.8,"none",null,null,"occasional",",very brief","October, November"]
["HI801","Hawaii",639,{"$f":"IF('Plant Control IR Template'!$V$2=B549,C549,\"\")","v":""},"2371352","Keaukaha-Urban land complex, 2 to 10 percent slopes","Keaukaha",null,45,"bedrock, lithic",4,2,4,null,"none",null,null,"none"]
["HI801","Hawaii",639,{"$f":"IF('Plant Control IR Template'!$V$2=B550,C550,\"\")","v":""},"2371352","Keaukaha-Urban land complex, 2 to 10 percent slopes","Urban land",null,45,null,80,0,4,null,"none",null,null,"none"]
["HI801","Hawaii",640,{"$f":"IF('Plant Control IR Template'!$V$2=B551,C551,\"\")","v":""},"2371353","Opihikao-Urban land complex, 2 to 20 percent slopes","Urban land",null,45,null,80,0,8,null,"none",null,null,"none"]
["HI801","Hawaii",640,{"$f":"IF('Plant Control IR Template'!$V$2=B552,C552,\"\")","v":""},"2371353","Opihikao-Urban land complex, 2 to 20 percent slopes","Opihikao",null,45,"bedrock, lithic",3,0,8,null,"none",null,null,"none"]
["HI801","Hawaii",641,{"$f":"IF('Plant Control IR Template'!$V$2=B553,C553,\"\")","v":""},"2371354","Kau very cobbly highly organic hydrous silt loam, 2 to 10 percent slopes","Kau","very cobbly highly organic hydrous silt",85,"bedrock, lithic",40,42,4,4.2,"none",null,null,"none"]
["HI801","Hawaii",651,{"$f":"IF('Plant Control IR Template'!$V$2=B554,C554,\"\")","v":""},"2371355","Keei slightly decomposed plant material, 3 to 10 percent slopes","Keei",null,92,"bedrock, lithic",5,9,4,null,"none",null,null,"none"]
["HI801","Hawaii",652,{"$f":"IF('Plant Control IR Template'!$V$2=B555,C555,\"\")","v":""},"2371356","Ohia hydrous silt loam, 3 to 10 percent slopes","Ohia",null,95,"bedrock, lithic",62,0,4,5.7,"none",null,null,"none"]
["HI801","Hawaii",653,{"$f":"IF('Plant Control IR Template'!$V$2=B556,C556,\"\")","v":""},"2371357","Keaukaha highly decomposed plant material, 2 to 10 percent slopes","Keaukaha",null,90,"bedrock, lithic",4,2,4,null,"none",null,null,"none"]
["HI801","Hawaii",655,{"$f":"IF('Plant Control IR Template'!$V$2=B557,C557,\"\")","v":""},"2371358","Hakuma  highly organic hydrous loam, 2 to 10 percent slopes, occasionally flooded","Hakuma","occasionally flooded",90,"bedrock, lithic",13,7,4,3.3,"occasional, none","extremely brief,","January, February, October, November, December","none"]
["HI801","Hawaii",657,{"$f":"IF('Plant Control IR Template'!$V$2=B558,C558,\"\")","v":""},"2371359","Malama-Lava flows complex, dry, 2 to 40 percent slopes","Malama",null,60,"bedrock, lithic",50,89,10,0.8,"none",null,null,"none"]
["HI801","Hawaii",657,{"$f":"IF('Plant Control IR Template'!$V$2=B559,C559,\"\")","v":""},"2371359","Malama-Lava flows complex, dry, 2 to 40 percent slopes","Lava flows","`a`a",40,"bedrock, lithic",39,95,10,0.2,"none",null,null,"none"]
["HI801","Hawaii",659,{"$f":"IF('Plant Control IR Template'!$V$2=B560,C560,\"\")","v":""},"2371361","Malama extremely cobbly highly decomposed plant material, 2 to 40 percent slopes","Malama",null,90,"bedrock, lithic",50,89,4,0.8,"none",null,null,"none"]
["HI801","Hawaii",660,{"$f":"IF('Plant Control IR Template'!$V$2=B561,C561,\"\")","v":""},"2371362","Olaa cobbly hydrous loam, 2 to 10 percent slopes","Olaa",null,90,"bedrock, lithic",31,32,4,3.4,"none",null,null,"none"]
["HI801","Hawaii",662,{"$f":"IF('Plant Control IR Template'!$V$2=B562,C562,\"\")","v":""},"2371364","Hakuma highly organic hydrous loam, 2 to 10 percent slopes","Hakuma",null,90,"bedrock, lithic",12,6,4,3,"none",null,null,"rare","very brief,"]
["HI801","Hawaii",664,{"$f":"IF('Plant Control IR Template'!$V$2=B563,C563,\"\")","v":""},"2371366","Opihikao highly decomposed plant material, 2 to 20 percent slopes","Opihikao",null,90,"bedrock, lithic",3,0,8,null,"none",null,null,"none"]
["HI801","Hawaii",665,{"$f":"IF('Plant Control IR Template'!$V$2=B564,C564,\"\")","v":""},"2371367","Iilewa cobbly hydrous highly organic silty clay loam, 30 to 80 percent slopes","Iilewa",null,85,"bedrock, lithic",28,24,60,5.0999999999999996,"none",null,null,"none"]
["HI801","Hawaii",666,{"$f":"IF('Plant Control IR Template'!$V$2=B565,C565,\"\")","v":""},"2435741","Hakuma highly organic hydrous loam, dry, 2 to 10 percent slopes","Hakuma","dry",90,"bedrock, lithic",12,6,4,3,"none",null,null,"rare","very brief,"]
["HI801","Hawaii",667,{"$f":"IF('Plant Control IR Template'!$V$2=B566,C566,\"\")","v":""},"2435742","Opihikao highly decomposed plant material, dry, 2 to 20 percent slopes","Opihikao","dry",90,"bedrock, lithic",3,0,8,null,"none",null,null,"none"]
["HI801","Hawaii",669,{"$f":"IF('Plant Control IR Template'!$V$2=B567,C567,\"\")","v":""},"2371368","Iilewa cobbly hydrous highly organic silty clay loam, 0 to 30 percent slopes","Iilewa",null,85,"bedrock, lithic",28,24,10,5.0999999999999996,"none",null,null,"none"]
["HI801","Hawaii",670,{"$f":"IF('Plant Control IR Template'!$V$2=B568,C568,\"\")","v":""},"2371369","Panaewa very cobbly hydrous loam, dry, 2 to 10 percent slopes","Panaewa","dry",85,"bedrock, lithic",16,65,3,2.8,"none",null,null,"occasional",",very brief","October, November"]
["HI801","Hawaii",671,{"$f":"IF('Plant Control IR Template'!$V$2=B569,C569,\"\")","v":""},"2371370","Olaa cobbly hydrous loam, dry, 2 to 10 percent slopes","Olaa","dry",95,"bedrock, lithic",31,32,4,3.4,"none",null,null,"none"]
["HI801","Hawaii",672,{"$f":"IF('Plant Control IR Template'!$V$2=B570,C570,\"\")","v":""},"2371371","Malama extremely cobbly highly decomposed plant material, dry, 2 to 40 percent slopes","Malama","dry",90,"bedrock, lithic",50,89,4,0.8,"none",null,null,"none"]
["HI801","Hawaii",673,{"$f":"IF('Plant Control IR Template'!$V$2=B571,C571,\"\")","v":""},"2371372","Malama-Lava flows complex, 2 to 40 percent slopes","Malama",null,60,"bedrock, lithic",50,89,10,0.8,"none",null,null,"none"]
["HI801","Hawaii",673,{"$f":"IF('Plant Control IR Template'!$V$2=B572,C572,\"\")","v":""},"2371372","Malama-Lava flows complex, 2 to 40 percent slopes","Lava flows","`a`a",40,"bedrock, lithic",39,95,10,0.2,"none",null,null,"none"]
["HI801","Hawaii",709,{"$f":"IF('Plant Control IR Template'!$V$2=B573,C573,\"\")","v":""},"2371373","Lava flows-Lithic Ustipsamments complex, 2 to 10 percent slopes","Lava flows","pahoehoe",60,"bedrock, lithic",0,0,8,0,"none",null,null,"none"]
["HI801","Hawaii",709,{"$f":"IF('Plant Control IR Template'!$V$2=B574,C574,\"\")","v":""},"2371373","Lava flows-Lithic Ustipsamments complex, 2 to 10 percent slopes","Lithic Ustipsamments",null,40,"bedrock, lithic",10,0,3,1,"none",null,null,"none"]
["HI801","Hawaii",711,{"$f":"IF('Plant Control IR Template'!$V$2=B575,C575,\"\")","v":""},"2371875","Lava flows-Apuki complex, 2 to 20 percent slopes","Lava flows","pahoehoe",65,"bedrock, lithic",0,0,8,0,"none",null,null,"none"]
["HI801","Hawaii",711,{"$f":"IF('Plant Control IR Template'!$V$2=B576,C576,\"\")","v":""},"2371875","Lava flows-Apuki complex, 2 to 20 percent slopes","Apuki",null,30,"bedrock, lithic",7,0,3,0.9,"none",null,null,"none"]
["HI801","Hawaii",716,{"$f":"IF('Plant Control IR Template'!$V$2=B577,C577,\"\")","v":""},"2371876","Alahapa extremely stony ashy sandy loam, 2 to 10 percent slopes","Alahapa",null,90,null,80,78,4,0.8,"none",null,null,"none"]
["HI801","Hawaii",717,{"$f":"IF('Plant Control IR Template'!$V$2=B578,C578,\"\")","v":""},"2371374","Alahapa-Lava flows complex, 2 to 10 percent slopes","Alahapa",null,50,null,80,78,4,0.8,"none",null,null,"none"]
["HI801","Hawaii",717,{"$f":"IF('Plant Control IR Template'!$V$2=B579,C579,\"\")","v":""},"2371374","Alahapa-Lava flows complex, 2 to 10 percent slopes","Lava flows","`a`a",40,"bedrock, lithic",39,95,8,0.2,"none",null,null,"none"]
["HI801","Hawaii",719,{"$f":"IF('Plant Control IR Template'!$V$2=B580,C580,\"\")","v":""},"2371877","Heake ashy loam, 2 to 10 percent slopes","Heake",null,85,"densic material",8,6,4,2.7,"none",null,null,"none"]
["HI801","Hawaii",720,{"$f":"IF('Plant Control IR Template'!$V$2=B581,C581,\"\")","v":""},"2371878","Heake-Lava flows complex, 2 to 10 percent slopes","Heake",null,45,"densic material",8,6,4,2.7,"none",null,null,"none"]
["HI801","Hawaii",720,{"$f":"IF('Plant Control IR Template'!$V$2=B582,C582,\"\")","v":""},"2371878","Heake-Lava flows complex, 2 to 10 percent slopes","Lava flows","pahoehoe",35,"bedrock, lithic",0,0,8,0,"none",null,null,"none"]
["HI801","Hawaii",725,{"$f":"IF('Plant Control IR Template'!$V$2=B583,C583,\"\")","v":""},"2495917","Lava flows-Kaholimo complex, 2 to 15 percent slopes","Lava flows","pahoehoe",55,"bedrock, lithic",0,0,8,0,"none",null,null,"none"]
["HI801","Hawaii",725,{"$f":"IF('Plant Control IR Template'!$V$2=B584,C584,\"\")","v":""},"2495917","Lava flows-Kaholimo complex, 2 to 15 percent slopes","Kaholimo",null,20,"bedrock, lithic",13,0,3,3.2,"none",null,null,"none"]
["HI801","Hawaii",726,{"$f":"IF('Plant Control IR Template'!$V$2=B585,C585,\"\")","v":""},"2371375","Kulalio silt loam, 2 to 10 percent slopes","Kulalio",null,88,null,80,26,4,3.1,"none",null,null,"none"]
["HI801","Hawaii",727,{"$f":"IF('Plant Control IR Template'!$V$2=B586,C586,\"\")","v":""},"2371879","Puaulu hydrous silt loam, 2 to 20 percent slopes","Puaulu",null,90,"densic material",12,6,4,4.9000000000000004,"none",null,null,"none"]
["HI801","Hawaii",728,{"$f":"IF('Plant Control IR Template'!$V$2=B587,C587,\"\")","v":""},"2371376","Puaulu-Hao complex, 2 to 20 percent slopes","Puaulu",null,65,"densic material",12,6,4,4.9000000000000004,"none",null,null,"none"]
["HI801","Hawaii",728,{"$f":"IF('Plant Control IR Template'!$V$2=B588,C588,\"\")","v":""},"2371376","Puaulu-Hao complex, 2 to 20 percent slopes","Hao",null,25,"placic",3,1,4,5.8,"none",null,null,"frequent, occasional","brief,","January, February, March, November, December"]
["HI801","Hawaii",729,{"$f":"IF('Plant Control IR Template'!$V$2=B589,C589,\"\")","v":""},"2371377","Eheuiki-Puaulu complex, 2 to 20 percent slopes","Eheuiki",null,60,null,80,1,4,6.3,"none",null,null,"none"]
["HI801","Hawaii",729,{"$f":"IF('Plant Control IR Template'!$V$2=B590,C590,\"\")","v":""},"2371377","Eheuiki-Puaulu complex, 2 to 20 percent slopes","Puaulu",null,40,"densic material",12,6,4,4.9000000000000004,"none",null,null,"none"]
["HI801","Hawaii",734,{"$f":"IF('Plant Control IR Template'!$V$2=B591,C591,\"\")","v":""},"2384139","Kanohina-Lava flows complex, 2 to 10 percent slopes","Kanohina",null,60,"bedrock, lithic",7,13,4,1.6,"none",null,null,"none"]
["HI801","Hawaii",734,{"$f":"IF('Plant Control IR Template'!$V$2=B592,C592,\"\")","v":""},"2384139","Kanohina-Lava flows complex, 2 to 10 percent slopes","Lava flows","pahoehoe",30,"bedrock, lithic",0,0,3,0,"none",null,null,"none"]
["HI801","Hawaii",735,{"$f":"IF('Plant Control IR Template'!$V$2=B593,C593,\"\")","v":""},"2371880","Puhimau ashy silt loam, 2 to 10 percent slopes","Puhimau",null,90,"bedrock, lithic",13,17,3,3.1,"none",null,null,"none"]
["HI801","Hawaii",736,{"$f":"IF('Plant Control IR Template'!$V$2=B594,C594,\"\")","v":""},"2371881","Manu medial silt loam, 2 to 10 percent slopes","Manu",null,92,"bedrock, lithic",34,23,4,3.8,"none",null,null,"none"]
["HI801","Hawaii",743,{"$f":"IF('Plant Control IR Template'!$V$2=B595,C595,\"\")","v":""},"2375673","Pakini medial very fine sandy loam, 2 to 10 percent slopes","Pakini",null,90,null,80,2,4,2,"none",null,null,"none"]
["HI801","Hawaii",744,{"$f":"IF('Plant Control IR Template'!$V$2=B596,C596,\"\")","v":""},"2371378","Haa-Keamoku complex, 2 to 10 percent slopes","Haa",null,45,"bedrock, lithic",43,5,4,5.5,"none",null,null,"none"]
["HI801","Hawaii",744,{"$f":"IF('Plant Control IR Template'!$V$2=B597,C597,\"\")","v":""},"2371378","Haa-Keamoku complex, 2 to 10 percent slopes","Keamoku",null,40,null,80,0,4,4.9000000000000004,"none",null,null,"none"]
["HI801","Hawaii",745,{"$f":"IF('Plant Control IR Template'!$V$2=B598,C598,\"\")","v":""},"2371379","Maunaiu-Akelelu complex, 3 to 10 percent slopes","Maunaiu",null,60,"bedrock, lithic",19,0,4,5.7,"none",null,null,"none"]
["HI801","Hawaii",745,{"$f":"IF('Plant Control IR Template'!$V$2=B599,C599,\"\")","v":""},"2371379","Maunaiu-Akelelu complex, 3 to 10 percent slopes","Akelelu",null,25,"bedrock, lithic",34,0,4,5.6,"none",null,null,"none"]
["HI801","Hawaii",746,{"$f":"IF('Plant Control IR Template'!$V$2=B600,C600,\"\")","v":""},"2371380","Kulalio-Maunaiu-Akelelu complex, 3 to 10 percent slopes","Kulalio",null,40,null,80,26,4,3.1,"none",null,null,"none"]
["HI801","Hawaii",746,{"$f":"IF('Plant Control IR Template'!$V$2=B601,C601,\"\")","v":""},"2371380","Kulalio-Maunaiu-Akelelu complex, 3 to 10 percent slopes","Maunaiu",null,30,"bedrock, lithic",19,0,4,5.7,"none",null,null,"none"]
["HI801","Hawaii",746,{"$f":"IF('Plant Control IR Template'!$V$2=B602,C602,\"\")","v":""},"2371380","Kulalio-Maunaiu-Akelelu complex, 3 to 10 percent slopes","Akelelu",null,20,"bedrock, lithic",34,0,4,5.6,"none",null,null,"none"]
["HI801","Hawaii",747,{"$f":"IF('Plant Control IR Template'!$V$2=B603,C603,\"\")","v":""},"2371381","Oneula extremely stony loam, 2 to 10 percent slopes","Oneula",null,90,null,80,86,4,0.8,"none",null,null,"none"]
["HI801","Hawaii",748,{"$f":"IF('Plant Control IR Template'!$V$2=B604,C604,\"\")","v":""},"2371382","Lava flows-Menehune complex, 2 to 20 percent slopes","Lava flows","pahoehoe",65,"bedrock, lithic",0,0,12,0,"none",null,null,"none"]
["HI801","Hawaii",748,{"$f":"IF('Plant Control IR Template'!$V$2=B605,C605,\"\")","v":""},"2371382","Lava flows-Menehune complex, 2 to 20 percent slopes","Menehune",null,25,"bedrock, lithic",14,0,4,2.7,"none",null,null,"none"]
["HI801","Hawaii",749,{"$f":"IF('Plant Control IR Template'!$V$2=B606,C606,\"\")","v":""},"2371882","Wahi extremely cobbly medial loam, 2 to 20 percent slopes","Wahi",null,76,null,80,80,4,1.4,"none",null,null,"none"]
["HI801","Hawaii",750,{"$f":"IF('Plant Control IR Template'!$V$2=B607,C607,\"\")","v":""},"2371383","Ki medial loam, 3 to 10 percent slopes","Ki",null,85,null,80,15,4,3.2,"none",null,null,"none"]
["HI801","Hawaii",752,{"$f":"IF('Plant Control IR Template'!$V$2=B608,C608,\"\")","v":""},"2371884","Oneula-Keamoku-Maunaiu complex, 2 to 10 percent slopes","Oneula","low elevation",40,null,80,86,4,0.8,"none",null,null,"none"]
["HI801","Hawaii",752,{"$f":"IF('Plant Control IR Template'!$V$2=B609,C609,\"\")","v":""},"2371884","Oneula-Keamoku-Maunaiu complex, 2 to 10 percent slopes","Keamoku",null,30,null,80,0,4,4.9000000000000004,"none",null,null,"none"]
["HI801","Hawaii",752,{"$f":"IF('Plant Control IR Template'!$V$2=B610,C610,\"\")","v":""},"2371884","Oneula-Keamoku-Maunaiu complex, 2 to 10 percent slopes","Maunaiu",null,20,"bedrock, lithic",19,0,4,5.7,"none",null,null,"none"]
["HI801","Hawaii",755,{"$f":"IF('Plant Control IR Template'!$V$2=B611,C611,\"\")","v":""},"2371885","Makaopuhi very paragravelly highly decomposed plant material, 2 to 10 percent slopes","Makaopuhi",null,88,"bedrock, lithic",6,20,3,1.1000000000000001,"none",null,null,"none"]
["HI801","Hawaii",801,{"$f":"IF('Plant Control IR Template'!$V$2=B612,C612,\"\")","v":""},"2371839","Puu Pa-Waikaloa complex, 2 to 10 percent slopes","Puu Pa",null,70,"bedrock, lithic",50,46,7,1.6,"none",null,null,"none"]
["HI801","Hawaii",801,{"$f":"IF('Plant Control IR Template'!$V$2=B613,C613,\"\")","v":""},"2371839","Puu Pa-Waikaloa complex, 2 to 10 percent slopes","Waikaloa",null,20,"bedrock, lithic",65,4,4,5.0999999999999996,"none",null,null,"none"]
["HI801","Hawaii",802,{"$f":"IF('Plant Control IR Template'!$V$2=B614,C614,\"\")","v":""},"2371840","Puu Pa complex, 2 to 20 percent slopes","Puu Pa","extremely stony",65,"bedrock, lithic",50,80,12,1.6,"none",null,null,"none"]
["HI801","Hawaii",802,{"$f":"IF('Plant Control IR Template'!$V$2=B615,C615,\"\")","v":""},"2371840","Puu Pa complex, 2 to 20 percent slopes","Puu Pa",null,25,"bedrock, lithic",50,50,12,1.6,"none",null,null,"none"]
["HI801","Hawaii",804,{"$f":"IF('Plant Control IR Template'!$V$2=B616,C616,\"\")","v":""},"2371841","Waimea-Kemole complex, 2 to 20 percent slopes","Waimea","medial very fine sandy loam",55,"bedrock, lithic",59,4,12,5.0999999999999996,"none",null,null,"none"]
["HI801","Hawaii",804,{"$f":"IF('Plant Control IR Template'!$V$2=B617,C617,\"\")","v":""},"2371841","Waimea-Kemole complex, 2 to 20 percent slopes","Kemole",null,45,null,80,67,12,2.2000000000000002,"none",null,null,"none"]
["HI801","Hawaii",805,{"$f":"IF('Plant Control IR Template'!$V$2=B618,C618,\"\")","v":""},"2495911","Kemole extremely stony medial very fine sandy loam, dry, 2 to 12 percent slopes","Kemole","dry",95,null,80,67,8,2.2000000000000002,"none",null,null,"none"]
["HI801","Hawaii",806,{"$f":"IF('Plant Control IR Template'!$V$2=B619,C619,\"\")","v":""},"2371842","Kilohana medial very fine sandy loam, 10 to 20 percent slopes","Kilohana",null,95,"cemented horizon",11,3,13,4.2,"none",null,null,"none"]
["HI801","Hawaii",807,{"$f":"IF('Plant Control IR Template'!$V$2=B620,C620,\"\")","v":""},"2371843","Kilohana medial loamy sand, 20 to 40 percent slopes","Kilohana","medial loamy sand",100,"cemented horizon",5,0,30,3.9,"none",null,null,"none"]
["HI801","Hawaii",808,{"$f":"IF('Plant Control IR Template'!$V$2=B621,C621,\"\")","v":""},"2371844","Kemole-Waimea complex, 12 to 20 percent slopes","Kemole",null,55,null,80,67,15,2.2000000000000002,"none",null,null,"none"]
["HI801","Hawaii",808,{"$f":"IF('Plant Control IR Template'!$V$2=B622,C622,\"\")","v":""},"2371844","Kemole-Waimea complex, 12 to 20 percent slopes","Waimea","medial very fine sandy loam",45,"bedrock, lithic",59,4,15,5.0999999999999996,"none",null,null,"none"]
["HI801","Hawaii",809,{"$f":"IF('Plant Control IR Template'!$V$2=B623,C623,\"\")","v":""},"2371845","Waimea medial very fine sandy loam, dry, 0 to 6 percent slopes","Waimea","dry",90,"bedrock, lithic",59,4,4,5.0999999999999996,"none",null,null,"none"]
["HI801","Hawaii",811,{"$f":"IF('Plant Control IR Template'!$V$2=B624,C624,\"\")","v":""},"2371847","Waimea medial very fine sandy loam, dry, 6 to 12 percent slopes","Waimea","dry",85,"bedrock, lithic",59,4,9,5.0999999999999996,"none",null,null,"none"]
["HI801","Hawaii",812,{"$f":"IF('Plant Control IR Template'!$V$2=B625,C625,\"\")","v":""},"2371848","Kemole extremely stony medial very fine sandy loam, dry, 12 to 20 percent slopes","Kemole","dry",95,null,80,67,14,2.2000000000000002,"none",null,null,"none"]
["HI801","Hawaii",813,{"$f":"IF('Plant Control IR Template'!$V$2=B626,C626,\"\")","v":""},"2371849","Kilohana medial very fine sandy loam, dry, 10 to 20 percent slopes","Kilohana","dry",85,"cemented horizon",19,3,13,4.2,"none",null,null,"none"]
["HI801","Hawaii",814,{"$f":"IF('Plant Control IR Template'!$V$2=B627,C627,\"\")","v":""},"2371850","Lapa extremely cobbly medial fine sandy loam, 20 to 40 percent slopes","Lapa",null,80,"bedrock, lithic",11,46,30,1.7,"none",null,null,"none"]
["HI801","Hawaii",815,{"$f":"IF('Plant Control IR Template'!$V$2=B628,C628,\"\")","v":""},"2495912","Pohakulehu cobbly ashy loamy fine sand, 20 to 40 percent slopes","Pohakulehu","cobbly ashy loamy fine sand",85,null,80,32,30,2.2000000000000002,"none",null,null,"none"]
["HI801","Hawaii",816,{"$f":"IF('Plant Control IR Template'!$V$2=B629,C629,\"\")","v":""},"2495914","Kemole-Waimea complex, dry, 2 to 12 percent slopes","Kemole","dry",75,null,80,67,7,2.2000000000000002,"none",null,null,"none"]
["HI801","Hawaii",816,{"$f":"IF('Plant Control IR Template'!$V$2=B630,C630,\"\")","v":""},"2495914","Kemole-Waimea complex, dry, 2 to 12 percent slopes","Waimea","dry",25,"bedrock, lithic",59,4,7,5.0999999999999996,"none",null,null,"none"]
["HI801","Hawaii",817,{"$f":"IF('Plant Control IR Template'!$V$2=B631,C631,\"\")","v":""},"2495915","Kemole extremely stony medial very fine sandy loam, dry, 35 to 70 percent slopes","Kemole","dry",95,null,80,67,55,2.2000000000000002,"none",null,null,"none"]
["HI801","Hawaii",818,{"$f":"IF('Plant Control IR Template'!$V$2=B632,C632,\"\")","v":""},"2371851","Pohakulehu-Lanapohaku complex, dry, 12 to 20 percent slopes","Pohakulehu","dry",60,null,80,40,15,2.2000000000000002,"none",null,null,"none"]
["HI801","Hawaii",818,{"$f":"IF('Plant Control IR Template'!$V$2=B633,C633,\"\")","v":""},"2371851","Pohakulehu-Lanapohaku complex, dry, 12 to 20 percent slopes","Lanapohaku","dry",40,null,80,10,13,2.4,"none",null,null,"none"]
["HI801","Hawaii",820,{"$f":"IF('Plant Control IR Template'!$V$2=B634,C634,\"\")","v":""},"2371853","Pohakulehu very stony highly organic medial sandy loam, dry, 20 to 40 percent slopes","Pohakulehu","dry",90,null,80,40,25,2.2000000000000002,"none",null,null,"none"]
["HI801","Hawaii",821,{"$f":"IF('Plant Control IR Template'!$V$2=B635,C635,\"\")","v":""},"2371854","Kemole-Kilohana complex, 12 to 20 percent slopes","Kemole",null,65,null,80,67,19,2.2000000000000002,"none",null,null,"none"]
["HI801","Hawaii",821,{"$f":"IF('Plant Control IR Template'!$V$2=B636,C636,\"\")","v":""},"2371854","Kemole-Kilohana complex, 12 to 20 percent slopes","Kilohana",null,35,"cemented horizon",19,3,13,4.2,"none",null,null,"none"]
["HI801","Hawaii",822,{"$f":"IF('Plant Control IR Template'!$V$2=B637,C637,\"\")","v":""},"2371855","Pohakulehu very cobbly medial very fine sandy loam, 12 to 20 percent slopes","Pohakulehu","very cobbly medial very fine sandy loam",95,null,80,40,15,2.2000000000000002,"none",null,null,"none"]
["HI801","Hawaii",823,{"$f":"IF('Plant Control IR Template'!$V$2=B638,C638,\"\")","v":""},"2371856","Pohakulehu-Lapa complex, 20 to 40 percent slopes","Pohakulehu",null,60,null,80,40,30,2.2000000000000002,"none",null,null,"none"]
["HI801","Hawaii",823,{"$f":"IF('Plant Control IR Template'!$V$2=B639,C639,\"\")","v":""},"2371856","Pohakulehu-Lapa complex, 20 to 40 percent slopes","Lapa",null,35,"bedrock, lithic",11,46,30,1.7,"none",null,null,"none"]
["HI801","Hawaii",825,{"$f":"IF('Plant Control IR Template'!$V$2=B640,C640,\"\")","v":""},"2375448","Puako, dry substratum, 3 to 6 percent slopes","Puako","dry substratum",100,null,80,0,3,4.8,"occasional","very brief","January, February, March, April, May, June, July, August, September, October, November, December","none"]
["HI801","Hawaii",826,{"$f":"IF('Plant Control IR Template'!$V$2=B641,C641,\"\")","v":""},"2371858","Pohakulehu cobbly ashy loamy fine sand, 6 to 12 percent slopes","Pohakulehu","cobbly ashy loamy fine sand",85,null,80,32,10,2.2000000000000002,"none",null,null,"none"]
["HI801","Hawaii",827,{"$f":"IF('Plant Control IR Template'!$V$2=B642,C642,\"\")","v":""},"2371859","Pohakulehu cobbly ashy loamy fine sand, 12 to 20 percent slopes","Pohakulehu","cobbly ashy loamy fine sand",85,null,80,32,17,2.2000000000000002,"none",null,null,"none"]
["HI801","Hawaii",828,{"$f":"IF('Plant Control IR Template'!$V$2=B643,C643,\"\")","v":""},"2371860","Kemole-Waimea extremely cobbly substratum complex, 12 to 20 percent slopes","Kemole",null,50,null,80,67,19,2.2000000000000002,"none",null,null,"none"]
["HI801","Hawaii",828,{"$f":"IF('Plant Control IR Template'!$V$2=B644,C644,\"\")","v":""},"2371860","Kemole-Waimea extremely cobbly substratum complex, 12 to 20 percent slopes","Waimea","extremely cobbly substratum",50,"bedrock, lithic",59,4,12,5.0999999999999996,"none",null,null,"none"]
["HI801","Hawaii",829,{"$f":"IF('Plant Control IR Template'!$V$2=B645,C645,\"\")","v":""},"2371861","Lanapohaku-Lava flows complex, 6 to 40 percent slopes","Lanapohaku","cobbly ashy loamy fine sand",65,null,80,20,8,1.4,"none",null,null,"none"]
["HI801","Hawaii",829,{"$f":"IF('Plant Control IR Template'!$V$2=B646,C646,\"\")","v":""},"2371861","Lanapohaku-Lava flows complex, 6 to 40 percent slopes","Lava flows","`a`a",30,"bedrock, lithic",39,95,30,0.2,"none",null,null,"none"]
["HI801","Hawaii",830,{"$f":"IF('Plant Control IR Template'!$V$2=B647,C647,\"\")","v":""},"2371862","Huikau ashy sandy loam, 30 to 50 percent slopes","Huikau",null,90,"abrupt textural change",45,14,40,1.4,"none",null,null,"none"]
["HI801","Hawaii",831,{"$f":"IF('Plant Control IR Template'!$V$2=B648,C648,\"\")","v":""},"2371863","Lava flows-Lapa-Pohakulehu complex, 30 to 50 percent slopes","Lava flows","`a`a",35,"bedrock, lithic",39,95,45,0.2,"none",null,null,"none"]
["HI801","Hawaii",831,{"$f":"IF('Plant Control IR Template'!$V$2=B649,C649,\"\")","v":""},"2371863","Lava flows-Lapa-Pohakulehu complex, 30 to 50 percent slopes","Lapa",null,30,"bedrock, lithic",11,46,35,1.7,"none",null,null,"none"]
["HI801","Hawaii",831,{"$f":"IF('Plant Control IR Template'!$V$2=B650,C650,\"\")","v":""},"2371863","Lava flows-Lapa-Pohakulehu complex, 30 to 50 percent slopes","Pohakulehu",null,30,null,80,40,35,2.2000000000000002,"none",null,null,"none"]
["HI801","Hawaii",832,{"$f":"IF('Plant Control IR Template'!$V$2=B651,C651,\"\")","v":""},"2494441","Keekee ashy loamy sand, 0 to 6 percent slopes","Keekee",null,90,"densic material",16,28,3,1.4,"rare, occasional","very brief","January, February, March, November, December","none"]
["HI801","Hawaii",834,{"$f":"IF('Plant Control IR Template'!$V$2=B652,C652,\"\")","v":""},"2371865","Lanapohaku-Huikau-Dune land complex, 30 to 50 percent slopes","Lanapohaku",null,40,null,80,10,30,2.4,"none",null,null,"none"]
["HI801","Hawaii",834,{"$f":"IF('Plant Control IR Template'!$V$2=B653,C653,\"\")","v":""},"2371865","Lanapohaku-Huikau-Dune land complex, 30 to 50 percent slopes","Huikau",null,35,"abrupt textural change",45,14,40,1.4,"none",null,null,"none"]
["HI801","Hawaii",834,{"$f":"IF('Plant Control IR Template'!$V$2=B654,C654,\"\")","v":""},"2371865","Lanapohaku-Huikau-Dune land complex, 30 to 50 percent slopes","Dune land",null,20,null,80,0,40,null,"none",null,null,"none"]
["HI801","Hawaii",835,{"$f":"IF('Plant Control IR Template'!$V$2=B655,C655,\"\")","v":""},"2371866","Pohakulehu-Lava flows complex, 20 to 40 percent slopes","Pohakulehu","dry",60,null,80,40,25,2.2000000000000002,"none",null,null,"none"]
["HI801","Hawaii",835,{"$f":"IF('Plant Control IR Template'!$V$2=B656,C656,\"\")","v":""},"2371866","Pohakulehu-Lava flows complex, 20 to 40 percent slopes","Lava flows","`a`a",35,"bedrock, lithic",39,95,30,0.2,"none",null,null,"none"]
["HI801","Hawaii",836,{"$f":"IF('Plant Control IR Template'!$V$2=B657,C657,\"\")","v":""},"2371867","Pohakulehu very stony highly organic medial sandy loam, cool, 20 to 40 percent slopes","Pohakulehu","cool",85,null,80,40,25,2.2000000000000002,"none",null,null,"none"]
["HI801","Hawaii",837,{"$f":"IF('Plant Control IR Template'!$V$2=B658,C658,\"\")","v":""},"2371868","Lava flows-Lapa-Pohakulehu complex, cool, 30 to 50 percent slopes","Lava flows","`a`a",35,"bedrock, lithic",39,95,45,0.2,"none",null,null,"none"]
["HI801","Hawaii",837,{"$f":"IF('Plant Control IR Template'!$V$2=B659,C659,\"\")","v":""},"2371868","Lava flows-Lapa-Pohakulehu complex, cool, 30 to 50 percent slopes","Pohakulehu","cool",30,null,80,40,35,2.2000000000000002,"none",null,null,"none"]
["HI801","Hawaii",837,{"$f":"IF('Plant Control IR Template'!$V$2=B660,C660,\"\")","v":""},"2371868","Lava flows-Lapa-Pohakulehu complex, cool, 30 to 50 percent slopes","Lapa","cool",30,"bedrock, lithic",11,46,35,1.7,"none",null,null,"none"]
["HI801","Hawaii",839,{"$f":"IF('Plant Control IR Template'!$V$2=B661,C661,\"\")","v":""},"2371870","Huikau very gravelly ashy sandy loam, 30 to 50 percent slopes","Huikau","very gravelly",90,"abrupt textural change",45,43,40,1.4,"none",null,null,"none"]
["HI801","Hawaii",840,{"$f":"IF('Plant Control IR Template'!$V$2=B662,C662,\"\")","v":""},"2371871","Pohakulehu-Lanapohaku complex, 12 to 20 percent slopes","Pohakulehu",null,60,null,80,40,16,2.2000000000000002,"none",null,null,"none"]
["HI801","Hawaii",840,{"$f":"IF('Plant Control IR Template'!$V$2=B663,C663,\"\")","v":""},"2371871","Pohakulehu-Lanapohaku complex, 12 to 20 percent slopes","Lanapohaku",null,40,null,80,10,13,2.4,"none",null,null,"none"]
["HI801","Hawaii",841,{"$f":"IF('Plant Control IR Template'!$V$2=B664,C664,\"\")","v":""},"2371872","Alaone-Keekee complex, 2 to 6 percent slopes","Alaone",null,60,null,80,80,5,1,"none",null,null,"none"]
["HI801","Hawaii",841,{"$f":"IF('Plant Control IR Template'!$V$2=B665,C665,\"\")","v":""},"2371872","Alaone-Keekee complex, 2 to 6 percent slopes","Keekee",null,35,"densic material",16,28,3,1.4,"rare, occasional","very brief","January, February, March, November, December","none"]
["HI801","Hawaii",842,{"$f":"IF('Plant Control IR Template'!$V$2=B666,C666,\"\")","v":""},"2371873","Pohakulehu-Lanapohaku complex, moist, 12 to 20 percent slopes","Pohakulehu","moist",60,null,80,40,16,2.2000000000000002,"none",null,null,"none"]
["HI801","Hawaii",842,{"$f":"IF('Plant Control IR Template'!$V$2=B667,C667,\"\")","v":""},"2371873","Pohakulehu-Lanapohaku complex, moist, 12 to 20 percent slopes","Lanapohaku","moist",40,null,80,10,13,2.4,"none",null,null,"none"]
["HI801","Hawaii",843,{"$f":"IF('Plant Control IR Template'!$V$2=B668,C668,\"\")","v":""},"2421568","Puu Oo highly organic hydrous silty clay loam, 6 to 20 percent slopes","Puu Oo","highly organic hydrous silty clay loam",95,"bedrock, paralithic",59,0,13,5.2,"none",null,null,"none"]
["HI801","Hawaii",844,{"$f":"IF('Plant Control IR Template'!$V$2=B669,C669,\"\")","v":""},"2421569","Keamoku-Laumaia complex, 6 to 20 percent slopes","Keamoku","extremely cobbly",55,null,80,80,16,3,"none",null,null,"none"]
["HI801","Hawaii",844,{"$f":"IF('Plant Control IR Template'!$V$2=B670,C670,\"\")","v":""},"2421569","Keamoku-Laumaia complex, 6 to 20 percent slopes","Laumaia",null,35,"bedrock, paralithic",35,0,10,6.5,"none",null,null,"none"]
["HI801","Hawaii",845,{"$f":"IF('Plant Control IR Template'!$V$2=B671,C671,\"\")","v":""},"2421570","Keamoku extremely cobbly medial loam, 10 to 20 percent slopes","Keamoku","extremely cobbly",90,null,80,80,16,3,"none",null,null,"none"]
["HI801","Hawaii",846,{"$f":"IF('Plant Control IR Template'!$V$2=B672,C672,\"\")","v":""},"2421571","Lanapohaku-Pohakulehu-Lava flows complex, 6 to 20 percent slopes","Lanapohaku",null,45,null,80,10,12,2.4,"none",null,null,"none"]
["HI801","Hawaii",846,{"$f":"IF('Plant Control IR Template'!$V$2=B673,C673,\"\")","v":""},"2421571","Lanapohaku-Pohakulehu-Lava flows complex, 6 to 20 percent slopes","Pohakulehu",null,35,null,80,40,16,2.2000000000000002,"none",null,null,"none"]
["HI801","Hawaii",846,{"$f":"IF('Plant Control IR Template'!$V$2=B674,C674,\"\")","v":""},"2421571","Lanapohaku-Pohakulehu-Lava flows complex, 6 to 20 percent slopes","Lava flows","`a`a",20,"bedrock, lithic",39,95,16,0.2,"none",null,null,"none"]
["HI801","Hawaii",848,{"$f":"IF('Plant Control IR Template'!$V$2=B675,C675,\"\")","v":""},"2421573","Laumaia medial silt loam, 2 to 20 percent slopes","Laumaia",null,90,"bedrock, paralithic",35,0,8,6.5,"none",null,null,"none"]
["HI801","Hawaii",849,{"$f":"IF('Plant Control IR Template'!$V$2=B676,C676,\"\")","v":""},"2421574","Kau very cobbly highly organic medial loam, 6 to 20 percent slopes","Kau","very cobbly highly organic medial loam",100,"bedrock, lithic",40,42,12,4.2,"none",null,null,"none"]
["HI801","Hawaii",850,{"$f":"IF('Plant Control IR Template'!$V$2=B677,C677,\"\")","v":""},"2421575","Kaiwiki highly organic hydrous silty clay loam, 6 to 20 percent slopes","Kaiwiki","highly organic hydrous silty clay loam",90,null,80,2,12,5.9,"none",null,null,"none"]
["HI801","Hawaii",851,{"$f":"IF('Plant Control IR Template'!$V$2=B678,C678,\"\")","v":""},"2421576","Waiakea very cobbly hydrous loam, 10 to 20 percent slopes","Waiakea","very cobbly hydrous loam",95,"bedrock, lithic",39,41,14,4.5999999999999996,"none",null,null,"none"]
["HI801","Hawaii",900,{"$f":"IF('Plant Control IR Template'!$V$2=B679,C679,\"\")","v":""},"2371874","Kaiwiki hydrous silty clay loam, 0 to 10 percent slopes","Kaiwiki","hydrous silty clay loam",90,null,80,2,7,5.9,"none",null,null,"none"]
["HI801","Hawaii",901,{"$f":"IF('Plant Control IR Template'!$V$2=B680,C680,\"\")","v":""},"2424226","Hilo hydrous silty clay loam, 0 to 10 percent slopes","Hilo",null,85,null,80,2,5,5.2,"none",null,null,"none"]
["HI801","Hawaii",902,{"$f":"IF('Plant Control IR Template'!$V$2=B681,C681,\"\")","v":""},"2424227","Hilo hydrous silty clay loam, 20 to 35 percent slopes","Hilo",null,80,null,80,2,30,5.2,"none",null,null,"none"]
["HI801","Hawaii",903,{"$f":"IF('Plant Control IR Template'!$V$2=B682,C682,\"\")","v":""},"2424228","Hilo hydrous silty clay loam, 10 to 20 percent slopes","Hilo",null,80,null,80,2,15,5.2,"none",null,null,"none"]
["HI801","Hawaii",904,{"$f":"IF('Plant Control IR Template'!$V$2=B683,C683,\"\")","v":""},"2431435","Akaka-Onomea complex, 0 to 10 percent slopes","Akaka",null,50,"bedrock, lithic",49,0,3,5.9,"none",null,null,"frequent","very brief,","January, February, March, November, December"]
["HI801","Hawaii",904,{"$f":"IF('Plant Control IR Template'!$V$2=B684,C684,\"\")","v":""},"2431435","Akaka-Onomea complex, 0 to 10 percent slopes","Onomea",null,40,"bedrock, lithic",49,0,2,8.3000000000000007,"none",null,null,"frequent","very long","January, February, March, April, May, June, July, August, September, October, November, December"]
["HI801","Hawaii",905,{"$f":"IF('Plant Control IR Template'!$V$2=B685,C685,\"\")","v":""},"2431209","Akaka-Kaiwiki complex, 0 to 10 percent slopes","Akaka",null,55,"bedrock, lithic",49,0,3,5.9,"none",null,null,"frequent","very brief,","January, February, March, November, December"]
["HI801","Hawaii",905,{"$f":"IF('Plant Control IR Template'!$V$2=B686,C686,\"\")","v":""},"2431209","Akaka-Kaiwiki complex, 0 to 10 percent slopes","Kaiwiki","highly organic hydrous silty clay loam",35,null,80,2,7,5.9,"none",null,null,"none"]
["HI801","Hawaii",906,{"$f":"IF('Plant Control IR Template'!$V$2=B687,C687,\"\")","v":""},"2431211","Kaiwiki hydrous silty clay loam, 10 to 20 percent slopes","Kaiwiki","hydrous silty clay loam",90,null,80,2,12,5.9,"none",null,null,"none"]
["HI801","Hawaii",907,{"$f":"IF('Plant Control IR Template'!$V$2=B688,C688,\"\")","v":""},"2431212","Kaiwiki hydrous silty clay loam, 20 to 35 percent","Kaiwiki","hydrous silty clay loam",90,null,80,2,30,5.9,"none",null,null,"none"]
["HI801","Hawaii",908,{"$f":"IF('Plant Control IR Template'!$V$2=B689,C689,\"\")","v":""},"2431213","Kaiwiki-Rock outcrop complex, 35 to 100 percent slopes","Kaiwiki","hydrous silty clay loam",65,null,80,2,70,5.9,"none",null,null,"none"]
["HI801","Hawaii",908,{"$f":"IF('Plant Control IR Template'!$V$2=B690,C690,\"\")","v":""},"2431213","Kaiwiki-Rock outcrop complex, 35 to 100 percent slopes","Rock outcrop","basalt",25,null,80,0,70,null,"none",null,null,"none"]
["HI801","Hawaii",909,{"$f":"IF('Plant Control IR Template'!$V$2=B691,C691,\"\")","v":""},"2431216","Hilo-Rock outcrop complex, 35 to 100 percent slopes","Hilo",null,65,null,80,2,75,5.2,"none",null,null,"none"]
["HI801","Hawaii",909,{"$f":"IF('Plant Control IR Template'!$V$2=B692,C692,\"\")","v":""},"2431216","Hilo-Rock outcrop complex, 35 to 100 percent slopes","Rock outcrop","basalt",35,null,80,0,100,null,"none",null,null,"none"]
["HI801","Hawaii",910,{"$f":"IF('Plant Control IR Template'!$V$2=B693,C693,\"\")","v":""},"2495916","Laumaia medial silt loam, 20 to 50 percent slopes","Laumaia",null,80,"bedrock, paralithic",35,0,35,6.5,"none",null,null,"none"]
["HI801","Hawaii",911,{"$f":"IF('Plant Control IR Template'!$V$2=B694,C694,\"\")","v":""},"2512246","Puu Oo-Kau-Rock outcrop complex, 6 to 35 percent slopes","Puu Oo","highly organic medial loam",60,"bedrock, paralithic",59,0,20,5.2,"none",null,null,"none"]
["HI801","Hawaii",911,{"$f":"IF('Plant Control IR Template'!$V$2=B695,C695,\"\")","v":""},"2512246","Puu Oo-Kau-Rock outcrop complex, 6 to 35 percent slopes","Kau","very cobbly highly organic medial loam",20,"bedrock, lithic",40,42,20,4.2,"none",null,null,"none"]
["HI801","Hawaii",911,{"$f":"IF('Plant Control IR Template'!$V$2=B696,C696,\"\")","v":""},"2512246","Puu Oo-Kau-Rock outcrop complex, 6 to 35 percent slopes","Rock outcrop","basalt",20,null,80,0,20,null,"none",null,null,"none"]
["HI801","Hawaii",951,{"$f":"IF('Plant Control IR Template'!$V$2=B697,C697,\"\")","v":""},"2452925","Ookala medial silty clay loam, 0 to 10 percent slopes","Ookala",null,95,null,80,0,5,3,"none",null,null,"none"]
["HI801","Hawaii",952,{"$f":"IF('Plant Control IR Template'!$V$2=B698,C698,\"\")","v":""},"2437839","Ookala medial silty clay loam, 10 to 20 percent slopes","Ookala",null,95,null,80,0,15,3,"none",null,null,"none"]
["HI801","Hawaii",953,{"$f":"IF('Plant Control IR Template'!$V$2=B699,C699,\"\")","v":""},"2452926","Ookala medial silty clay loam, 20 to 35 percent slopes","Ookala",null,95,null,80,0,25,3,"none",null,null,"none"]
["HI801","Hawaii",954,{"$f":"IF('Plant Control IR Template'!$V$2=B700,C700,\"\")","v":""},"2452927","Ookala-Rock outcrop complex, 35 to 100 percent slopes","Ookala",null,55,null,80,0,75,3,"none",null,null,"none"]
["HI801","Hawaii",954,{"$f":"IF('Plant Control IR Template'!$V$2=B701,C701,\"\")","v":""},"2452927","Ookala-Rock outcrop complex, 35 to 100 percent slopes","Rock outcrop","basalt",45,null,80,0,75,null,"none",null,null,"none"]
["HI801","Hawaii",955,{"$f":"IF('Plant Control IR Template'!$V$2=B702,C702,\"\")","v":""},"2452583","Honokaa highly organic hydrous silty clay loam, 0 to 10 percent","Honokaa",null,85,null,80,2,5,5.9,"none",null,null,"none"]
["HI801","Hawaii",956,{"$f":"IF('Plant Control IR Template'!$V$2=B703,C703,\"\")","v":""},"2452584","Honokaa highly organic hydrous silty clay loam, 10 to 20 percent slopes","Honokaa",null,85,null,80,2,15,5.9,"none",null,null,"none"]
["HI801","Hawaii",957,{"$f":"IF('Plant Control IR Template'!$V$2=B704,C704,\"\")","v":""},"2452585","Honokaa highly organic hydrous silty clay loam, 20 to 35 percent slopes","Honokaa",null,85,null,80,2,28,5.9,"none",null,null,"none"]
["HI801","Hawaii",958,{"$f":"IF('Plant Control IR Template'!$V$2=B705,C705,\"\")","v":""},"2452929","Honokaa-Rock outcrop complex, 35 to 100 percent slopes","Honokaa",null,55,null,80,2,75,5.9,"none",null,null,"none"]
["HI801","Hawaii",958,{"$f":"IF('Plant Control IR Template'!$V$2=B706,C706,\"\")","v":""},"2452929","Honokaa-Rock outcrop complex, 35 to 100 percent slopes","Rock outcrop","basalt",45,null,80,0,75,null,"none",null,null,"none"]
["HI801","Hawaii",959,{"$f":"IF('Plant Control IR Template'!$V$2=B707,C707,\"\")","v":""},"2452586","Paauhau medial silty clay loam, 10 to 20 percent slopes","Paauhau",null,95,"bedrock, paralithic",41,5,16,4.9000000000000004,"none",null,null,"none"]
["HI801","Hawaii",960,{"$f":"IF('Plant Control IR Template'!$V$2=B708,C708,\"\")","v":""},"2452587","Honokaa hydrous silty clay loam, warm, 0 to 10 percent slopes","Honokaa","warm",90,null,80,4,5,5.9,"none",null,null,"none"]
["HI801","Hawaii",961,{"$f":"IF('Plant Control IR Template'!$V$2=B709,C709,\"\")","v":""},"2452588","Honokaa hydrous silty clay loam, warm, 10 to 20 percent slopes","Honokaa","warm",90,null,80,4,15,5.9,"none",null,null,"none"]
["HI801","Hawaii",962,{"$f":"IF('Plant Control IR Template'!$V$2=B710,C710,\"\")","v":""},"2452589","Honokaa hydrous silty clay loam, warm, 20 to 35 percent slopes","Honokaa","warm",90,null,80,4,28,5.9,"none",null,null,"none"]
["HI801","Hawaii",963,{"$f":"IF('Plant Control IR Template'!$V$2=B711,C711,\"\")","v":""},"2478615","Umikoa medial silt loam, 6 to 20 percent slopes","Umikoa",null,90,null,80,5,15,3,"none",null,null,"none"]
["HI801","Hawaii",964,{"$f":"IF('Plant Control IR Template'!$V$2=B712,C712,\"\")","v":""},"2478616","Umikoa-Kemole-Rock outcrop complex, 6 to 35 percent slopes","Umikoa",null,60,null,80,5,15,3,"none",null,null,"none"]
["HI801","Hawaii",964,{"$f":"IF('Plant Control IR Template'!$V$2=B713,C713,\"\")","v":""},"2478616","Umikoa-Kemole-Rock outcrop complex, 6 to 35 percent slopes","Kemole",null,20,null,80,67,25,2.2000000000000002,"none",null,null,"none"]
["HI801","Hawaii",964,{"$f":"IF('Plant Control IR Template'!$V$2=B714,C714,\"\")","v":""},"2478616","Umikoa-Kemole-Rock outcrop complex, 6 to 35 percent slopes","Rock outcrop","basalt",20,null,80,0,25,null,"none",null,null,"none"]
["HI801","Hawaii",965,{"$f":"IF('Plant Control IR Template'!$V$2=B715,C715,\"\")","v":""},"2478617","Hanipoe medial fine sandy loam, 6 to 20 percent slopes","Hanipoe",null,90,null,80,2,16,2.6,"none",null,null,"none"]
["HI801","Hawaii",966,{"$f":"IF('Plant Control IR Template'!$V$2=B716,C716,\"\")","v":""},"2478618","Hanipoe-Pohakulehu-Rock outcrop complex, 6 to 35 percent slopes","Hanipoe",null,60,null,80,2,16,2.6,"none",null,null,"none"]
["HI801","Hawaii",966,{"$f":"IF('Plant Control IR Template'!$V$2=B717,C717,\"\")","v":""},"2478618","Hanipoe-Pohakulehu-Rock outcrop complex, 6 to 35 percent slopes","Rock outcrop","basalt",20,null,80,0,25,null,"none",null,null,"none"]
["HI801","Hawaii",966,{"$f":"IF('Plant Control IR Template'!$V$2=B718,C718,\"\")","v":""},"2478618","Hanipoe-Pohakulehu-Rock outcrop complex, 6 to 35 percent slopes","Pohakulehu","dry",20,null,80,40,25,2.2000000000000002,"none",null,null,"none"]
["HI801","Hawaii",967,{"$f":"IF('Plant Control IR Template'!$V$2=B719,C719,\"\")","v":""},"2478619","Olaa cobbly hydrous loam, older substrate, 2 to 20 percent slopes","Olaa","older substrate",95,"bedrock, lithic",31,32,15,3.4,"none",null,null,"none"]
["HI801","Hawaii",968,{"$f":"IF('Plant Control IR Template'!$V$2=B720,C720,\"\")","v":""},"2478620","Hanipoe medial fine sandy loam, 0 to 6 percent slopes","Hanipoe",null,90,null,80,2,4,2.6,"none",null,null,"none"]
["HI801","Hawaii",969,{"$f":"IF('Plant Control IR Template'!$V$2=B721,C721,\"\")","v":""},"2478621","Umikoa medial silt loam, 0 to 6 percent slopes","Umikoa",null,90,null,80,5,4,3,"none",null,null,"none"]
["HI801","Hawaii",970,{"$f":"IF('Plant Control IR Template'!$V$2=B722,C722,\"\")","v":""},"2478622","Maile-Waiakea-Rock outcrop complex, 6 to 35 percent slopes","Maile",null,60,null,80,6,16,3,"none",null,null,"none"]
["HI801","Hawaii",970,{"$f":"IF('Plant Control IR Template'!$V$2=B723,C723,\"\")","v":""},"2478622","Maile-Waiakea-Rock outcrop complex, 6 to 35 percent slopes","Rock outcrop","basalt",20,null,80,0,25,null,"none",null,null,"none"]
["HI801","Hawaii",970,{"$f":"IF('Plant Control IR Template'!$V$2=B724,C724,\"\")","v":""},"2478622","Maile-Waiakea-Rock outcrop complex, 6 to 35 percent slopes","Waiakea",null,20,"bedrock, lithic",39,13,25,4.5999999999999996,"none",null,null,"none"]
["HI801","Hawaii",971,{"$f":"IF('Plant Control IR Template'!$V$2=B725,C725,\"\")","v":""},"2512231","Waiakea-Onomea complex, 0 to 20 percent slopes","Waiakea",null,68,"bedrock, lithic",39,13,15,4.5999999999999996,"none",null,null,"none"]
["HI801","Hawaii",971,{"$f":"IF('Plant Control IR Template'!$V$2=B726,C726,\"\")","v":""},"2512231","Waiakea-Onomea complex, 0 to 20 percent slopes","Onomea",null,30,"bedrock, lithic",49,0,2,8.6999999999999993,"none",null,null,"frequent","very long","January, February, March, April, May, June, July, August, September, October, November, December"]
["HI801","Hawaii","W",{"$f":"IF('Plant Control IR Template'!$V$2=B727,C727,\"\")","v":""},"2371582","Water","Water",null,100,null,80,0,null,null,"none",null,null,"frequent","very long","January, February, March, April, May, June, July, August, September, October, November, December"]
["HI950","Molokai","AeE",{"$f":"IF('Plant Control IR Template'!$V$2=B728,C728,\"\")","v":""},"468142","Alaeloa silty clay, 15 to 35 percent slopes","Alaeloa",null,100,null,80,6,25,2.6,"none",null,null,"none"]
["HI950","Molokai","ALE3",{"$f":"IF('Plant Control IR Template'!$V$2=B729,C729,\"\")","v":""},"468139","Alaeloa silty clay, 15 to 35 percent slopes, severely eroded","Alaeloa",null,100,null,80,6,25,2.6,"none",null,null,"none"]
["HI950","Molokai","AME3",{"$f":"IF('Plant Control IR Template'!$V$2=B730,C730,\"\")","v":""},"468140","Alaeloa stony silty clay, 15 to 35 percent slopes, severely eroded","Alaeloa","stony",100,null,80,6,25,2.6,"none",null,null,"none"]
["HI950","Molokai","ANE",{"$f":"IF('Plant Control IR Template'!$V$2=B731,C731,\"\")","v":""},"468141","Alaeloa stony silty clay, overwash, 15 to 35 percent slopes","Alaeloa","stony",100,null,80,19,25,2.4,"none",null,null,"none"]
["HI950","Molokai","BS",{"$f":"IF('Plant Control IR Template'!$V$2=B732,C732,\"\")","v":""},"468143","Beaches","Beaches",null,100,null,80,12,3,0.8,"frequent","very brief","January, February, March, April, May, June, July, August, September, October, November, December","none"]
["HI950","Molokai","CO",{"$f":"IF('Plant Control IR Template'!$V$2=B733,C733,\"\")","v":""},"468144","Colluvial land","Colluvial land",null,100,null,80,37,43,2.4,"none",null,null,"none"]
["HI950","Molokai","GL",{"$f":"IF('Plant Control IR Template'!$V$2=B734,C734,\"\")","v":""},"468145","Gullied land","Gullied land",null,100,null,80,0,48,0,"none",null,null,"none"]
["HI950","Molokai","HcB",{"$f":"IF('Plant Control IR Template'!$V$2=B735,C735,\"\")","v":""},"468148","Haleiwa silty clay loam, 0 to 10 percent slopes","Haleiwa",null,100,null,80,8,5,2.8,"occasional, rare","very brief","January, February, March, April, November, December","none"]
["HI950","Molokai","HdC",{"$f":"IF('Plant Control IR Template'!$V$2=B736,C736,\"\")","v":""},"468149","Haleiwa very stony silty clay loam, 0 to 15 percent slopes","Haleiwa","very stony",100,null,80,35,8,2.4,"occasional, none","very brief,","January, February, March, April, October, November, December","none"]
["HI950","Molokai","HID",{"$f":"IF('Plant Control IR Template'!$V$2=B737,C737,\"\")","v":""},"468146","Halawa silty clay, 3 to 25 percent slopes","Halawa",null,100,"bedrock, paralithic",58,0,14,2.6,"none",null,null,"none"]
["HI950","Molokai","HID3",{"$f":"IF('Plant Control IR Template'!$V$2=B738,C738,\"\")","v":""},"468147","Halawa silty clay, 3 to 25 percent slopes, severely eroded","Halawa",null,100,"bedrock, paralithic",50,0,14,2.6,"none",null,null,"none"]
["HI950","Molokai","HvA",{"$f":"IF('Plant Control IR Template'!$V$2=B739,C739,\"\")","v":""},"468150","Holomua silt loam, 0 to 3 percent slopes","Holomua",null,100,null,80,0,1,2.6,"none",null,null,"none"]
["HI950","Molokai","HvB",{"$f":"IF('Plant Control IR Template'!$V$2=B740,C740,\"\")","v":""},"468151","Holomua silt loam, 3 to 7 percent slopes","Holomua",null,100,null,80,0,5,2.6,"none",null,null,"none"]
["HI950","Molokai","HvB3",{"$f":"IF('Plant Control IR Template'!$V$2=B741,C741,\"\")","v":""},"468152","Holomua silt loam, 3 to 7 percent slopes, severely eroded","Holomua",null,100,null,80,0,5,2.6,"none",null,null,"none"]
["HI950","Molokai","HvC",{"$f":"IF('Plant Control IR Template'!$V$2=B742,C742,\"\")","v":""},"468153","Holomua silt loam, 7 to 15 percent slopes","Holomua",null,100,null,80,0,11,2.6,"none",null,null,"none"]
["HI950","Molokai","HvC3",{"$f":"IF('Plant Control IR Template'!$V$2=B743,C743,\"\")","v":""},"468154","Holomua silt loam, 7 to 15 percent slopes, severely eroded","Holomua",null,100,null,80,0,11,2.6,"none",null,null,"none"]
["HI950","Molokai","HyB3",{"$f":"IF('Plant Control IR Template'!$V$2=B744,C744,\"\")","v":""},"468155","Hoolehua silty clay loam, 3 to 10 percent slopes, severely eroded","Hoolehua",null,100,null,80,6,7,1,"none",null,null,"none"]
["HI950","Molokai","HzA",{"$f":"IF('Plant Control IR Template'!$V$2=B745,C745,\"\")","v":""},"468156","Hoolehua silty clay, 0 to 3 percent slopes","Hoolehua",null,100,null,80,6,2,1.2,"none",null,null,"none"]
["HI950","Molokai","HzB",{"$f":"IF('Plant Control IR Template'!$V$2=B746,C746,\"\")","v":""},"468157","Hoolehua silty clay, 3 to 7 percent slopes","Hoolehua",null,100,null,80,6,5,1.2,"none",null,null,"none"]
["HI950","Molokai","HzC",{"$f":"IF('Plant Control IR Template'!$V$2=B747,C747,\"\")","v":""},"468158","Hoolehua silty clay, 7 to 15 percent slopes","Hoolehua",null,100,null,80,6,11,1.2,"none",null,null,"none"]
["HI950","Molokai","HzE",{"$f":"IF('Plant Control IR Template'!$V$2=B748,C748,\"\")","v":""},"468159","Hoolehua silty clay, 15 to 35 percent slopes","Hoolehua",null,100,"bedrock, paralithic",36,6,25,1.2,"none",null,null,"none"]
["HI950","Molokai","JaC",{"$f":"IF('Plant Control IR Template'!$V$2=B749,C749,\"\")","v":""},"468161","Jaucas sand, 0 to 15 percent slopes","Jaucas",null,100,null,80,0,8,1.1000000000000001,"rare","very brief",null,"none"]
["HI950","Molokai","JL",{"$f":"IF('Plant Control IR Template'!$V$2=B750,C750,\"\")","v":""},"468160","Jaucas-Blownout land complex","Jaucas",null,50,null,80,0,8,1.3,"none",null,null,"none"]
["HI950","Molokai","JL",{"$f":"IF('Plant Control IR Template'!$V$2=B751,C751,\"\")","v":""},"468160","Jaucas-Blownout land complex","Blown-out land",null,50,"bedrock, paralithic",20,0,8,2.4,"none",null,null,"none"]
["HI950","Molokai","KATD",{"$f":"IF('Plant Control IR Template'!$V$2=B752,C752,\"\")","v":""},"468162","Kahanui gravelly silty clay, 3 to 20 percent slopes","Kahanui","gravelly",100,"placic",21,22,12,2.2000000000000002,"none",null,null,"none"]
["HI950","Molokai","KcB",{"$f":"IF('Plant Control IR Template'!$V$2=B753,C753,\"\")","v":""},"468167","Kalae silty clay, 2 to 7 percent slopes","Kalae",null,100,null,80,2,5,2,"none",null,null,"none"]
["HI950","Molokai","KcC",{"$f":"IF('Plant Control IR Template'!$V$2=B754,C754,\"\")","v":""},"468168","Kalae silty clay, 7 to 15 percent slopes","Kalae",null,100,null,80,2,11,2,"none",null,null,"none"]
["HI950","Molokai","KcC3",{"$f":"IF('Plant Control IR Template'!$V$2=B755,C755,\"\")","v":""},"468169","Kalae silty clay, 5-15 percent slopes, severely eroded","Kalae",null,100,null,80,2,10,1.1000000000000001,"none",null,null,"none"]
["HI950","Molokai","KcD3",{"$f":"IF('Plant Control IR Template'!$V$2=B756,C756,\"\")","v":""},"468170","Kalae silty clay, 15 to 25 percent slopes, severely eroded","Kalae",null,100,null,80,2,20,1.1000000000000001,"none",null,null,"none"]
["HI950","Molokai","KcE3",{"$f":"IF('Plant Control IR Template'!$V$2=B757,C757,\"\")","v":""},"468171","Kalae silty clay, 25 to 40 percent slopes, severely eroded","Kalae",null,100,null,80,2,33,1.1000000000000001,"none",null,null,"none"]
["HI950","Molokai","KFID",{"$f":"IF('Plant Control IR Template'!$V$2=B758,C758,\"\")","v":""},"468163","Kalaupapa very rocky silty clay loam, 3 to 25 percent slopes","Kalaupapa","very rocky",85,"bedrock, lithic",14,11,14,2.8,"none",null,null,"none"]
["HI950","Molokai","KKTC",{"$f":"IF('Plant Control IR Template'!$V$2=B759,C759,\"\")","v":""},"468164","Kapuhikani extremely stony clay, 3 to 15 percent slopes","Kapuhikani","extremely stony",100,"bedrock, lithic",27,34,9,2.2999999999999998,"none",null,null,"none"]
["HI950","Molokai","KlA",{"$f":"IF('Plant Control IR Template'!$V$2=B760,C760,\"\")","v":""},"468172","Kawaihapai clay loam, 0 to 2 percent slopes","Kawaihapai",null,85,null,80,10,1,2.8,"rare, occasional","very brief","January, February, March, April, November, December","none"]
["HI950","Molokai","KlaB",{"$f":"IF('Plant Control IR Template'!$V$2=B761,C761,\"\")","v":""},"468173","Kawaihapai stony clay loam, 2 to 6 percent slopes","Kawaihapai","stony",100,null,80,22,4,2.4,"occasional, rare","very brief","January, February, March, April, November, December","none"]
["HI950","Molokai","KlbC",{"$f":"IF('Plant Control IR Template'!$V$2=B762,C762,\"\")","v":""},"468174","Kawaihapai very stony clay loam, 0 to 15 percent slopes","Kawaihapai","very stony",100,null,80,40,8,2,"occasional, rare","very brief","January, February, March, April, November, December","none"]
["HI950","Molokai","KlcB",{"$f":"IF('Plant Control IR Template'!$V$2=B763,C763,\"\")","v":""},"468175","Kawaihapai silty clay loam, 2 to 7 percent slopes","Kawaihapai",null,100,null,80,10,5,2.8,"occasional, rare","very brief","January, February, March, April, November, December","none"]
["HI950","Molokai","KMW",{"$f":"IF('Plant Control IR Template'!$V$2=B764,C764,\"\")","v":""},"468165","Kealia silt loam","Kealia",null,45,null,80,0,1,2,"frequent, rare","brief","January, February, March, April, November, December","occasional, rare","long","January, February, March, April, May, October, November, December"]
["HI950","Molokai","KMW",{"$f":"IF('Plant Control IR Template'!$V$2=B765,C765,\"\")","v":""},"468165","Kealia silt loam","Kealia, deep water table",null,35,null,80,0,1,2,"occasional, rare","very brief","January, February, March, April, November, December","occasional, rare","long","January, February, March, April, May, October, November, December"]
["HI950","Molokai","KRL",{"$f":"IF('Plant Control IR Template'!$V$2=B766,C766,\"\")","v":""},"468166","Koele-Badland complex","Koele",null,70,null,80,14,14,2.7,"rare","very brief",null,"none"]
["HI950","Molokai","KRL",{"$f":"IF('Plant Control IR Template'!$V$2=B767,C767,\"\")","v":""},"468166","Koele-Badland complex","Badland",null,30,"bedrock, paralithic",0,0,55,2,"none",null,null,"none"]
["HI950","Molokai","LaA",{"$f":"IF('Plant Control IR Template'!$V$2=B768,C768,\"\")","v":""},"468176","Lahaina silty clay, 0 to 3 percent slopes","Lahaina",null,100,null,80,0,2,2.2000000000000002,"none",null,null,"none"]
["HI950","Molokai","LaB",{"$f":"IF('Plant Control IR Template'!$V$2=B769,C769,\"\")","v":""},"468177","Lahaina silty clay, 3 to 7 percent slopes","Lahaina",null,100,null,80,0,5,2.2000000000000002,"none",null,null,"none"]
["HI950","Molokai","LaC",{"$f":"IF('Plant Control IR Template'!$V$2=B770,C770,\"\")","v":""},"468178","Lahaina silty clay, 7 to 15 percent slopes","Lahaina",null,100,null,80,0,11,2.2000000000000002,"none",null,null,"none"]
["HI950","Molokai","LaC3",{"$f":"IF('Plant Control IR Template'!$V$2=B771,C771,\"\")","v":""},"468179","Lahaina silty clay, 7 to 15 percent slopes, severely eroded","Lahaina",null,100,null,80,0,11,2.2000000000000002,"none",null,null,"none"]
["HI950","Molokai","LaD3",{"$f":"IF('Plant Control IR Template'!$V$2=B772,C772,\"\")","v":""},"468180","Lahaina silty clay, 15 to 25 percent slopes, severely eroded","Lahaina",null,100,null,80,0,20,2.2000000000000002,"none",null,null,"none"]
["HI950","Molokai","LaE3",{"$f":"IF('Plant Control IR Template'!$V$2=B773,C773,\"\")","v":""},"468181","Lahaina silty clay, 25 to 40 percent slopes, severely eroded","Lahaina",null,100,null,80,0,33,2.2000000000000002,"none",null,null,"none"]
["HI950","Molokai","LuA",{"$f":"IF('Plant Control IR Template'!$V$2=B774,C774,\"\")","v":""},"468182","Lualualei clay, 0 to 2 percent slopes","Lualualei",null,100,null,80,8,1,2.2999999999999998,"rare","very brief",null,"none"]
["HI950","Molokai","MmA",{"$f":"IF('Plant Control IR Template'!$V$2=B775,C775,\"\")","v":""},"468184","Mala silty clay, 0 to 3 percent slopes","Mala",null,100,null,80,6,2,2.4,"occasional, rare","very brief","January, February, March, April, November, December","none"]
["HI950","Molokai","MmB",{"$f":"IF('Plant Control IR Template'!$V$2=B776,C776,\"\")","v":""},"468185","Mala silty clay, 3 to 7 percent slopes","Mala",null,100,null,80,6,5,2.4,"occasional, rare","very brief","January, February, March, April, November, December","none"]
["HI950","Molokai","MuA",{"$f":"IF('Plant Control IR Template'!$V$2=B777,C777,\"\")","v":""},"468186","Molokai silty clay loam, 0 to 3 percent slopes","Molokai",null,100,null,80,0,2,2.1,"none",null,null,"none"]
["HI950","Molokai","MuB",{"$f":"IF('Plant Control IR Template'!$V$2=B778,C778,\"\")","v":""},"468187","Molokai silty clay loam, 3 to 7 percent slopes","Molokai",null,100,null,80,0,5,2.1,"none",null,null,"none"]
["HI950","Molokai","MuB3",{"$f":"IF('Plant Control IR Template'!$V$2=B779,C779,\"\")","v":""},"468188","Molokai silty clay loam, 3 to 7 percent slopes, severely eroded","Molokai",null,100,null,80,0,5,2.2000000000000002,"none",null,null,"none"]
["HI950","Molokai","MuC",{"$f":"IF('Plant Control IR Template'!$V$2=B780,C780,\"\")","v":""},"468189","Molokai silty clay loam, 7 to 15 percent slopes","Molokai",null,100,null,80,0,11,2.1,"none",null,null,"none"]
["HI950","Molokai","MuC3",{"$f":"IF('Plant Control IR Template'!$V$2=B781,C781,\"\")","v":""},"468190","Molokai silty clay loam, 7 to 15 percent slopes, severely eroded","Molokai",null,100,null,80,0,11,2.2000000000000002,"none",null,null,"none"]
["HI950","Molokai","MvD3",{"$f":"IF('Plant Control IR Template'!$V$2=B782,C782,\"\")","v":""},"468191","Molokai silty clay loam, shallow variant, 15 to 25 percent slopes, severely eroded","Molokai variant",null,100,null,80,0,20,2.1,"none",null,null,"none"]
["HI950","Molokai","MZ",{"$f":"IF('Plant Control IR Template'!$V$2=B783,C783,\"\")","v":""},"468183","Marsh","Marsh",null,100,null,80,0,1,5.3,"frequent","long","January, February, March, April, May, June, July, August, September, October, November, December","frequent","very long","January, February, March, April, May, June, July, August, September, October, November, December"]
["HI950","Molokai","NAC",{"$f":"IF('Plant Control IR Template'!$V$2=B784,C784,\"\")","v":""},"468192","Naiwa silty clay loam, 3 to 20 percent slopes","Naiwa",null,100,"bedrock, paralithic",52,0,12,2,"none",null,null,"none"]
["HI950","Molokai","NAC3",{"$f":"IF('Plant Control IR Template'!$V$2=B785,C785,\"\")","v":""},"468193","Naiwa silty clay loam, 7 to 15 percent slopes, severely eroded","Naiwa",null,100,"bedrock, paralithic",41,3,11,2,"none",null,null,"none"]
["HI950","Molokai","NLE",{"$f":"IF('Plant Control IR Template'!$V$2=B786,C786,\"\")","v":""},"468194","Niulii silty clay loam, 7 to 30 percent slopes","Niulii",null,100,"bedrock, lithic",30,8,19,2.6,"none",null,null,"none"]
["HI950","Molokai","NME",{"$f":"IF('Plant Control IR Template'!$V$2=B787,C787,\"\")","v":""},"468195","Niulii silty clay loam, medium textured variant, 7 to 30 percent slopes","Niulii variant",null,100,"bedrock, lithic",30,8,19,2.6,"none",null,null,"none"]
["HI950","Molokai","OFC",{"$f":"IF('Plant Control IR Template'!$V$2=B788,C788,\"\")","v":""},"468196","Olelo silty clay, 3 to 15 percent slopes","Olelo",null,100,null,80,7,9,2.2000000000000002,"none",null,null,"none"]
["HI950","Molokai","OME",{"$f":"IF('Plant Control IR Template'!$V$2=B789,C789,\"\")","v":""},"468197","Oli silt loam, 10 to 30 percent slopes","Oli",null,100,"bedrock, lithic",30,0,20,2.6,"none",null,null,"none"]
["HI950","Molokai","OMF",{"$f":"IF('Plant Control IR Template'!$V$2=B790,C790,\"\")","v":""},"468198","Oli silt loam, 30 to 70 percent slopes","Oli",null,100,"bedrock, lithic",30,0,50,2.6,"none",null,null,"none"]
["HI950","Molokai","OOE",{"$f":"IF('Plant Control IR Template'!$V$2=B791,C791,\"\")","v":""},"468199","Olokui silty clay loam, 3 to 30 percent slopes","Olokui",null,85,"placic",15,3,17,3.2,"none",null,null,"none"]
["HI950","Molokai","PID",{"$f":"IF('Plant Control IR Template'!$V$2=B792,C792,\"\")","v":""},"468200","Pamoa silty clay, 5 to 20 percent slopes","Pamoa",null,100,null,80,6,13,1,"none",null,null,"none"]
["HI950","Molokai","PID2",{"$f":"IF('Plant Control IR Template'!$V$2=B793,C793,\"\")","v":""},"468201","Pamoa silty clay, 5 to 20 percent slopes, eroded","Pamoa",null,100,null,80,2,13,1,"none",null,null,"none"]
["HI950","Molokai","PJD2",{"$f":"IF('Plant Control IR Template'!$V$2=B794,C794,\"\")","v":""},"468202","Pamoa stony silty clay, 5 to 20 percent slopes, eroded","Pamoa","stony",100,null,80,6,13,1,"none",null,null,"none"]
["HI950","Molokai","PoaB",{"$f":"IF('Plant Control IR Template'!$V$2=B795,C795,\"\")","v":""},"468204","Pulehu stony sandy loam, 0 to 7 percent slopes","Pulehu","stony",100,null,80,29,4,1.6,"rare, occasional","very brief","January, February, March, November, December","none"]
["HI950","Molokai","PoB",{"$f":"IF('Plant Control IR Template'!$V$2=B796,C796,\"\")","v":""},"468203","Pulehu sandy loam, 2 to 6 percent slopes","Pulehu",null,100,null,80,14,4,2,"rare, occasional","very brief","January, February, March, November, December","none"]
["HI950","Molokai","PsA",{"$f":"IF('Plant Control IR Template'!$V$2=B797,C797,\"\")","v":""},"468205","Pulehu clay loam, 0 to 3 percent slopes","Pulehu",null,100,null,80,14,2,2.8,"rare, occasional","very brief","January, February, March, November, December","none"]
["HI950","Molokai","rAMD",{"$f":"IF('Plant Control IR Template'!$V$2=B798,C798,\"\")","v":""},"468214","Amalu peaty silty clay, 3 to 20 percent slopes","Amalu","peaty",100,"placic",16,2,12,4.5,"none",null,null,"none"]
["HI950","Molokai","rAOD",{"$f":"IF('Plant Control IR Template'!$V$2=B799,C799,\"\")","v":""},"468215","Amalu-Olokui association, 3 to 20 percent slopes","Amalu",null,60,"placic",16,2,12,3.7,"none",null,null,"none"]
["HI950","Molokai","rAOD",{"$f":"IF('Plant Control IR Template'!$V$2=B800,C800,\"\")","v":""},"468215","Amalu-Olokui association, 3 to 20 percent slopes","Olokui",null,25,"placic",15,3,17,3.2,"none",null,null,"none"]
["HI950","Molokai","rRK",{"$f":"IF('Plant Control IR Template'!$V$2=B801,C801,\"\")","v":""},"468216","Rock land","Rock land",null,55,"bedrock, lithic",8,11,55,1.1000000000000001,"none",null,null,"none"]
["HI950","Molokai","rRO",{"$f":"IF('Plant Control IR Template'!$V$2=B802,C802,\"\")","v":""},"468217","Rock outcrop","Rock outcrop",null,100,"bedrock, lithic",0,0,52,0,"none",null,null,"none"]
["HI950","Molokai","rRR",{"$f":"IF('Plant Control IR Template'!$V$2=B803,C803,\"\")","v":""},"468218","Rough broken land","Rough broken land",null,100,"bedrock, paralithic",30,10,55,3,"none",null,null,"none"]
["HI950","Molokai","rRT",{"$f":"IF('Plant Control IR Template'!$V$2=B804,C804,\"\")","v":""},"468219","Rough mountainous land","Rough mountainous land",null,100,"bedrock, paralithic",25,23,75,2.5,"none",null,null,"none"]
["HI950","Molokai","rSM",{"$f":"IF('Plant Control IR Template'!$V$2=B805,C805,\"\")","v":""},"468220","Stony alluvial land","Stony alluvial land",null,100,null,80,61,9,1.2,"rare, frequent","very brief,brief","January, February, March, October, November, December","none"]
["HI950","Molokai","rSO",{"$f":"IF('Plant Control IR Template'!$V$2=B806,C806,\"\")","v":""},"468221","Stony colluvial land","Stony colluvial land",null,100,null,80,62,33,2.1,"none",null,null,"none"]
["HI950","Molokai","rTO",{"$f":"IF('Plant Control IR Template'!$V$2=B807,C807,\"\")","v":""},"468222","Tropaquods","Tropaquods",null,100,"placic",10,0,50,2.8,"none",null,null,"none"]
["HI950","Molokai","rVS",{"$f":"IF('Plant Control IR Template'!$V$2=B808,C808,\"\")","v":""},"468223","Very stony land","Very stony land",null,100,"bedrock, paralithic",5,61,19,0.5,"none",null,null,"none"]
["HI950","Molokai","rVT2",{"$f":"IF('Plant Control IR Template'!$V$2=B809,C809,\"\")","v":""},"468224","Very stony land, eroded","Very stony land, eroded","eroded",100,"bedrock, paralithic",30,61,19,1.8,"none",null,null,"none"]
["HI950","Molokai","W",{"$f":"IF('Plant Control IR Template'!$V$2=B810,C810,\"\")","v":""},"468206","Water > 40 acres","Water > 40 acres",null,100,null,80,0,null,null,"none",null,null,"none"]
["HI950","Molokai","WoB",{"$f":"IF('Plant Control IR Template'!$V$2=B811,C811,\"\")","v":""},"468207","Waihuna clay, 3 to 7 percent slopes","Waihuna",null,100,null,80,4,5,2,"none",null,null,"none"]
["HI950","Molokai","WoC",{"$f":"IF('Plant Control IR Template'!$V$2=B812,C812,\"\")","v":""},"468208","Waihuna clay, 7 to 15 percent slopes","Waihuna",null,100,null,80,4,11,2,"none",null,null,"none"]
["HI950","Molokai","WoD",{"$f":"IF('Plant Control IR Template'!$V$2=B813,C813,\"\")","v":""},"468209","Waihuna clay, 15 to 25 percent slopes","Waihuna",null,100,null,80,4,20,2,"none",null,null,"none"]
["HI950","Molokai","WrA",{"$f":"IF('Plant Control IR Template'!$V$2=B814,C814,\"\")","v":""},"468210","Waikapu silty clay loam, 0 to 3 percent slopes","Waikapu",null,100,null,80,6,2,2,"none",null,null,"none"]
["HI950","Molokai","WrB",{"$f":"IF('Plant Control IR Template'!$V$2=B815,C815,\"\")","v":""},"468211","Waikapu silty clay loam, 3 to 7 percent slopes","Waikapu",null,100,null,80,6,5,2,"none",null,null,"none"]
["HI950","Molokai","WrB3",{"$f":"IF('Plant Control IR Template'!$V$2=B816,C816,\"\")","v":""},"468212","Waikapu silty clay loam, 3 to 7 percent slopes, severely eroded","Waikapu",null,100,null,80,6,5,2,"none",null,null,"none"]
["HI950","Molokai","WrC3",{"$f":"IF('Plant Control IR Template'!$V$2=B817,C817,\"\")","v":""},"468213","Waikapu silty clay loam, 7 to 15 percent slopes, severely eroded","Waikapu",null,100,null,80,6,11,2,"none",null,null,"none"]
["HI960","Kauai","BL",{"$f":"IF('Plant Control IR Template'!$V$2=B818,C818,\"\")","v":""},"467799","Badland","Badland",null,100,"bedrock, paralithic",0,0,45,2,"none",null,null,"none"]
["HI960","Kauai","BM",{"$f":"IF('Plant Control IR Template'!$V$2=B819,C819,\"\")","v":""},"467800","Badland-Mahana complex","Badland",null,60,"bedrock, paralithic",0,0,45,2,"none",null,null,"none"]
["HI960","Kauai","BM",{"$f":"IF('Plant Control IR Template'!$V$2=B820,C820,\"\")","v":""},"467800","Badland-Mahana complex","Mahana",null,40,null,80,0,28,1.9,"none",null,null,"none"]
["HI960","Kauai","BP",{"$f":"IF('Plant Control IR Template'!$V$2=B821,C821,\"\")","v":""},"467795","Borrow pit","Borrow pit",null,100,null,80,0,null,null,"none",null,null,"none"]
["HI960","Kauai","BS",{"$f":"IF('Plant Control IR Template'!$V$2=B822,C822,\"\")","v":""},"467801","Beaches","Beaches",null,100,null,80,12,3,0.8,"frequent","very brief","January, February, March, April, May, June, July, August, September, October, November, December","none"]
["HI960","Kauai","DL",{"$f":"IF('Plant Control IR Template'!$V$2=B823,C823,\"\")","v":""},"467802","Dune land","Dune land",null,100,null,80,0,20,0.8,"none",null,null,"none"]
["HI960","Kauai","Fd",{"$f":"IF('Plant Control IR Template'!$V$2=B824,C824,\"\")","v":""},"467803","Fill land","Fill land",null,100,"bedrock, lithic",30,8,2,3,"occasional, none","very brief,","January, February, March, April, November, December","none"]
["HI960","Kauai","FL",{"$f":"IF('Plant Control IR Template'!$V$2=B825,C825,\"\")","v":""},"467796","Fill land, mixed","Fill land, mixed","mixed",100,"bedrock, lithic",60,20,null,1.8,"none",null,null,"none"]
["HI960","Kauai","HfB",{"$f":"IF('Plant Control IR Template'!$V$2=B826,C826,\"\")","v":""},"467807","Halii gravelly silty clay, 3 to 8 percent slopes","Halii","gravelly",100,null,80,16,6,2.2000000000000002,"none",null,null,"none"]
["HI960","Kauai","HfC",{"$f":"IF('Plant Control IR Template'!$V$2=B827,C827,\"\")","v":""},"467808","Halii gravelly silty clay, 8 to 15 percent slopes","Halii","gravelly",100,null,80,16,12,2.2000000000000002,"none",null,null,"none"]
["HI960","Kauai","HfD2",{"$f":"IF('Plant Control IR Template'!$V$2=B828,C828,\"\")","v":""},"467809","Halii gravelly silty clay, 15 to 25 percent slopes, eroded","Halii","gravelly",100,null,80,7,20,2.2000000000000002,"none",null,null,"none"]
["HI960","Kauai","HfE2",{"$f":"IF('Plant Control IR Template'!$V$2=B829,C829,\"\")","v":""},"467810","Halii gravelly silty clay, 25 to 40 percent slopes, eroded","Halii","gravelly",100,null,80,7,33,2.2000000000000002,"none",null,null,"none"]
["HI960","Kauai","HmA",{"$f":"IF('Plant Control IR Template'!$V$2=B830,C830,\"\")","v":""},"467811","Hanalei silty clay loam, 0 to 2 percent slopes","Hanalei",null,85,null,80,4,1,3.3,"frequent, occasional","very brief","January, February, March, April, May, June, July, August, September, October, November, December","occasional, rare","very brief","January, February, March, April, November, December"]
["HI960","Kauai","HMMF",{"$f":"IF('Plant Control IR Template'!$V$2=B831,C831,\"\")","v":""},"467804","Hihimanu silty clay loam, 40 to 70 percent slopes","Hihimanu",null,100,null,80,7,55,2.4,"none",null,null,"none"]
["HI960","Kauai","HnA",{"$f":"IF('Plant Control IR Template'!$V$2=B832,C832,\"\")","v":""},"467812","Hanalei silty clay, 0 to 2 percent slopes","Hanalei",null,85,null,80,4,1,3.3,"frequent, occasional","very brief","January, February, March, April, May, May, June, July, August, September, October, November, December","occasional, rare","very brief","January, February, March, April, November, December"]
["HI960","Kauai","HNUD",{"$f":"IF('Plant Control IR Template'!$V$2=B833,C833,\"\")","v":""},"467805","Hulua gravelly silty clay loam, 3 to 25 percent slopes","Hulua","gravelly",85,"placic",16,20,14,2.2999999999999998,"none",null,null,"none"]
["HI960","Kauai","HNUF",{"$f":"IF('Plant Control IR Template'!$V$2=B834,C834,\"\")","v":""},"467806","Hulua gravelly silty clay loam, 25 to 70 percent slopes","Hulua","gravelly",80,"placic",16,20,48,2.2999999999999998,"none",null,null,"none"]
["HI960","Kauai","HpA",{"$f":"IF('Plant Control IR Template'!$V$2=B835,C835,\"\")","v":""},"467813","Hanalei peaty silty clay loam, 0 to 2 percent slopes","Hanalei","peaty",100,null,80,4,1,3.3,"frequent, occasional","very brief","January, February, March, April, May, June, July, August, September, October, November, December","frequent","long","January, February, March, April, May, June, July, August, September, October, November, December"]
["HI960","Kauai","HrB",{"$f":"IF('Plant Control IR Template'!$V$2=B836,C836,\"\")","v":""},"467814","Hanalei silty clay, deep water table, 0 to 6 percent slopes","Hanalei",null,85,null,80,4,3,3.3,"frequent, occasional, rare","very brief","January, February, March, April, May, October, November, December","rare","very brief"]
["HI960","Kauai","HsB",{"$f":"IF('Plant Control IR Template'!$V$2=B837,C837,\"\")","v":""},"467815","Hanamaulu silty clay, 3 to 8 percent slopes","Hanamaulu",null,100,null,80,0,6,2.8,"none",null,null,"none"]
["HI960","Kauai","HsC",{"$f":"IF('Plant Control IR Template'!$V$2=B838,C838,\"\")","v":""},"467816","Hanamaulu silty clay, 8 to 15 percent slopes","Hanamaulu",null,100,null,80,0,12,2.8,"none",null,null,"none"]
["HI960","Kauai","HsD",{"$f":"IF('Plant Control IR Template'!$V$2=B839,C839,\"\")","v":""},"467817","Hanamaulu silty clay, 15 to 25 percent slopes","Hanamaulu",null,100,null,80,0,20,2.8,"none",null,null,"none"]
["HI960","Kauai","HsE",{"$f":"IF('Plant Control IR Template'!$V$2=B840,C840,\"\")","v":""},"467818","Hanamaulu silty clay, 25 to 40 percent slopes","Hanamaulu",null,100,null,80,0,33,2.8,"none",null,null,"none"]
["HI960","Kauai","HtE",{"$f":"IF('Plant Control IR Template'!$V$2=B841,C841,\"\")","v":""},"467819","Hanamaulu stony silty clay, 10 to 35 percent slopes","Hanamaulu","stony",100,null,80,12,18,2.8,"none",null,null,"none"]
["HI960","Kauai","HuE",{"$f":"IF('Plant Control IR Template'!$V$2=B842,C842,\"\")","v":""},"467820","Hanamaulu bouldery silty clay, 10 to 35 percent slopes","Hanamaulu","bouldery",100,null,80,12,23,2.8,"none",null,null,"none"]
["HI960","Kauai","IoB",{"$f":"IF('Plant Control IR Template'!$V$2=B843,C843,\"\")","v":""},"467821","Ioleau silty clay loam, 2 to 6 percent slopes","Ioleau",null,100,null,80,0,4,2.6,"none",null,null,"none"]
["HI960","Kauai","IoC",{"$f":"IF('Plant Control IR Template'!$V$2=B844,C844,\"\")","v":""},"467822","Ioleau silty clay loam, 6 to 12 percent slopes","Ioleau",null,100,null,80,0,9,2.6,"none",null,null,"none"]
["HI960","Kauai","IoD2",{"$f":"IF('Plant Control IR Template'!$V$2=B845,C845,\"\")","v":""},"467823","Ioleau silty clay loam, 12 to 20 percent slopes, eroded","Ioleau",null,100,null,80,0,16,2.6,"none",null,null,"none"]
["HI960","Kauai","IoE2",{"$f":"IF('Plant Control IR Template'!$V$2=B846,C846,\"\")","v":""},"467824","Ioleau silty clay loam, 20 to 30 percent slopes, eroded","Ioleau",null,100,null,80,0,25,2.6,"none",null,null,"none"]
["HI960","Kauai","JfB",{"$f":"IF('Plant Control IR Template'!$V$2=B847,C847,\"\")","v":""},"467825","Jaucas loamy fine sand, 0 to 8 percent slopes","Jaucas",null,100,null,80,0,4,1.3,"rare","very brief",null,"none"]
["HI960","Kauai","JkB",{"$f":"IF('Plant Control IR Template'!$V$2=B848,C848,\"\")","v":""},"467826","Jaucas loamy fine sand, dark variant, 0 to 8 percent slopes","Jaucas variant",null,100,null,80,12,4,1.2,"rare","very brief",null,"none"]
["HI960","Kauai","KavB",{"$f":"IF('Plant Control IR Template'!$V$2=B849,C849,\"\")","v":""},"467835","Kaena clay, brown variant, 1 to 6 percent slopes","Kaena variant",null,100,null,80,9,4,2.5,"none",null,null,"none"]
["HI960","Kauai","KavC",{"$f":"IF('Plant Control IR Template'!$V$2=B850,C850,\"\")","v":""},"467836","Kaena clay, brown variant, 6 to 12 percent slopes","Kaena variant",null,100,null,80,9,9,2.5,"none",null,null,"none"]
["HI960","Kauai","KdD",{"$f":"IF('Plant Control IR Template'!$V$2=B851,C851,\"\")","v":""},"467837","Kalapa silty clay, 8 to 20 percent slopes","Kalapa",null,100,null,80,0,14,2.6,"none",null,null,"none"]
["HI960","Kauai","KdE",{"$f":"IF('Plant Control IR Template'!$V$2=B852,C852,\"\")","v":""},"467838","Kalapa silty clay, 20 to 40 percent slopes","Kalapa",null,100,null,80,0,30,2.6,"none",null,null,"none"]
["HI960","Kauai","KdF",{"$f":"IF('Plant Control IR Template'!$V$2=B853,C853,\"\")","v":""},"467839","Kalapa silty clay, 40 to 70 percent slopes","Kalapa",null,100,null,80,0,55,2.6,"none",null,null,"none"]
["HI960","Kauai","Ke",{"$f":"IF('Plant Control IR Template'!$V$2=B854,C854,\"\")","v":""},"467840","Kalihi clay","Kalihi",null,100,null,80,6,1,2.6,"rare, occasional","very brief","January, February, March, November, December","frequent","very brief","January, February, March, April, May, June, July, August, September, October, November, December"]
["HI960","Kauai","KEHF",{"$f":"IF('Plant Control IR Template'!$V$2=B855,C855,\"\")","v":""},"467827","Kalapa very rocky silty clay, 40 to 70 percent slopes","Kalapa","very rocky",75,null,80,0,55,2.6,"none",null,null,"none"]
["HI960","Kauai","KEHF",{"$f":"IF('Plant Control IR Template'!$V$2=B856,C856,\"\")","v":""},"467827","Kalapa very rocky silty clay, 40 to 70 percent slopes","Rock outcrop",null,25,"bedrock, lithic",0,0,55,0,"none",null,null,"none"]
["HI960","Kauai","Kf",{"$f":"IF('Plant Control IR Template'!$V$2=B857,C857,\"\")","v":""},"467841","Kaloko clay loam","Kaloko",null,60,null,80,5,1,2.6,"occasional, rare","very brief","January, February, March, April, November, December","occasional, rare","very brief","January, February, March, April, November, December"]
["HI960","Kauai","Kf",{"$f":"IF('Plant Control IR Template'!$V$2=B858,C858,\"\")","v":""},"467841","Kaloko clay loam","Kaloko, drained",null,40,null,80,5,1,2.6,"occasional, rare","very brief","January, February, March, April, November, December","occasional, rare","very brief","January, February, March, April, November, December"]
["HI960","Kauai","Kfa",{"$f":"IF('Plant Control IR Template'!$V$2=B859,C859,\"\")","v":""},"467842","Kaloko clay","Kaloko",null,60,null,80,0,1,2.6,"occasional, rare","very brief","January, February, March, April, November, December","occasional, rare","very brief","January, February, March, April, November, December"]
["HI960","Kauai","Kfa",{"$f":"IF('Plant Control IR Template'!$V$2=B860,C860,\"\")","v":""},"467842","Kaloko clay","Kaloko, drained",null,40,null,80,0,1,2.6,"occasional, rare","very brief","January, February, March, April, November, December","occasional, rare","very brief","January, February, March, April, November, December"]
["HI960","Kauai","KkB",{"$f":"IF('Plant Control IR Template'!$V$2=B861,C861,\"\")","v":""},"467843","Kapaa silty clay, 3 to 8 percent slopes","Kapaa",null,100,null,80,2,6,2.5,"none",null,null,"none"]
["HI960","Kauai","KkC",{"$f":"IF('Plant Control IR Template'!$V$2=B862,C862,\"\")","v":""},"467844","Kapaa silty clay, 8 to 15 percent slopes","Kapaa",null,100,null,80,2,12,2.5,"none",null,null,"none"]
["HI960","Kauai","KkD",{"$f":"IF('Plant Control IR Template'!$V$2=B863,C863,\"\")","v":""},"467845","Kapaa silty clay, 15 to 25 percent slopes","Kapaa",null,100,null,80,2,20,2.5,"none",null,null,"none"]
["HI960","Kauai","KkE",{"$f":"IF('Plant Control IR Template'!$V$2=B864,C864,\"\")","v":""},"467846","Kapaa silty clay, 25 to 40 percent slopes","Kapaa",null,100,null,80,2,33,2.5,"none",null,null,"none"]
["HI960","Kauai","KoA",{"$f":"IF('Plant Control IR Template'!$V$2=B865,C865,\"\")","v":""},"467847","Kekaha silty clay, 0 to 2 percent slopes","Kekaha",null,100,null,80,0,1,2,"occasional, none","very brief,","January, February, March, April, October, November, December","rare","very brief"]
["HI960","Kauai","KoB",{"$f":"IF('Plant Control IR Template'!$V$2=B866,C866,\"\")","v":""},"467848","Kekaha silty clay, 2 to 6 percent slopes","Kekaha",null,100,null,80,0,4,2,"occasional, none","very brief,","January, February, March, April, October, November, December","rare","very brief"]
["HI960","Kauai","KobA",{"$f":"IF('Plant Control IR Template'!$V$2=B867,C867,\"\")","v":""},"467849","Kekaha clay, 0 to 2 percent slopes","Kekaha",null,100,null,80,0,1,2,"occasional, none","very brief,","January, February, March, April, October, November, December","rare","very brief"]
["HI960","Kauai","KOYE",{"$f":"IF('Plant Control IR Template'!$V$2=B868,C868,\"\")","v":""},"467828","Kekaha extremely stony silty clay loam, 0 to 35 percent slopes","Kekaha","extremely stony",100,null,80,60,18,1.8,"occasional, none, rare","very brief,","January, February, March, April, November, December","rare","very brief",null,null," "]
["HI960","Kauai","KSKE",{"$f":"IF('Plant Control IR Template'!$V$2=B869,C869,\"\")","v":""},"467829","Kokee silty clay loam, 0 to 35 percent slopes","Kokee",null,100,"bedrock, lithic",40,0,18,3.1,"none",null,null,"none",null,null,null," "]
["HI960","Kauai","KSKF",{"$f":"IF('Plant Control IR Template'!$V$2=B870,C870,\"\")","v":""},"467830","Kokee silty clay loam, 35 to 70 percent slopes","Kokee",null,100,"bedrock, paralithic",42,0,53,3.1,"none",null,null,"none",null,null,null," "]
["HI960","Kauai","KUL",{"$f":"IF('Plant Control IR Template'!$V$2=B871,C871,\"\")","v":""},"467831","Kolokolo extremely stony clay loam","Kolokolo","extremely stony",100,null,80,61,1,2.2000000000000002,"rare, occasional","very brief","January, February, March, November, December","rare","very brief",null,null," "]
["HI960","Kauai","KvB",{"$f":"IF('Plant Control IR Template'!$V$2=B872,C872,\"\")","v":""},"467850","Koloa stony silty clay, 3 to 8 percent slopes","Koloa","stony",100,"bedrock, lithic",20,21,6,2.5,"none",null,null,"none",null,null,null," "]
["HI960","Kauai","KvC",{"$f":"IF('Plant Control IR Template'!$V$2=B873,C873,\"\")","v":""},"467851","Koloa stony silty clay, 8 to 15 percent slopes","Koloa","stony",100,"bedrock, lithic",20,21,12,2.5,"none",null,null,"none",null,null,null," "]
["HI960","Kauai","KvD",{"$f":"IF('Plant Control IR Template'!$V$2=B874,C874,\"\")","v":""},"467852","Koloa stony silty clay, 15 to 25 percent slopes","Koloa","stony",100,"bedrock, lithic",20,21,20,2.5,"none",null,null,"none",null,null,null," "]
["HI960","Kauai","KVSB",{"$f":"IF('Plant Control IR Template'!$V$2=B875,C875,\"\")","v":""},"467832","Koolau silty clay, 0 to 8 percent slopes","Koolau",null,100,null,80,2,4,2.6,"none",null,null,"none",null,null,null," "]
["HI960","Kauai","KVSE",{"$f":"IF('Plant Control IR Template'!$V$2=B876,C876,\"\")","v":""},"467833","Koolau silty clay, 8 to 30 percent slopes","Koolau",null,100,null,80,2,19,2.6,"none",null,null,"none",null,null,null," "]
["HI960","Kauai","Kw",{"$f":"IF('Plant Control IR Template'!$V$2=B877,C877,\"\")","v":""},"467853","Kolokolo clay loam","Kolokolo",null,100,null,80,11,1,2.6,"occasional, rare","very brief","January, February, March, April, November, December","rare","very brief",null,null," "]
["HI960","Kauai","KZC",{"$f":"IF('Plant Control IR Template'!$V$2=B878,C878,\"\")","v":""},"467834","Kunuweia very gravelly clay loam, 0 to 15 percent slopes","Kunuweia","very gravelly",100,null,80,35,8,2.2000000000000002,"none",null,null,"none",null,null,null," "]
["HI960","Kauai","LcB",{"$f":"IF('Plant Control IR Template'!$V$2=B879,C879,\"\")","v":""},"467855","Lawai silty clay, 0 to 8 percent slopes","Lawai",null,100,null,80,4,4,3,"none",null,null,"none",null,null,null," "]
["HI960","Kauai","LcC",{"$f":"IF('Plant Control IR Template'!$V$2=B880,C880,\"\")","v":""},"467856","Lawai silty clay, 8 to 15 percent slopes","Lawai",null,100,null,80,4,12,3,"none",null,null,"none",null,null,null," "]
["HI960","Kauai","LcD",{"$f":"IF('Plant Control IR Template'!$V$2=B881,C881,\"\")","v":""},"467857","Lawai silty clay, 15 to 25 percent slopes","Lawai",null,100,null,80,4,20,3,"none",null,null,"none",null,null,null," "]
["HI960","Kauai","LhB",{"$f":"IF('Plant Control IR Template'!$V$2=B882,C882,\"\")","v":""},"467858","Lihue silty clay, 0 to 8 percent slopes","Lihue",null,100,null,80,4,4,2.8,"none",null,null,"none",null,null,null," "]
["HI960","Kauai","LhC",{"$f":"IF('Plant Control IR Template'!$V$2=B883,C883,\"\")","v":""},"467859","Lihue silty clay, 8 to 15 percent slopes","Lihue",null,100,null,80,4,12,2.8,"none",null,null,"none",null,null,null," "]
["HI960","Kauai","LhD",{"$f":"IF('Plant Control IR Template'!$V$2=B884,C884,\"\")","v":""},"467860","Lihue silty clay, 15 to 25 percent slopes","Lihue",null,100,null,80,4,20,2.8,"none",null,null,"none",null,null,null," "]
["HI960","Kauai","LhE2",{"$f":"IF('Plant Control IR Template'!$V$2=B885,C885,\"\")","v":""},"467861","Lihue silty clay, 25 to 40 percent slopes, eroded","Lihue",null,100,null,80,5,33,2.8,"none",null,null,"none",null,null,null," "]
["HI960","Kauai","LlB",{"$f":"IF('Plant Control IR Template'!$V$2=B886,C886,\"\")","v":""},"467862","Lihue gravelly silty clay, 0 to 8 percent slopes","Lihue","gravelly",100,null,80,22,4,2.8,"none",null,null,"none",null,null,null," "]
["HI960","Kauai","LlC",{"$f":"IF('Plant Control IR Template'!$V$2=B887,C887,\"\")","v":""},"467863","Lihue gravelly silty clay, 8 to 15 percent slopes","Lihue","gravelly",100,null,80,22,12,2.8,"none",null,null,"none",null,null,null," "]
["HI960","Kauai","LPE",{"$f":"IF('Plant Control IR Template'!$V$2=B888,C888,\"\")","v":""},"467854","Lualualei extremely stony clay, 3 to 35 percent slopes","Lualualei","extremely stony",100,null,80,61,19,1.8,"none",null,null,"none",null,null,null," "]
["HI960","Kauai","LuA",{"$f":"IF('Plant Control IR Template'!$V$2=B889,C889,\"\")","v":""},"467864","Lualualei clay, 0 to 2 percent slopes","Lualualei",null,100,null,80,8,1,2.2999999999999998,"rare","very brief",null,"rare","very brief",null,null," "]
["HI960","Kauai","LuB",{"$f":"IF('Plant Control IR Template'!$V$2=B890,C890,\"\")","v":""},"467865","Lualualei clay, 2 to 6 percent slopes","Lualualei",null,100,null,80,8,4,2.2999999999999998,"rare","very brief",null,"rare","very brief",null,null," "]
["HI960","Kauai","MaC",{"$f":"IF('Plant Control IR Template'!$V$2=B891,C891,\"\")","v":""},"467867","Mahana silt loam, 6 to 12 percent slopes","Mahana",null,100,null,80,0,9,1.9,"none",null,null,"none",null,null,null," "]
["HI960","Kauai","MaD",{"$f":"IF('Plant Control IR Template'!$V$2=B892,C892,\"\")","v":""},"467868","Mahana silt loam, 12 to 20 percent slopes","Mahana",null,100,null,80,0,16,1.9,"none",null,null,"none",null,null,null," "]
["HI960","Kauai","MaD3",{"$f":"IF('Plant Control IR Template'!$V$2=B893,C893,\"\")","v":""},"467869","Mahana silt loam, 12 to 20 percent slopes, severely eroded","Mahana",null,100,null,80,0,16,2.2000000000000002,"none",null,null,"none",null,null,null," "]
["HI960","Kauai","MaE",{"$f":"IF('Plant Control IR Template'!$V$2=B894,C894,\"\")","v":""},"467870","Mahana silt loam, 20 to 35 percent slopes","Mahana",null,100,null,80,0,28,1.9,"none",null,null,"none",null,null,null," "]
["HI960","Kauai","MaE3",{"$f":"IF('Plant Control IR Template'!$V$2=B895,C895,\"\")","v":""},"467871","Mahana silt loam, 20-35 percent slopes, severely eroded","Mahana",null,100,null,80,0,28,2.2000000000000002,"none",null,null,"none",null,null,null," "]
["HI960","Kauai","MeB",{"$f":"IF('Plant Control IR Template'!$V$2=B896,C896,\"\")","v":""},"467872","Makapili silty clay, 0 to 8 percent slopes","Makapili",null,100,null,80,2,4,2.6,"none",null,null,"none",null,null,null," "]
["HI960","Kauai","MeC",{"$f":"IF('Plant Control IR Template'!$V$2=B897,C897,\"\")","v":""},"467873","Makapili silty clay, 8 to 15 percent slopes","Makapili",null,100,null,80,2,12,2.6,"none",null,null,"none",null,null,null," "]
["HI960","Kauai","MeD",{"$f":"IF('Plant Control IR Template'!$V$2=B898,C898,\"\")","v":""},"467874","Makapili silty clay, 15 to 25 percent slopes","Makapili",null,100,null,80,2,20,2.6,"none",null,null,"none",null,null,null," "]
["HI960","Kauai","MeE",{"$f":"IF('Plant Control IR Template'!$V$2=B899,C899,\"\")","v":""},"467875","Makapili silty clay, 25 to 40 percent slopes","Makapili",null,100,null,80,2,33,2.6,"none",null,null,"none",null,null,null," "]
["HI960","Kauai","MgB",{"$f":"IF('Plant Control IR Template'!$V$2=B900,C900,\"\")","v":""},"467876","Makaweli silty clay loam, 0 to 6 percent slopes","Makaweli",null,100,null,80,2,3,3,"none",null,null,"none",null,null,null," "]
["HI960","Kauai","MgC",{"$f":"IF('Plant Control IR Template'!$V$2=B901,C901,\"\")","v":""},"467877","Makaweli silty clay loam, 6 to 12 percent slopes","Makaweli",null,100,null,80,2,9,3,"none",null,null,"none",null,null,null," "]
["HI960","Kauai","MgD",{"$f":"IF('Plant Control IR Template'!$V$2=B902,C902,\"\")","v":""},"467878","Makaweli silty clay loam, 12 to 20 percent slopes","Makaweli",null,100,null,80,2,16,3,"none",null,null,"none",null,null,null," "]
["HI960","Kauai","MgE2",{"$f":"IF('Plant Control IR Template'!$V$2=B903,C903,\"\")","v":""},"467879","Makaweli silty clay loam, 20 to 35 percent slopes, eroded","Makaweli",null,100,null,80,2,28,3,"none",null,null,"none",null,null,null," "]
["HI960","Kauai","MhB",{"$f":"IF('Plant Control IR Template'!$V$2=B904,C904,\"\")","v":""},"467880","Makaweli stony silty clay loam, 0 to 6 percent slopes","Makaweli",null,100,null,80,17,3,2.7,"none",null,null,"none",null,null,null," "]
["HI960","Kauai","MhC",{"$f":"IF('Plant Control IR Template'!$V$2=B905,C905,\"\")","v":""},"467881","Makaweli stony silty clay loam, 6 to 12 percent slopes","Makaweli",null,100,null,80,17,9,2.7,"none",null,null,"none",null,null,null," "]
["HI960","Kauai","MhD",{"$f":"IF('Plant Control IR Template'!$V$2=B906,C906,\"\")","v":""},"467882","Makaweli stony silty clay loam, 12 to 20 percent slopes","Makaweli",null,100,null,80,17,16,2.7,"none",null,null,"none",null,null,null," "]
["HI960","Kauai","MhE",{"$f":"IF('Plant Control IR Template'!$V$2=B907,C907,\"\")","v":""},"467883","Makaweli stony silty clay loam, 20 to 35 percent slopes","Makaweli",null,100,null,80,17,28,2.7,"none",null,null,"none",null,null,null," "]
["HI960","Kauai","MnC",{"$f":"IF('Plant Control IR Template'!$V$2=B908,C908,\"\")","v":""},"467884","Mamala stony silty clay loam, 0 to 12 percent slopes","Mamala",null,100,"bedrock, lithic",19,20,6,2.1,"rare","very brief",null,"none",null,null,null," "]
["HI960","Kauai","Mr",{"$f":"IF('Plant Control IR Template'!$V$2=B909,C909,\"\")","v":""},"467885","Mokuleia fine sandy loam","Mokuleia",null,100,null,80,7,1,2,"rare, occasional","very brief","January, February, March, October, November, December","none",null,null,null," "]
["HI960","Kauai","Mta",{"$f":"IF('Plant Control IR Template'!$V$2=B910,C910,\"\")","v":""},"467886","Mokuleia clay loam, poorly drained variant","Mokuleia variant",null,85,null,80,7,1,2.5,"rare, occasional","very brief","January, February, March, November, December","rare, occasional","very brief","January, February, March, November, December",null," "]
["HI960","Kauai","MZ",{"$f":"IF('Plant Control IR Template'!$V$2=B911,C911,\"\")","v":""},"467866","Marsh","Marsh",null,100,null,80,0,1,5.3,"frequent","long","January, February, March, April, May, June, July, August, September, October, November, December","frequent","very long","January, February, March, April, May, June, July, August, September, October, November, December",null," "]
["HI960","Kauai","NcC",{"$f":"IF('Plant Control IR Template'!$V$2=B912,C912,\"\")","v":""},"467887","Niu silty clay loam, 6 to 12 percent slopes","Niu",null,100,null,80,0,9,2.4,"none",null,null,"none",null,null,null," "]
["HI960","Kauai","NcD",{"$f":"IF('Plant Control IR Template'!$V$2=B913,C913,\"\")","v":""},"467888","Niu silty clay loam, 12 to 20 percent slopes","Niu",null,100,null,80,0,16,2.4,"none",null,null,"none",null,null,null," "]
["HI960","Kauai","NcD2",{"$f":"IF('Plant Control IR Template'!$V$2=B914,C914,\"\")","v":""},"467889","Niu silty clay loam, 6 to 12 percent slopes, eroded","Niu",null,100,null,80,0,9,2.4,"none",null,null,"none",null,null,null," "]
["HI960","Kauai","NcE2",{"$f":"IF('Plant Control IR Template'!$V$2=B915,C915,\"\")","v":""},"467890","Niu silty clay loam 20 to 35 percent slopes, eroded","Niu",null,100,null,80,0,28,2.4,"none",null,null,"none",null,null,null," "]
["HI960","Kauai","Nh",{"$f":"IF('Plant Control IR Template'!$V$2=B916,C916,\"\")","v":""},"467891","Nohili clay","Nohili",null,100,null,80,0,1,2.2999999999999998,"occasional, rare","very brief","January, February, March, April, November, December","occasional, rare","very brief","January, February, March, April, November, December",null," "]
["HI960","Kauai","NnC",{"$f":"IF('Plant Control IR Template'!$V$2=B917,C917,\"\")","v":""},"467892","Nonopahu clay, 2 to 10 percent slopes","Nonopahu",null,100,null,80,5,6,7.9,"none",null,null,"none",null,null,null," "]
["HI960","Kauai","NoC",{"$f":"IF('Plant Control IR Template'!$V$2=B918,C918,\"\")","v":""},"467893","Nonopahu stony clay, 2 to 12 percent slopes","Nonopahu","stony",100,null,80,14,7,7.9,"none",null,null,"none",null,null,null," "]
["HI960","Kauai","OlD",{"$f":"IF('Plant Control IR Template'!$V$2=B919,C919,\"\")","v":""},"467896","Oli loam, 12 to 20 percent slopes","Oli",null,100,"bedrock, lithic",30,0,16,2.6,"none",null,null,"none",null,null,null," "]
["HI960","Kauai","OME",{"$f":"IF('Plant Control IR Template'!$V$2=B920,C920,\"\")","v":""},"467894","Oli silt loam, 10 to 30 percent slopes","Oli",null,100,"bedrock, lithic",30,0,20,2.6,"none",null,null,"none",null,null,null," "]
["HI960","Kauai","OMF",{"$f":"IF('Plant Control IR Template'!$V$2=B921,C921,\"\")","v":""},"467895","Oli silt loam, 30 to 70 percent slopes","Oli",null,100,"bedrock, lithic",18,0,50,2.4,"none",null,null,"none",null,null,null," "]
["HI960","Kauai","PdA",{"$f":"IF('Plant Control IR Template'!$V$2=B922,C922,\"\")","v":""},"467900","Pakala clay loam, 0 to 2 percent slopes","Pakala",null,100,null,80,0,1,2.2000000000000002,"rare, occasional","very brief","January, February, March, November, December","rare, occasional","very brief","January, February, March, November, December",null," "]
["HI960","Kauai","PdC",{"$f":"IF('Plant Control IR Template'!$V$2=B923,C923,\"\")","v":""},"467901","Pakala clay loam, 2 to 10 percent slopes","Pakala",null,100,null,80,0,6,2.2000000000000002,"none, rare, occasional","very brief","January, February, March, November, December","none",null,null,null," "]
["HI960","Kauai","PGE",{"$f":"IF('Plant Control IR Template'!$V$2=B924,C924,\"\")","v":""},"467897","Paaiki loam, 6 to 35 percent slopes","Paaiki",null,100,"bedrock, lithic",40,0,21,3.5,"none",null,null,"none",null,null,null," "]
["HI960","Kauai","PGF",{"$f":"IF('Plant Control IR Template'!$V$2=B925,C925,\"\")","v":""},"467898","Paaiki loam, 35 to 70 percent slopes","Paaiki",null,100,"bedrock, lithic",40,0,53,3.5,"none",null,null,"none",null,null,null," "]
["HI960","Kauai","PHXC",{"$f":"IF('Plant Control IR Template'!$V$2=B926,C926,\"\")","v":""},"467899","Pakala extremely stony sandy clay loam, 0 to 12 percent slopes","Pakala","extremely stony",100,null,80,60,6,2.2000000000000002,"rare, occasional","very brief","January, February, March, November, December","none",null,null,null," "]
["HI960","Kauai","PIT",{"$f":"IF('Plant Control IR Template'!$V$2=B927,C927,\"\")","v":""},"467797","Pits","Pits",null,100,null,80,0,null,null,"none",null,null,"none",null,null,null," "]
["HI960","Kauai","PkB",{"$f":"IF('Plant Control IR Template'!$V$2=B928,C928,\"\")","v":""},"467902","Pohakupu silty clay loam, 0 to 8 percent slopes","Pohakupu",null,100,null,80,0,4,2.6,"none",null,null,"none",null,null,null," "]
["HI960","Kauai","PlB",{"$f":"IF('Plant Control IR Template'!$V$2=B929,C929,\"\")","v":""},"467903","Pooku silty clay loam, 3 to 8 percent slopes","Pooku",null,100,null,80,0,6,2.6,"none",null,null,"none",null,null,null," "]
["HI960","Kauai","PlD",{"$f":"IF('Plant Control IR Template'!$V$2=B930,C930,\"\")","v":""},"467904","Pooku silty clay loam, 8 to 25 percent slopes","Pooku",null,100,null,80,0,17,2.6,"none",null,null,"none",null,null,null," "]
["HI960","Kauai","PmB",{"$f":"IF('Plant Control IR Template'!$V$2=B931,C931,\"\")","v":""},"467905","Pooku silty clay, 0 to 8 percent slopes","Pooku",null,100,null,80,0,4,2.6,"none",null,null,"none",null,null,null," "]
["HI960","Kauai","PmC",{"$f":"IF('Plant Control IR Template'!$V$2=B932,C932,\"\")","v":""},"467906","Pooku silty clay, 8 to 15 percent slopes","Pooku",null,100,null,80,0,12,2.6,"none",null,null,"none",null,null,null," "]
["HI960","Kauai","PmD",{"$f":"IF('Plant Control IR Template'!$V$2=B933,C933,\"\")","v":""},"467907","Pooku silty clay, 15 to 25 percent slopes","Pooku",null,100,null,80,0,20,2.6,"none",null,null,"none",null,null,null," "]
["HI960","Kauai","PmE",{"$f":"IF('Plant Control IR Template'!$V$2=B934,C934,\"\")","v":""},"467908","Pooku silty clay, 25 to 40 percent slopes","Pooku",null,100,null,80,0,33,2.6,"none",null,null,"none",null,null,null," "]
["HI960","Kauai","PnA",{"$f":"IF('Plant Control IR Template'!$V$2=B935,C935,\"\")","v":""},"467909","Puhi silty clay loam, 0 to 3 percent slopes","Puhi",null,100,null,80,0,2,2.2000000000000002,"none",null,null,"none"]
["HI960","Kauai","PnB",{"$f":"IF('Plant Control IR Template'!$V$2=B936,C936,\"\")","v":""},"467910","Puhi silty clay loam, 3 to 8 percent slopes","Puhi",null,100,null,80,0,6,2.2000000000000002,"none",null,null,"none"]
["HI960","Kauai","PnC",{"$f":"IF('Plant Control IR Template'!$V$2=B937,C937,\"\")","v":""},"467911","Puhi silty clay loam, 8 to 15 percent slopes","Puhi",null,100,null,80,0,12,2.2000000000000002,"none",null,null,"none"]
["HI960","Kauai","PnD",{"$f":"IF('Plant Control IR Template'!$V$2=B938,C938,\"\")","v":""},"467912","Puhi silty clay loam, 15 to 25 percent slopes","Puhi",null,100,null,80,0,20,2.2000000000000002,"none",null,null,"none"]
["HI960","Kauai","PnE",{"$f":"IF('Plant Control IR Template'!$V$2=B939,C939,\"\")","v":""},"467913","Puhi silty clay loam, 25 to 40 percent slopes","Puhi",null,100,null,80,0,33,2.2000000000000002,"none",null,null,"none"]
["HI960","Kauai","PwC",{"$f":"IF('Plant Control IR Template'!$V$2=B940,C940,\"\")","v":""},"467914","Puu Opae silty clay loam, 8 to 15 percent slopes","Puu Opae",null,100,null,80,2,12,2.6,"none",null,null,"none"]
["HI960","Kauai","PwD",{"$f":"IF('Plant Control IR Template'!$V$2=B941,C941,\"\")","v":""},"467915","Puu Opae silty clay loam, 15 to 25 percent slopes","Puu Opae",null,100,null,80,2,20,2.6,"none",null,null,"none"]
["HI960","Kauai","PwE",{"$f":"IF('Plant Control IR Template'!$V$2=B942,C942,\"\")","v":""},"467916","Puu Opae silty clay loam, 25 to 40 percent slopes","Puu Opae",null,100,null,80,2,33,2.6,"none",null,null,"none"]
["HI960","Kauai","QU",{"$f":"IF('Plant Control IR Template'!$V$2=B943,C943,\"\")","v":""},"467798","Quarry","Quarry",null,100,null,80,0,null,null,"none",null,null,"none"]
["HI960","Kauai","rAAE",{"$f":"IF('Plant Control IR Template'!$V$2=B944,C944,\"\")","v":""},"467922","Alakai mucky peat, 0 to 30 percent slopes","Alakai",null,100,null,80,0,15,4.5,"none",null,null,"none"]
["HI960","Kauai","rRH",{"$f":"IF('Plant Control IR Template'!$V$2=B945,C945,\"\")","v":""},"467923","Riverwash","Riverwash",null,80,null,80,60,2,0.5,"frequent, rare","very brief,","January, February, March, April, May, June, July, October, November, December","none"]
["HI960","Kauai","rRK",{"$f":"IF('Plant Control IR Template'!$V$2=B946,C946,\"\")","v":""},"467924","Rock land","Rock land",null,55,"bedrock, lithic",8,11,40,1.1000000000000001,"none",null,null,"none"]
["HI960","Kauai","rRK",{"$f":"IF('Plant Control IR Template'!$V$2=B947,C947,\"\")","v":""},"467924","Rock land","Rock outcrop",null,45,"bedrock, lithic",0,0,40,0,"none",null,null,"none"]
["HI960","Kauai","rRO",{"$f":"IF('Plant Control IR Template'!$V$2=B948,C948,\"\")","v":""},"467925","Rock outcrop","Rock outcrop",null,100,"bedrock, lithic",0,0,52,0,"none",null,null,"none"]
["HI960","Kauai","rRR",{"$f":"IF('Plant Control IR Template'!$V$2=B949,C949,\"\")","v":""},"467926","Rough broken land","Rough broken land",null,100,"bedrock, paralithic",30,10,55,3,"none",null,null,"none"]
["HI960","Kauai","rRT",{"$f":"IF('Plant Control IR Template'!$V$2=B950,C950,\"\")","v":""},"467927","Rough mountainous land","Rough mountainous land",null,100,"bedrock, paralithic",25,23,75,2.5,"none",null,null,"none"]
["HI960","Kauai","rRU",{"$f":"IF('Plant Control IR Template'!$V$2=B951,C951,\"\")","v":""},"467928","Rubble land","Rubble land",null,100,null,80,80,23,1,"none",null,null,"none"]
["HI960","Kauai","rWAF",{"$f":"IF('Plant Control IR Template'!$V$2=B952,C952,\"\")","v":""},"467929","Waialeale mucky silty clay loam, 30 to 70 percent slopes","Waialeale","mucky",80,"bedrock, paralithic",24,11,50,3,"none",null,null,"none"]
["HI960","Kauai","W",{"$f":"IF('Plant Control IR Template'!$V$2=B953,C953,\"\")","v":""},"467917","Water > 40 acres","Water > 40 acres",null,100,null,80,0,null,null,"none",null,null,"none"]
["HI960","Kauai","WJF",{"$f":"IF('Plant Control IR Template'!$V$2=B954,C954,\"\")","v":""},"467918","Waiawa extremely rocky clay, 30 to 80 percent slopes","Waiawa","extremely rocky",65,"bedrock, lithic",14,1,55,2.2999999999999998,"none",null,null,"none"]
["HI960","Kauai","WJF",{"$f":"IF('Plant Control IR Template'!$V$2=B955,C955,\"\")","v":""},"467918","Waiawa extremely rocky clay, 30 to 80 percent slopes","Rock outcrop",null,35,"bedrock, lithic",0,0,55,0,"none",null,null,"none"]
["HI960","Kauai","Ws",{"$f":"IF('Plant Control IR Template'!$V$2=B956,C956,\"\")","v":""},"467919","Waikomo stony silty clay","Waikomo",null,100,"bedrock, lithic",20,30,4,2,"none",null,null,"none"]
["HI960","Kauai","Wt",{"$f":"IF('Plant Control IR Template'!$V$2=B957,C957,\"\")","v":""},"467920","Waikomo very rocky silty clay","Waikomo","very rocky",65,"bedrock, lithic",20,30,4,2,"none",null,null,"none"]
["HI960","Kauai","Wt",{"$f":"IF('Plant Control IR Template'!$V$2=B958,C958,\"\")","v":""},"467920","Waikomo very rocky silty clay","Rock outcrop",null,35,"bedrock, lithic",0,0,4,0,"none",null,null,"none"]
["HI960","Kauai","Wu",{"$f":"IF('Plant Control IR Template'!$V$2=B959,C959,\"\")","v":""},"467921","Waikomo extremely rocky silty clay","Waikomo","extremely rocky",60,"bedrock, lithic",20,30,4,2,"none",null,null,"none"]
["HI960","Kauai","Wu",{"$f":"IF('Plant Control IR Template'!$V$2=B960,C960,\"\")","v":""},"467921","Waikomo extremely rocky silty clay","Rock outcrop",null,40,"bedrock, lithic",0,0,4,0,"none",null,null,"none"]
["HI970","Lanai","BS",{"$f":"IF('Plant Control IR Template'!$V$2=B961,C961,\"\")","v":""},"467930","Beaches","Beaches",null,100,null,80,12,3,0.8,"frequent","very brief","January, February, March, April, May, June, July, August, September, October, November, December","none"]
["HI970","Lanai","BW",{"$f":"IF('Plant Control IR Template'!$V$2=B962,C962,\"\")","v":""},"467931","Blown-out land","Blown-out land",null,100,"bedrock, paralithic",20,0,8,2.4,"none",null,null,"none"]
["HI970","Lanai","CR",{"$f":"IF('Plant Control IR Template'!$V$2=B963,C963,\"\")","v":""},"467987","Coral outcrop","Coral outcrop",null,85,"bedrock, lithic",0,0,10,0,"none",null,null,"none"]
["HI970","Lanai","JaC",{"$f":"IF('Plant Control IR Template'!$V$2=B964,C964,\"\")","v":""},"467932","Jaucas sand, 0 to 15 percent slopes","Jaucas",null,100,null,80,0,8,1.1000000000000001,"rare","very brief",null,"none"]
["HI970","Lanai","KASD",{"$f":"IF('Plant Control IR Template'!$V$2=B965,C965,\"\")","v":""},"467933","Kahanui silty clay, 3 to 20 percent slopes","Kahanui",null,100,"placic",21,8,12,2.2000000000000002,"none",null,null,"none"]
["HI970","Lanai","KcB",{"$f":"IF('Plant Control IR Template'!$V$2=B966,C966,\"\")","v":""},"467935","Kalae silty clay, 2 to 7 percent slopes","Kalae",null,100,null,80,2,5,2.5,"none",null,null,"none"]
["HI970","Lanai","KcC",{"$f":"IF('Plant Control IR Template'!$V$2=B967,C967,\"\")","v":""},"467936","Kalae silty clay, 7 to 15 percent slopes","Kalae",null,100,null,80,2,11,2,"none",null,null,"none"]
["HI970","Lanai","KcD3",{"$f":"IF('Plant Control IR Template'!$V$2=B968,C968,\"\")","v":""},"467937","Kalae silty clay, 15 to 25 percent slopes, severely eroded","Kalae",null,100,null,80,2,20,1.1000000000000001,"none",null,null,"none"]
["HI970","Lanai","KhB",{"$f":"IF('Plant Control IR Template'!$V$2=B969,C969,\"\")","v":""},"467938","Kanepuu silty clay, 3 to 7 percent slopes","Kanepuu",null,100,null,80,0,5,2.4,"none",null,null,"none"]
["HI970","Lanai","KhB2",{"$f":"IF('Plant Control IR Template'!$V$2=B970,C970,\"\")","v":""},"467939","Kanepuu silty clay, 3 to 7 percent slopes, eroded","Kanepuu",null,100,null,80,0,5,2.4,"none",null,null,"none"]
["HI970","Lanai","KhC",{"$f":"IF('Plant Control IR Template'!$V$2=B971,C971,\"\")","v":""},"467940","Kanepuu silty clay, 7 to 15 percent slopes","Kanepuu",null,100,null,80,0,11,2.4,"none",null,null,"none"]
["HI970","Lanai","KhC2",{"$f":"IF('Plant Control IR Template'!$V$2=B972,C972,\"\")","v":""},"467941","Kanepuu silty clay, 7 to 15 percent slopes, eroded","Kanepuu",null,100,null,80,0,11,2.4,"none",null,null,"none"]
["HI970","Lanai","KrB",{"$f":"IF('Plant Control IR Template'!$V$2=B973,C973,\"\")","v":""},"467942","Koele silty clay loam, 3 to 7 percent slopes","Koele",null,100,"strongly contrasting textural stratification",33,14,5,2.7,"rare","very brief",null,"none"]
["HI970","Lanai","KrC",{"$f":"IF('Plant Control IR Template'!$V$2=B974,C974,\"\")","v":""},"467943","Koele silty clay loam, 7 to 15 percent slopes","Koele",null,100,"strongly contrasting textural stratification",33,14,11,2.7,"none",null,null,"none"]
["HI970","Lanai","KrD",{"$f":"IF('Plant Control IR Template'!$V$2=B975,C975,\"\")","v":""},"467944","Koele silty clay loam, 15 to 25 percent slopes","Koele",null,100,"strongly contrasting textural stratification",33,14,20,2.7,"none",null,null,"none"]
["HI970","Lanai","KRL",{"$f":"IF('Plant Control IR Template'!$V$2=B976,C976,\"\")","v":""},"467934","Koele-Badland complex","Koele",null,70,"strongly contrasting textural stratification",33,14,14,2.7,"rare","very brief",null,"none"]
["HI970","Lanai","KRL",{"$f":"IF('Plant Control IR Template'!$V$2=B977,C977,\"\")","v":""},"467934","Koele-Badland complex","Badland",null,30,"bedrock, paralithic",0,0,55,2,"none",null,null,"none"]
["HI970","Lanai","LaA",{"$f":"IF('Plant Control IR Template'!$V$2=B978,C978,\"\")","v":""},"467945","Lahaina silty clay, 0 to 3 percent slopes","Lahaina",null,100,null,80,0,2,2.2000000000000002,"none",null,null,"none"]
["HI970","Lanai","LaB",{"$f":"IF('Plant Control IR Template'!$V$2=B979,C979,\"\")","v":""},"467946","Lahaina silty clay, 3 to 7 percent slopes","Lahaina",null,100,null,80,0,5,2.2000000000000002,"none",null,null,"none"]
["HI970","Lanai","LaB3",{"$f":"IF('Plant Control IR Template'!$V$2=B980,C980,\"\")","v":""},"467947","Lahaina silty clay, 3 to 7 percent slopes, severely eroded","Lahaina",null,100,null,80,0,5,2.2000000000000002,"none",null,null,"none"]
["HI970","Lanai","LaC",{"$f":"IF('Plant Control IR Template'!$V$2=B981,C981,\"\")","v":""},"467948","Lahaina silty clay, 7 to 15 percent slopes","Lahaina",null,100,null,80,0,11,2.2000000000000002,"none",null,null,"none"]
["HI970","Lanai","LaC3",{"$f":"IF('Plant Control IR Template'!$V$2=B982,C982,\"\")","v":""},"467949","Lahaina silty clay, 7 to 15 percent slopes, severely eroded","Lahaina",null,100,null,80,0,11,2.2000000000000002,"none",null,null,"none"]
["HI970","Lanai","LaD3",{"$f":"IF('Plant Control IR Template'!$V$2=B983,C983,\"\")","v":""},"467950","Lahaina silty clay, 15 to 25 percent slopes, severely eroded","Lahaina",null,100,null,80,0,20,2.2000000000000002,"none",null,null,"none"]
["HI970","Lanai","LaE3",{"$f":"IF('Plant Control IR Template'!$V$2=B984,C984,\"\")","v":""},"467951","Lahaina silty clay, 25 to 40 percent slopes, severely eroded","Lahaina",null,100,null,80,0,33,2.2000000000000002,"none",null,null,"none"]
["HI970","Lanai","LuA",{"$f":"IF('Plant Control IR Template'!$V$2=B985,C985,\"\")","v":""},"467952","Lualualei clay, 0 to 2 percent slopes","Lualualei",null,100,null,80,8,1,2.2999999999999998,"rare","very brief",null,"none"]
["HI970","Lanai","MmA",{"$f":"IF('Plant Control IR Template'!$V$2=B986,C986,\"\")","v":""},"467953","Mala silty clay, 0 to 3 percent slopes","Mala",null,100,null,80,6,2,2.4,"occasional, rare","very brief","January, February, March, April, November, December","none"]
["HI970","Lanai","MmB",{"$f":"IF('Plant Control IR Template'!$V$2=B987,C987,\"\")","v":""},"467954","Mala silty clay, 3 to 7 percent slopes","Mala",null,100,null,80,6,5,2.4,"occasional, rare","very brief","January, February, March, April, November, December","none"]
["HI970","Lanai","MuA",{"$f":"IF('Plant Control IR Template'!$V$2=B988,C988,\"\")","v":""},"467955","Molokai silty clay loam, 0 to 3 percent slopes","Molokai",null,100,null,80,0,2,2.4,"none",null,null,"none"]
["HI970","Lanai","MuB",{"$f":"IF('Plant Control IR Template'!$V$2=B989,C989,\"\")","v":""},"467956","Molokai silty clay loam, 3 to 7 percent slopes","Molokai",null,100,null,80,0,5,2.4,"none",null,null,"none"]
["HI970","Lanai","MuC",{"$f":"IF('Plant Control IR Template'!$V$2=B990,C990,\"\")","v":""},"467957","Molokai silty clay loam, 7 to 15 percent slopes","Molokai",null,100,null,80,0,11,2.4,"none",null,null,"none"]
["HI970","Lanai","MuC3",{"$f":"IF('Plant Control IR Template'!$V$2=B991,C991,\"\")","v":""},"467958","Molokai silty clay loam, 7 to 15 percent slopes, severely eroded","Molokai",null,100,null,80,0,11,2.4,"none",null,null,"none"]
["HI970","Lanai","MvD3",{"$f":"IF('Plant Control IR Template'!$V$2=B992,C992,\"\")","v":""},"467959","Molokai silty clay loam, shallow variant, 15 to 25 percent slopes, severely eroded","Molokai variant",null,100,null,80,0,20,2.2000000000000002,"none",null,null,"none"]
["HI970","Lanai","NAC",{"$f":"IF('Plant Control IR Template'!$V$2=B993,C993,\"\")","v":""},"467960","Naiwa silty clay loam, 3 to 20 percent slopes","Naiwa",null,100,"bedrock, paralithic",52,0,12,2,"none",null,null,"none"]
["HI970","Lanai","OOE",{"$f":"IF('Plant Control IR Template'!$V$2=B994,C994,\"\")","v":""},"467961","Olokui silty clay loam, 3 to 30 percent slopes","Olokui",null,100,"placic",15,3,17,3.2,"frequent, none","brief,","January, February, March, April, May, June, November, December","frequent","very brief,","January, February, March, April, May, June, November, December"]
["HI970","Lanai","PID",{"$f":"IF('Plant Control IR Template'!$V$2=B995,C995,\"\")","v":""},"467962","Pamoa silty clay, 5 to 20 percent slopes","Pamoa",null,100,null,80,9,13,1.1000000000000001,"none",null,null,"none"]
["HI970","Lanai","PID2",{"$f":"IF('Plant Control IR Template'!$V$2=B996,C996,\"\")","v":""},"467963","Pamoa silty clay, 5 to 20 percent slopes, eroded","Pamoa",null,100,null,80,2,13,1,"none",null,null,"none"]
["HI970","Lanai","PoaB",{"$f":"IF('Plant Control IR Template'!$V$2=B997,C997,\"\")","v":""},"467965","Pulehu stony sandy loam, 0 to 7 percent slopes","Pulehu","stony",100,null,80,29,4,1.6,"rare, occasional","very brief","January, February, March, November, December","none"]
["HI970","Lanai","PoB",{"$f":"IF('Plant Control IR Template'!$V$2=B998,C998,\"\")","v":""},"467964","Pulehu sandy loam, 2 to 6 percent slopes","Pulehu",null,100,null,80,14,4,2,"rare, occasional","very brief","January, February, March, November, December","none"]
["HI970","Lanai","PsA",{"$f":"IF('Plant Control IR Template'!$V$2=B999,C999,\"\")","v":""},"467966","Pulehu clay loam, 0 to 3 percent slopes","Pulehu",null,100,null,80,14,2,2.8,"rare, occasional","very brief","January, February, March, November, December","none"]
["HI970","Lanai","rRK",{"$f":"IF('Plant Control IR Template'!$V$2=B1000,C1000,\"\")","v":""},"467978","Rock land","Rock land",null,55,"bedrock, lithic",8,11,40,1.1000000000000001,"none",null,null,"none"]
["HI970","Lanai","rRO",{"$f":"IF('Plant Control IR Template'!$V$2=B1001,C1001,\"\")","v":""},"467979","Rock outcrop","Rock outcrop",null,100,"bedrock, lithic",0,0,52,0,"none",null,null,"none"]
["HI970","Lanai","rRR",{"$f":"IF('Plant Control IR Template'!$V$2=B1002,C1002,\"\")","v":""},"467980","Rough broken land","Rough broken land",null,100,"bedrock, paralithic",30,10,55,3,"none",null,null,"none"]
["HI970","Lanai","rRT",{"$f":"IF('Plant Control IR Template'!$V$2=B1003,C1003,\"\")","v":""},"467981","Rough mountainous land","Rough mountainous land",null,100,"bedrock, paralithic",25,23,75,2.5,"none",null,null,"none"]
["HI970","Lanai","rSL",{"$f":"IF('Plant Control IR Template'!$V$2=B1004,C1004,\"\")","v":""},"467982","Sandy alluvial land","Sandy alluvial land",null,100,null,80,13,3,0.8,"frequent, rare","very brief","January, February, March, April, November, December","none"]
["HI970","Lanai","rSM",{"$f":"IF('Plant Control IR Template'!$V$2=B1005,C1005,\"\")","v":""},"467983","Stony alluvial land","Stony alluvial land",null,100,null,80,61,9,1.2,"rare, occasional","very brief,brief","January, February, March, October, November, December","none"]
["HI970","Lanai","rSN",{"$f":"IF('Plant Control IR Template'!$V$2=B1006,C1006,\"\")","v":""},"467984","Stony blown-out land","Stony blown-out land",null,100,"bedrock, paralithic",20,35,19,1.6,"none",null,null,"none"]
["HI970","Lanai","rVS",{"$f":"IF('Plant Control IR Template'!$V$2=B1007,C1007,\"\")","v":""},"467985","Very stony land","Very stony land",null,100,"bedrock, lithic",5,61,19,0.5,"none",null,null,"none"]
["HI970","Lanai","rVT2",{"$f":"IF('Plant Control IR Template'!$V$2=B1008,C1008,\"\")","v":""},"467986","Very stony land, eroded","Very stony land, eroded","eroded",100,"bedrock, lithic",30,61,19,1.8,"none",null,null,"none"]
["HI970","Lanai","UwB",{"$f":"IF('Plant Control IR Template'!$V$2=B1009,C1009,\"\")","v":""},"467967","Uwala silty clay loam, 2 to 7 percent slopes","Uwala",null,100,null,80,4,5,2.2000000000000002,"none",null,null,"none"]
["HI970","Lanai","UwC",{"$f":"IF('Plant Control IR Template'!$V$2=B1010,C1010,\"\")","v":""},"467968","Uwala silty clay loam, 7 to 15 percent slopes","Uwala",null,100,null,80,4,11,2.2000000000000002,"none",null,null,"none"]
["HI970","Lanai","UwC3",{"$f":"IF('Plant Control IR Template'!$V$2=B1011,C1011,\"\")","v":""},"467969","Uwala silty clay loam, 7 to 15 percent slopes, severely eroded","Uwala",null,100,null,80,4,11,2.2000000000000002,"none",null,null,"none"]
["HI970","Lanai","W",{"$f":"IF('Plant Control IR Template'!$V$2=B1012,C1012,\"\")","v":""},"467970","Water > 40 acres","Water > 40 acres",null,100,null,80,0,null,null,"none",null,null,"none"]
["HI970","Lanai","WoA",{"$f":"IF('Plant Control IR Template'!$V$2=B1013,C1013,\"\")","v":""},"467971","Waihuna clay, 0 to 3 percent slopes","Waihuna",null,100,null,80,4,2,2,"none",null,null,"rare","brief,"]
["HI970","Lanai","WoB",{"$f":"IF('Plant Control IR Template'!$V$2=B1014,C1014,\"\")","v":""},"467972","Waihuna clay, 3 to 7 percent slopes","Waihuna",null,100,null,80,4,5,2,"none",null,null,"none"]
["HI970","Lanai","WoC",{"$f":"IF('Plant Control IR Template'!$V$2=B1015,C1015,\"\")","v":""},"467973","Waihuna clay, 7 to 15 percent slopes","Waihuna",null,100,null,80,4,11,2,"none",null,null,"none"]
["HI970","Lanai","WoD",{"$f":"IF('Plant Control IR Template'!$V$2=B1016,C1016,\"\")","v":""},"467974","Waihuna clay, 15 to 25 percent slopes","Waihuna",null,100,null,80,4,20,2,"none",null,null,"none"]
["HI970","Lanai","WohB",{"$f":"IF('Plant Control IR Template'!$V$2=B1017,C1017,\"\")","v":""},"467975","Waihuna gravelly clay, 3 to 7 percent slopes","Waihuna","gravelly",100,null,80,21,5,1.8,"none",null,null,"none"]
["HI970","Lanai","WrA",{"$f":"IF('Plant Control IR Template'!$V$2=B1018,C1018,\"\")","v":""},"467976","Waikapu silty clay loam, 0 to 3 percent slopes","Waikapu",null,100,null,80,6,2,2,"none",null,null,"none"]
["HI970","Lanai","WrC3",{"$f":"IF('Plant Control IR Template'!$V$2=B1019,C1019,\"\")","v":""},"467977","Waikapu silty clay loam, 7 to 15 percent slopes, severely eroded","Waikapu",null,100,null,80,6,11,2,"none",null,null,"none"]
["HI980","Maui","AaB",{"$f":"IF('Plant Control IR Template'!$V$2=B1020,C1020,\"\")","v":""},"468228","Alae sandy loam, 3 to 7 percent slopes","Alae",null,100,null,80,13,5,1.9,"rare, occasional","very brief","January, February, March, November, December","none"]
["HI980","Maui","AcA",{"$f":"IF('Plant Control IR Template'!$V$2=B1021,C1021,\"\")","v":""},"468229","Alae cobbly sandy loam, 0 to 3 percent slopes","Alae","cobbly",100,null,80,26,2,1.8,"occasional, rare","very brief","January, February, March, November, December","none"]
["HI980","Maui","AcB",{"$f":"IF('Plant Control IR Template'!$V$2=B1022,C1022,\"\")","v":""},"468230","Alae cobbly sandy loam, 3 to 7 percent slopes","Alae","cobbly",100,null,80,29,5,1.8,"occasional, rare","very brief","January, February, March, November, December","none"]
["HI980","Maui","AeB",{"$f":"IF('Plant Control IR Template'!$V$2=B1023,C1023,\"\")","v":""},"468231","Alaeloa silty clay, 3 to 7 percent slopes","Alaeloa",null,100,null,80,6,5,2.6,"none",null,null,"none"]
["HI980","Maui","AeC",{"$f":"IF('Plant Control IR Template'!$V$2=B1024,C1024,\"\")","v":""},"468232","Alaeloa silty clay, 7 to 15 percent slopes","Alaeloa",null,100,null,80,6,11,2.6,"none",null,null,"none"]
["HI980","Maui","AeE",{"$f":"IF('Plant Control IR Template'!$V$2=B1025,C1025,\"\")","v":""},"468233","Alaeloa silty clay, 15 to 35 percent slopes","Alaeloa",null,100,null,80,6,25,2.6,"none",null,null,"none"]
["HI980","Maui","BS",{"$f":"IF('Plant Control IR Template'!$V$2=B1026,C1026,\"\")","v":""},"468234","Beaches","Beaches",null,100,null,80,12,3,0.8,"frequent","very brief","January, February, March, April, May, June, July, August, September, October, November, December","none"]
["HI980","Maui","CPI",{"$f":"IF('Plant Control IR Template'!$V$2=B1027,C1027,\"\")","v":""},"468226","Cinder pit","Cinder pit",null,100,null,80,0,null,null,"none",null,null,"none"]
["HI980","Maui","DL",{"$f":"IF('Plant Control IR Template'!$V$2=B1028,C1028,\"\")","v":""},"468235","Dune land","Dune land",null,100,null,80,0,20,0.8,"none",null,null,"none"]
["HI980","Maui","EaA",{"$f":"IF('Plant Control IR Template'!$V$2=B1029,C1029,\"\")","v":""},"468236","Ewa silty clay loam, 0 to 3 percent slopes","Ewa",null,100,null,80,0,2,2.2000000000000002,"none",null,null,"none"]
["HI980","Maui","EcA",{"$f":"IF('Plant Control IR Template'!$V$2=B1030,C1030,\"\")","v":""},"468237","Ewa cobbly silty clay loam, 0 to 3 percent slopes","Ewa","cobbly",100,null,80,19,2,2,"none",null,null,"none"]
["HI980","Maui","EcB",{"$f":"IF('Plant Control IR Template'!$V$2=B1031,C1031,\"\")","v":""},"468238","Ewa cobbly silty clay loam, 3 to 7 percent slopes","Ewa","cobbly",100,null,80,19,5,2,"none",null,null,"none"]
["HI980","Maui","EsA",{"$f":"IF('Plant Control IR Template'!$V$2=B1032,C1032,\"\")","v":""},"468239","Ewa silty clay, 0 to 3 percent slopes","Ewa",null,100,null,80,0,2,2.2000000000000002,"none",null,null,"none"]
["HI980","Maui","EsB",{"$f":"IF('Plant Control IR Template'!$V$2=B1033,C1033,\"\")","v":""},"468240","Ewa silty clay, 3 to 7 percent slopes","Ewa",null,100,null,80,0,5,2.2000000000000002,"none",null,null,"none"]
["HI980","Maui","EtB",{"$f":"IF('Plant Control IR Template'!$V$2=B1034,C1034,\"\")","v":""},"468241","Ewa cobbly silty clay, 3 to 7 percent slopes","Ewa","cobbly",100,null,80,19,5,2,"none",null,null,"none"]
["HI980","Maui","Fd",{"$f":"IF('Plant Control IR Template'!$V$2=B1035,C1035,\"\")","v":""},"468242","Fill land","Fill land",null,100,"bedrock, lithic",60,8,2,3,"occasional, none","very brief,","January, February, March, April, November, December","none"]
["HI980","Maui","GPI",{"$f":"IF('Plant Control IR Template'!$V$2=B1036,C1036,\"\")","v":""},"468225","Gravel pit","Gravel pit",null,100,null,80,0,null,null,"none",null,null,"none"]
["HI980","Maui","HaB",{"$f":"IF('Plant Control IR Template'!$V$2=B1037,C1037,\"\")","v":""},"468248","Haiku silty clay, 3 to 7 percent slopes","Haiku",null,100,null,80,2,5,2.4,"none",null,null,"none"]
["HI980","Maui","HaC",{"$f":"IF('Plant Control IR Template'!$V$2=B1038,C1038,\"\")","v":""},"468249","Haiku silty clay, 7 to 15 percent slopes","Haiku",null,100,null,80,2,11,2.4,"none",null,null,"none"]
["HI980","Maui","HbB",{"$f":"IF('Plant Control IR Template'!$V$2=B1039,C1039,\"\")","v":""},"468250","Haiku clay, 3 to 7 percent slopes","Haiku",null,100,null,80,2,5,2.4,"none",null,null,"none"]
["HI980","Maui","HbC",{"$f":"IF('Plant Control IR Template'!$V$2=B1040,C1040,\"\")","v":""},"468251","Haiku clay, 7 to 15 percent slopes","Haiku",null,100,null,80,2,11,2.4,"none",null,null,"none"]
["HI980","Maui","HgB",{"$f":"IF('Plant Control IR Template'!$V$2=B1041,C1041,\"\")","v":""},"468252","Haliimaile silty clay loam, 3 to 7 percent slopes","Haliimaile",null,100,null,80,0,5,2,"none",null,null,"none"]
["HI980","Maui","HgC",{"$f":"IF('Plant Control IR Template'!$V$2=B1042,C1042,\"\")","v":""},"468253","Haliimaile silty clay loam, 7 to 15 percent slopes","Haliimaile",null,100,null,80,0,11,2,"none",null,null,"none"]
["HI980","Maui","HhB",{"$f":"IF('Plant Control IR Template'!$V$2=B1043,C1043,\"\")","v":""},"468254","Haliimaile silty clay, 3 to 7 percent slopes","Haliimaile",null,100,null,80,0,5,2,"none",null,null,"none"]
["HI980","Maui","HhC",{"$f":"IF('Plant Control IR Template'!$V$2=B1044,C1044,\"\")","v":""},"468255","Haliimaile silty clay, 7 to 15 percent slopes","Haliimaile",null,100,null,80,0,11,2,"none",null,null,"none"]
["HI980","Maui","HID",{"$f":"IF('Plant Control IR Template'!$V$2=B1045,C1045,\"\")","v":""},"468243","Halawa silty clay, 3 to 25 percent slopes","Halawa",null,100,"bedrock, paralithic",58,0,14,2.6,"none",null,null,"none"]
["HI980","Maui","HkC2",{"$f":"IF('Plant Control IR Template'!$V$2=B1046,C1046,\"\")","v":""},"468256","Haliimaile gravelly silty clay, 7 to 15 percent slopes, eroded","Haliimaile","gravelly",100,null,80,18,11,1.8,"none",null,null,"none"]
["HI980","Maui","HKLD",{"$f":"IF('Plant Control IR Template'!$V$2=B1047,C1047,\"\")","v":""},"468244","Hana very stony silty clay loam, 3 to 25 percent slopes","Hana","very stony",100,null,80,40,14,2.6,"none",null,null,"none"]
["HI980","Maui","HKMD",{"$f":"IF('Plant Control IR Template'!$V$2=B1048,C1048,\"\")","v":""},"468245","Hana extremely stony silty clay loam, 3 to 25 percent slopes","Hana","extremely stony",100,null,80,70,14,2.6,"none",null,null,"none"]
["HI980","Maui","HKNC",{"$f":"IF('Plant Control IR Template'!$V$2=B1049,C1049,\"\")","v":""},"468246","Hana silty clay loam, moderately deep variant, 3 to 15 percent slopes","Hana variant",null,100,"bedrock, lithic",30,14,9,2.6,"none",null,null,"none"]
["HI980","Maui","HKOC",{"$f":"IF('Plant Control IR Template'!$V$2=B1050,C1050,\"\")","v":""},"468247","Hana extremely stony silty clay loam, moderately deep variant, 3 to 15 percent slopes","Hana variant","extremely stony",100,"bedrock, lithic",30,79,9,2.6,"none",null,null,"none"]
["HI980","Maui","HlB",{"$f":"IF('Plant Control IR Template'!$V$2=B1051,C1051,\"\")","v":""},"468257","Hamakuapoko silty clay, 3 to 7 percent slopes","Hamakuapoko",null,100,null,80,0,5,2.6,"none",null,null,"none"]
["HI980","Maui","HlC",{"$f":"IF('Plant Control IR Template'!$V$2=B1052,C1052,\"\")","v":""},"468258","Hamakuapoko silty clay, 7 to 15 percent slopes","Hamakuapoko",null,100,null,80,0,11,2.6,"none",null,null,"none"]
["HI980","Maui","HlC2",{"$f":"IF('Plant Control IR Template'!$V$2=B1053,C1053,\"\")","v":""},"468259","Hamakuapoko silty clay, 7 to 15 percent slopes, eroded","Hamakuapoko",null,100,null,80,0,11,2.6,"none",null,null,"none"]
["HI980","Maui","HwC",{"$f":"IF('Plant Control IR Template'!$V$2=B1054,C1054,\"\")","v":""},"468260","Honolua silty clay, 7 to 15 percent slopes","Honolua",null,100,null,80,0,11,2.6,"none",null,null,"none"]
["HI980","Maui","HwD",{"$f":"IF('Plant Control IR Template'!$V$2=B1055,C1055,\"\")","v":""},"468261","Honolua silty clay, 15 to 25 percent slopes","Honolua",null,100,null,80,0,20,2.6,"none",null,null,"none"]
["HI980","Maui","IaA",{"$f":"IF('Plant Control IR Template'!$V$2=B1056,C1056,\"\")","v":""},"468263","Iao silty clay, 0 to 3 percent slopes","Iao",null,100,null,80,6,2,2.8,"none",null,null,"none"]
["HI980","Maui","IaB",{"$f":"IF('Plant Control IR Template'!$V$2=B1057,C1057,\"\")","v":""},"468264","Iao silty clay, 3 to 7 percent slopes","Iao",null,100,null,80,6,5,2.8,"none",null,null,"none"]
["HI980","Maui","IbB",{"$f":"IF('Plant Control IR Template'!$V$2=B1058,C1058,\"\")","v":""},"468265","Iao cobbly silty clay, 3 to 7 percent slopes","Iao","cobbly",100,null,80,23,5,2.6,"none",null,null,"none"]
["HI980","Maui","IbC",{"$f":"IF('Plant Control IR Template'!$V$2=B1059,C1059,\"\")","v":""},"468266","Iao cobbly silty clay, 7 to 15 percent slopes","Iao","cobbly",100,null,80,23,11,2.6,"none",null,null,"none"]
["HI980","Maui","IcB",{"$f":"IF('Plant Control IR Template'!$V$2=B1060,C1060,\"\")","v":""},"468267","Iao clay, 3 to 7 percent slopes","Iao",null,100,null,80,6,5,2.8,"none",null,null,"none"]
["HI980","Maui","IcC",{"$f":"IF('Plant Control IR Template'!$V$2=B1061,C1061,\"\")","v":""},"468268","Iao clay, 7 to 15 percent slopes","Iao",null,100,null,80,6,11,2.8,"none",null,null,"none"]
["HI980","Maui","ISD",{"$f":"IF('Plant Control IR Template'!$V$2=B1062,C1062,\"\")","v":""},"468262","Io silt loam, 7 to 25 percent slopes","Io",null,100,null,80,0,16,3.1,"none",null,null,"none"]
["HI980","Maui","JaC",{"$f":"IF('Plant Control IR Template'!$V$2=B1063,C1063,\"\")","v":""},"468269","Jaucas sand, 0 to 15 percent slopes","Jaucas",null,100,null,80,0,8,1.1000000000000001,"rare","very brief",null,"none"]
["HI980","Maui","JcC",{"$f":"IF('Plant Control IR Template'!$V$2=B1064,C1064,\"\")","v":""},"468270","Jaucas sand, saline, 0 to 12 percent slopes","Jaucas",null,100,null,80,12,6,1.2,"occasional, rare","very brief","January, February, March, April, October, November, December","rare","very brief"]
["HI980","Maui","KbB",{"$f":"IF('Plant Control IR Template'!$V$2=B1065,C1065,\"\")","v":""},"468282","Kahana silty clay, 3 to 7 percent slopes","Kahana",null,100,null,80,4,5,2.2000000000000002,"none",null,null,"none"]
["HI980","Maui","KbC",{"$f":"IF('Plant Control IR Template'!$V$2=B1066,C1066,\"\")","v":""},"468283","Kahana silty clay, 7 to 15 percent slopes","Kahana",null,100,null,80,4,11,2.2000000000000002,"none",null,null,"none"]
["HI980","Maui","KbD",{"$f":"IF('Plant Control IR Template'!$V$2=B1067,C1067,\"\")","v":""},"468284","Kahana silty clay, 15 to 25 percent slopes","Kahana",null,100,null,80,4,20,2.2000000000000002,"none",null,null,"none"]
["HI980","Maui","KBID",{"$f":"IF('Plant Control IR Template'!$V$2=B1068,C1068,\"\")","v":""},"468271","Kailua silty clay, 3 to 25 percent slopes","Kailua",null,100,null,80,0,14,2.6,"none",null,null,"none"]
["HI980","Maui","KCXD",{"$f":"IF('Plant Control IR Template'!$V$2=B1069,C1069,\"\")","v":""},"468272","Kaimu extremely stony peat, 7 to 25 percent slopes","Kaimu","etremely stony",100,"bedrock, lithic",60,65,16,0.7,"none",null,null,"none"]
["HI980","Maui","KDIE",{"$f":"IF('Plant Control IR Template'!$V$2=B1070,C1070,\"\")","v":""},"468273","Kaipoioi loam, 7 to 40 percent slopes","Kaipoioi",null,100,null,80,0,24,2.8,"none",null,null,"none"]
["HI980","Maui","KDVE",{"$f":"IF('Plant Control IR Template'!$V$2=B1071,C1071,\"\")","v":""},"468274","Kaipoioi very rocky loam, 7 to 40 percent slopes","Kaipoioi","very rocky",85,null,80,0,24,2.8,"none",null,null,"none"]
["HI980","Maui","KGKC",{"$f":"IF('Plant Control IR Template'!$V$2=B1072,C1072,\"\")","v":""},"468275","Kamaole very stony silt loam, 3 to 15 percent slopes","Kamaole","very stony",100,null,80,35,9,2.1,"none",null,null,"none"]
["HI980","Maui","KGLC",{"$f":"IF('Plant Control IR Template'!$V$2=B1073,C1073,\"\")","v":""},"468276","Kamaole extremely stony silt loam, 3 to 15 percent slopes","Kamaole","extremely stony",100,null,80,52,9,2.1,"none",null,null,"none"]
["HI980","Maui","KLUD",{"$f":"IF('Plant Control IR Template'!$V$2=B1074,C1074,\"\")","v":""},"468277","Kaupo very stony silty clay loam, 3 to 25 percent slopes","Kaupo","very stony",100,null,80,40,14,2.2000000000000002,"none",null,null,"none"]
["HI980","Maui","KLVD",{"$f":"IF('Plant Control IR Template'!$V$2=B1075,C1075,\"\")","v":""},"468278","Kaupo extremely stony silty clay, 3 to 25 percent slopes","Kaupo","extremely stony",100,null,80,52,14,2.2000000000000002,"none",null,null,"none"]
["HI980","Maui","KMW",{"$f":"IF('Plant Control IR Template'!$V$2=B1076,C1076,\"\")","v":""},"468279","Kealia silt loam","Kealia",null,45,null,80,0,1,2,"frequent, rare","brief","January, February, March, April, November, December","frequent, rare","long,brief","January, February, March, April, November, December"]
["HI980","Maui","KMW",{"$f":"IF('Plant Control IR Template'!$V$2=B1077,C1077,\"\")","v":""},"468279","Kealia silt loam","Kealia, deep water table",null,35,null,80,0,1,2,"frequent, rare","brief","January, February, March, April, November, December","frequent, rare","long,brief","January, February, March, April, November, December"]
["HI980","Maui","KnaB",{"$f":"IF('Plant Control IR Template'!$V$2=B1078,C1078,\"\")","v":""},"468287","Keahua cobbly silty clay loam, 3 to 7 percent slopes","Keahua","cobbly",100,null,80,15,5,1.6,"none",null,null,"none"]
["HI980","Maui","KnaC",{"$f":"IF('Plant Control IR Template'!$V$2=B1079,C1079,\"\")","v":""},"468288","Keahua cobbly silty clay loam, 7 to 15 percent slopes","Keahua","cobbly",100,null,80,15,11,1.6,"none",null,null,"none"]
["HI980","Maui","KnaD",{"$f":"IF('Plant Control IR Template'!$V$2=B1080,C1080,\"\")","v":""},"468289","Keahua cobbly silty clay loam, 15 to 25 percent slopes","Keahua","cobbly",100,null,80,15,20,1.6,"none",null,null,"none"]
["HI980","Maui","KnB",{"$f":"IF('Plant Control IR Template'!$V$2=B1081,C1081,\"\")","v":""},"468285","Keahua silty clay loam, 3 to 7 percent slopes","Keahua",null,100,null,80,6,5,1.9,"none",null,null,"none"]
["HI980","Maui","KnbD",{"$f":"IF('Plant Control IR Template'!$V$2=B1082,C1082,\"\")","v":""},"468290","Keahua very stony silty clay loam, 7 to 25 percent slopes","Keahua","very stony",100,null,80,35,16,1.4,"none",null,null,"none"]
["HI980","Maui","KnC",{"$f":"IF('Plant Control IR Template'!$V$2=B1083,C1083,\"\")","v":""},"468286","Keahua silty clay loam, 7 to 15 percent slopes","Keahua",null,100,null,80,6,11,1.9,"none",null,null,"none"]
["HI980","Maui","KncC",{"$f":"IF('Plant Control IR Template'!$V$2=B1084,C1084,\"\")","v":""},"468291","Keahua silty clay, 7 to 15 percent slopes","Keahua",null,100,null,80,6,11,1.6,"none",null,null,"none"]
["HI980","Maui","KnhC",{"$f":"IF('Plant Control IR Template'!$V$2=B1085,C1085,\"\")","v":""},"468292","Keahua cobbly silty clay, 7 to 15 percent slopes","Keahua","cobbly",100,null,80,14,11,1.7,"none",null,null,"none"]
["HI980","Maui","KnsC",{"$f":"IF('Plant Control IR Template'!$V$2=B1086,C1086,\"\")","v":""},"468293","Keahua stony silty clay, 7 to 15 percent slopes","Keahua","stony",100,null,80,14,11,1.5,"none",null,null,"none"]
["HI980","Maui","KNXD",{"$f":"IF('Plant Control IR Template'!$V$2=B1087,C1087,\"\")","v":""},"468280","Keawakapu extremely stony silty clay loam, 3 to 25 percent slopes","Keawakapu","extremely stony",100,null,80,57,14,2.4,"none",null,null,"none"]
["HI980","Maui","KRX",{"$f":"IF('Plant Control IR Template'!$V$2=B1088,C1088,\"\")","v":""},"468281","Koele-Rocky complex","Rock outcrop",null,50,"bedrock, lithic",0,0,25,0,"none",null,null,"none"]
["HI980","Maui","KRX",{"$f":"IF('Plant Control IR Template'!$V$2=B1089,C1089,\"\")","v":""},"468281","Koele-Rocky complex","Koele",null,50,null,80,14,25,2.7,"rare","very brief",null,"none"]
["HI980","Maui","KxaD",{"$f":"IF('Plant Control IR Template'!$V$2=B1090,C1090,\"\")","v":""},"468296","Kula cobbly loam, 12 to 20 percent slopes","Kula","cobbly",100,"bedrock, paralithic",54,0,16,2.4,"none",null,null,"none"]
["HI980","Maui","KxbE",{"$f":"IF('Plant Control IR Template'!$V$2=B1091,C1091,\"\")","v":""},"468297","Kula very rocky loam, 12 to 40 percent slopes","Kula","very rocky",80,"bedrock, paralithic",54,0,26,3,"none",null,null,"none"]
["HI980","Maui","KxC",{"$f":"IF('Plant Control IR Template'!$V$2=B1092,C1092,\"\")","v":""},"468294","Kula loam, 4 to 12 percent slopes","Kula",null,100,"bedrock, paralithic",54,0,8,3,"none",null,null,"none"]
["HI980","Maui","KxD",{"$f":"IF('Plant Control IR Template'!$V$2=B1093,C1093,\"\")","v":""},"468295","Kula loam, 12 to 20 percent slopes","Kula",null,100,"bedrock, paralithic",54,0,16,3,"none",null,null,"none"]
["HI980","Maui","LaB",{"$f":"IF('Plant Control IR Template'!$V$2=B1094,C1094,\"\")","v":""},"468301","Lahaina silty clay, 3 to 7 percent slopes","Lahaina",null,100,null,80,0,5,2.2000000000000002,"none",null,null,"none"]
["HI980","Maui","LaC",{"$f":"IF('Plant Control IR Template'!$V$2=B1095,C1095,\"\")","v":""},"468302","Lahaina silty clay, 7 to 15 percent slopes","Lahaina",null,100,null,80,0,11,2.2000000000000002,"none",null,null,"none"]
["HI980","Maui","LaD",{"$f":"IF('Plant Control IR Template'!$V$2=B1096,C1096,\"\")","v":""},"468303","Lahaina silty clay, 15 to 25 percent slopes","Lahaina",null,100,null,80,0,20,2.2000000000000002,"none",null,null,"none"]
["HI980","Maui","LME",{"$f":"IF('Plant Control IR Template'!$V$2=B1097,C1097,\"\")","v":""},"468298","Laumaia loam, 7 to 40 percent slopes","Laumaia",null,100,null,80,0,24,3,"none",null,null,"none"]
["HI980","Maui","LMF",{"$f":"IF('Plant Control IR Template'!$V$2=B1098,C1098,\"\")","v":""},"468299","Laumaia loam, 40 to 70 percent slopes","Laumaia",null,100,null,80,0,55,3,"none",null,null,"none"]
["HI980","Maui","LNE",{"$f":"IF('Plant Control IR Template'!$V$2=B1099,C1099,\"\")","v":""},"468300","Laumaia extremely stony loam, 7 to 40 percent slopes","Laumaia","extremely stony",100,"bedrock, lithic",55,60,24,2.2000000000000002,"none",null,null,"none"]
["HI980","Maui","MfB",{"$f":"IF('Plant Control IR Template'!$V$2=B1100,C1100,\"\")","v":""},"468309","Makawao silty clay, 3 to 7 percent slopes","Makawao",null,100,null,80,0,5,1.8,"none",null,null,"none"]
["HI980","Maui","MfC",{"$f":"IF('Plant Control IR Template'!$V$2=B1101,C1101,\"\")","v":""},"468310","Makawao silty clay, 7 to 15 percent slopes","Makawao",null,100,null,80,0,11,1.8,"none",null,null,"none"]
["HI980","Maui","MID",{"$f":"IF('Plant Control IR Template'!$V$2=B1102,C1102,\"\")","v":""},"468304","Makaalae silty clay, 7 to 25 percent slopes","Makaalae",null,100,null,80,14,16,1.9,"none",null,null,"none"]
["HI980","Maui","MJD",{"$f":"IF('Plant Control IR Template'!$V$2=B1103,C1103,\"\")","v":""},"468305","Makaalae extremely stony silty clay, 7 to 25 percent slopes","Makaalae","extremely stony",100,null,80,61,16,1.8,"none",null,null,"none"]
["HI980","Maui","MuA",{"$f":"IF('Plant Control IR Template'!$V$2=B1104,C1104,\"\")","v":""},"468311","Molokai silty clay loam, 0 to 3 percent slopes","Molokai",null,100,null,80,0,2,2.4,"none",null,null,"none"]
["HI980","Maui","MuB",{"$f":"IF('Plant Control IR Template'!$V$2=B1105,C1105,\"\")","v":""},"468312","Molokai silty clay loam, 3 to 7 percent slopes","Molokai",null,100,null,80,0,5,2.4,"none",null,null,"none"]
["HI980","Maui","MuC",{"$f":"IF('Plant Control IR Template'!$V$2=B1106,C1106,\"\")","v":""},"468313","Molokai silty clay loam, 7 to 15 percent slopes","Molokai",null,100,null,80,0,11,2.4,"none",null,null,"none"]
["HI980","Maui","MWE",{"$f":"IF('Plant Control IR Template'!$V$2=B1107,C1107,\"\")","v":""},"468306","Makaalae clay, 7 to 40 percent slopes","Makaalae",null,100,null,80,14,24,1.9,"none",null,null,"none"]
["HI980","Maui","MXC",{"$f":"IF('Plant Control IR Template'!$V$2=B1108,C1108,\"\")","v":""},"468307","Makena loam, stony complex, 3 to 15 percent slopes","Makena",null,50,null,80,5,9,3.5,"none",null,null,"none"]
["HI980","Maui","MXC",{"$f":"IF('Plant Control IR Template'!$V$2=B1109,C1109,\"\")","v":""},"468307","Makena loam, stony complex, 3 to 15 percent slopes","Stony land",null,50,"bedrock, paralithic",10,60,11,0.9,"none",null,null,"none"]
["HI980","Maui","MYD",{"$f":"IF('Plant Control IR Template'!$V$2=B1110,C1110,\"\")","v":""},"468308","Malama extremely stony muck, 3 to 25 percent slopes","Malama","extremely stony",100,null,80,41,14,0.7,"none",null,null,"none"]
["HI980","Maui","NAC",{"$f":"IF('Plant Control IR Template'!$V$2=B1111,C1111,\"\")","v":""},"468314","Naiwa silty clay loam, 3 to 20 percent slopes","Naiwa",null,100,"bedrock, paralithic",52,0,12,2,"none",null,null,"none"]
["HI980","Maui","OAD",{"$f":"IF('Plant Control IR Template'!$V$2=B1112,C1112,\"\")","v":""},"468315","Oanapuka very stony silt loam, 7 to 25 percent slopes","Oanapuka","very stony",100,null,80,30,16,2.1,"none",null,null,"none"]
["HI980","Maui","OED",{"$f":"IF('Plant Control IR Template'!$V$2=B1113,C1113,\"\")","v":""},"468316","Oanapuka extremely stony silt loam, 7 to 25 percent slopes","Oanapuka","extremely stony",100,null,80,4,16,2.2000000000000002,"none",null,null,"none"]
["HI980","Maui","OFC",{"$f":"IF('Plant Control IR Template'!$V$2=B1114,C1114,\"\")","v":""},"468317","Olelo silty clay, 3 to 15 percent slopes","Olelo",null,100,null,80,7,9,2.2000000000000002,"none",null,null,"none"]
["HI980","Maui","OMB",{"$f":"IF('Plant Control IR Template'!$V$2=B1115,C1115,\"\")","v":""},"468318","Oli silt loam, 3 to 10 percent slopes","Oli",null,100,"bedrock, lithic",30,0,7,2.6,"none",null,null,"none"]
["HI980","Maui","ONC",{"$f":"IF('Plant Control IR Template'!$V$2=B1116,C1116,\"\")","v":""},"468319","Olinda loam, 4 to 12 percent slopes","Olinda",null,100,"bedrock, lithic",40,0,8,2.8,"none",null,null,"none"]
["HI980","Maui","OND",{"$f":"IF('Plant Control IR Template'!$V$2=B1117,C1117,\"\")","v":""},"468320","Olinda loam, 12 to 20 percent slopes","Olinda",null,100,"bedrock, lithic",40,0,16,2.8,"none",null,null,"none"]
["HI980","Maui","ONE",{"$f":"IF('Plant Control IR Template'!$V$2=B1118,C1118,\"\")","v":""},"468321","Olinda loam, 20 to 40 percent slopes","Olinda",null,100,"bedrock, lithic",40,0,30,2.8,"none",null,null,"none"]
["HI980","Maui","OPD",{"$f":"IF('Plant Control IR Template'!$V$2=B1119,C1119,\"\")","v":""},"468322","Opihikao extremely rocky muck, 3 to 25 percent slopes","Opihikao","extremely rocky",55,"bedrock, lithic",5,0,14,1.1000000000000001,"none",null,null,"none"]
["HI980","Maui","OPD",{"$f":"IF('Plant Control IR Template'!$V$2=B1120,C1120,\"\")","v":""},"468322","Opihikao extremely rocky muck, 3 to 25 percent slopes","Rock outcrop",null,45,"bedrock, lithic",0,0,14,0,"none",null,null,"none"]
["HI980","Maui","PcB",{"$f":"IF('Plant Control IR Template'!$V$2=B1121,C1121,\"\")","v":""},"468326","Paia silty clay, 3 to 7 percent slopes","Paia",null,100,null,80,0,5,2.8,"none",null,null,"none"]
["HI980","Maui","PcC",{"$f":"IF('Plant Control IR Template'!$V$2=B1122,C1122,\"\")","v":""},"468327","Paia silty clay, 7 to 15 percent slopes","Paia",null,100,null,80,0,11,2.8,"none",null,null,"none"]
["HI980","Maui","PcC2",{"$f":"IF('Plant Control IR Template'!$V$2=B1123,C1123,\"\")","v":""},"468328","Paia silty clay, 7 to 15 percent slopes, eroded","Paia",null,100,null,80,0,11,2.8,"none",null,null,"none"]
["HI980","Maui","PfB",{"$f":"IF('Plant Control IR Template'!$V$2=B1124,C1124,\"\")","v":""},"468329","Pauwela clay, 3 to 7 percent slopes","Pauwela",null,100,null,80,2,5,2.2000000000000002,"none",null,null,"none"]
["HI980","Maui","PfC",{"$f":"IF('Plant Control IR Template'!$V$2=B1125,C1125,\"\")","v":""},"468330","Pauwela clay, 7 to 15 percent slopes","Pauwela",null,100,null,80,2,11,2.2000000000000002,"none",null,null,"none"]
["HI980","Maui","PfD",{"$f":"IF('Plant Control IR Template'!$V$2=B1126,C1126,\"\")","v":""},"468331","Pauwela clay, 15 to 25 percent slopes","Pauwela",null,100,null,80,2,20,2.2000000000000002,"none",null,null,"none"]
["HI980","Maui","PpA",{"$f":"IF('Plant Control IR Template'!$V$2=B1127,C1127,\"\")","v":""},"468332","Pulehu silt loam, 0 to 3 percent slopes","Pulehu",null,100,null,80,14,2,2.8,"rare, occasional","very brief","January, February, March, November, December","none"]
["HI980","Maui","PpB",{"$f":"IF('Plant Control IR Template'!$V$2=B1128,C1128,\"\")","v":""},"468333","Pulehu silt loam, 3 to 7 percent slopes","Pulehu",null,100,null,80,14,5,2.8,"rare, occasional","very brief","January, February, March, November, December","none"]
["HI980","Maui","PrA",{"$f":"IF('Plant Control IR Template'!$V$2=B1129,C1129,\"\")","v":""},"468334","Pulehu cobbly silt loam, 0 to 3 percent slopes","Pulehu",null,100,null,80,25,2,2,"rare, occasional","very brief","January, February, March, November, December","none"]
["HI980","Maui","PrB",{"$f":"IF('Plant Control IR Template'!$V$2=B1130,C1130,\"\")","v":""},"468335","Pulehu cobbly silt loam, 3 to 7 percent slopes","Pulehu",null,100,null,80,25,5,2,"rare, occasional","very brief","January, February, March, November, December","none"]
["HI980","Maui","PsA",{"$f":"IF('Plant Control IR Template'!$V$2=B1131,C1131,\"\")","v":""},"468336","Pulehu clay loam, 0 to 3 percent slopes","Pulehu",null,100,null,80,14,2,2.8,"rare, occasional","very brief","January, February, March, November, December","none"]
["HI980","Maui","PtA",{"$f":"IF('Plant Control IR Template'!$V$2=B1132,C1132,\"\")","v":""},"468337","Pulehu cobbly clay loam, 0 to 3 percent slopes","Pulehu",null,100,null,80,25,2,2,"rare, occasional","very brief","January, February, March, November, December","none"]
["HI980","Maui","PtB",{"$f":"IF('Plant Control IR Template'!$V$2=B1133,C1133,\"\")","v":""},"468338","Pulehu cobbly clay loam, 3 to 7 percent slopes","Pulehu",null,100,null,80,25,5,2,"rare, occasional","very brief","January, February, March, November, December","none"]
["HI980","Maui","PXD",{"$f":"IF('Plant Control IR Template'!$V$2=B1134,C1134,\"\")","v":""},"468323","Pane silt loam, 7 to 25 percent slopes","Pane",null,100,null,80,6,16,3,"none",null,null,"none"]
["HI980","Maui","PZUE",{"$f":"IF('Plant Control IR Template'!$V$2=B1135,C1135,\"\")","v":""},"468324","Puuone sand, 7 to 30 percent slopes","Puuone",null,100,"cemented horizon",20,13,19,1.4,"none",null,null,"none"]
["HI980","Maui","PZVE",{"$f":"IF('Plant Control IR Template'!$V$2=B1136,C1136,\"\")","v":""},"468325","Puu Pa very stony silt loam, 7 to 40 percent slopes","Puu Pa","very stony",100,null,80,35,24,2.7,"none",null,null,"none"]
["HI980","Maui","QU",{"$f":"IF('Plant Control IR Template'!$V$2=B1137,C1137,\"\")","v":""},"468227","Quarry","Quarry",null,100,null,80,0,null,null,"none",null,null,"none"]
["HI980","Maui","rAMD",{"$f":"IF('Plant Control IR Template'!$V$2=B1138,C1138,\"\")","v":""},"468364","Amalu peaty silty clay, 3 to 20 percent slopes","Amalu",null,100,"placic",16,2,12,4.5,"none",null,null,"none"]
["HI980","Maui","rCI",{"$f":"IF('Plant Control IR Template'!$V$2=B1139,C1139,\"\")","v":""},"468365","Cinder land","Cinder land",null,100,null,80,55,45,0.6,"none",null,null,"none"]
["HI980","Maui","rHOD",{"$f":"IF('Plant Control IR Template'!$V$2=B1140,C1140,\"\")","v":""},"468366","Honomanu silty clay, 5 to 25 percent slopes","Honomanu",null,100,null,80,2,15,3.3,"none",null,null,"none"]
["HI980","Maui","rHR",{"$f":"IF('Plant Control IR Template'!$V$2=B1141,C1141,\"\")","v":""},"468367","Honomanu-Amalu association","Honomanu",null,60,null,80,2,15,3.3,"none",null,null,"none"]
["HI980","Maui","rHR",{"$f":"IF('Plant Control IR Template'!$V$2=B1142,C1142,\"\")","v":""},"468367","Honomanu-Amalu association","Amalu",null,40,"placic",16,2,12,4.5,"none",null,null,"none"]
["HI980","Maui","rHT",{"$f":"IF('Plant Control IR Template'!$V$2=B1143,C1143,\"\")","v":""},"468368","Hydrandepts-Tropaquods association","Hydrandepts",null,60,"bedrock, paralithic",60,4,19,4.2,"none",null,null,"none"]
["HI980","Maui","rHT",{"$f":"IF('Plant Control IR Template'!$V$2=B1144,C1144,\"\")","v":""},"468368","Hydrandepts-Tropaquods association","Tropaquods",null,30,"placic",10,0,14,2.8,"none",null,null,"none"]
["HI980","Maui","rLW",{"$f":"IF('Plant Control IR Template'!$V$2=B1145,C1145,\"\")","v":""},"468369","Lava flows, aa","Lava flows","aa",100,"bedrock, lithic",60,74,35,0.2,"none",null,null,"none"]
["HI980","Maui","rRK",{"$f":"IF('Plant Control IR Template'!$V$2=B1146,C1146,\"\")","v":""},"468370","Rock land","Rock land",null,55,"bedrock, lithic",8,11,35,1.1000000000000001,"none",null,null,"none"]
["HI980","Maui","rRO",{"$f":"IF('Plant Control IR Template'!$V$2=B1147,C1147,\"\")","v":""},"468371","Rock outcrop","Rock outcrop",null,100,"bedrock, lithic",0,0,52,0,"none",null,null,"none"]
["HI980","Maui","rRR",{"$f":"IF('Plant Control IR Template'!$V$2=B1148,C1148,\"\")","v":""},"468372","Rough broken land","Rough broken land",null,100,"bedrock, paralithic",30,10,55,3,"none",null,null,"none"]
["HI980","Maui","rRS",{"$f":"IF('Plant Control IR Template'!$V$2=B1149,C1149,\"\")","v":""},"468373","Rough broken and stony land","Rough broken and stony land",null,100,"bedrock, paralithic",18,31,55,2.2000000000000002,"none",null,null,"none"]
["HI980","Maui","rRT",{"$f":"IF('Plant Control IR Template'!$V$2=B1150,C1150,\"\")","v":""},"468374","Rough mountainous land","Rough mountainous land",null,100,"bedrock, paralithic",25,23,75,2.5,"none",null,null,"none"]
["HI980","Maui","rSM",{"$f":"IF('Plant Control IR Template'!$V$2=B1151,C1151,\"\")","v":""},"468375","Stony alluvial land","Stony alluvial land",null,100,null,80,61,9,1.2,"frequent","very long","January, February, March, April, May, June, July, August, September, October, November, December","none"]
["HI980","Maui","rVS",{"$f":"IF('Plant Control IR Template'!$V$2=B1152,C1152,\"\")","v":""},"468376","Very stony land","Very stony land",null,100,"bedrock, lithic",60,60,19,1.7,"none",null,null,"none"]
["HI980","Maui","TR",{"$f":"IF('Plant Control IR Template'!$V$2=B1153,C1153,\"\")","v":""},"468339","Tropaquepts","Tropaquepts",null,90,null,80,0,1,3.1,"frequent","long","January, February, March, April, May, June, July, August, September, October, November, December","frequent","long","January, February, March, April, May, June, July, August, September, October, November, December"]
["HI980","Maui","ULD",{"$f":"IF('Plant Control IR Template'!$V$2=B1154,C1154,\"\")","v":""},"468340","Ulupalakua silt loam, 7 to 25 percent slopes","Ulupalakua",null,100,null,80,10,16,3.5,"none",null,null,"none"]
["HI980","Maui","UME",{"$f":"IF('Plant Control IR Template'!$V$2=B1155,C1155,\"\")","v":""},"468341","Uma loamy coarse sand, 15 to 40 percent slopes","Uma",null,100,null,80,27,28,1.4,"none",null,null,"none"]
["HI980","Maui","UMF",{"$f":"IF('Plant Control IR Template'!$V$2=B1156,C1156,\"\")","v":""},"468342","Uma loamy coarse sand, 40 to 70 percent slopes","Uma",null,100,null,80,27,55,1.4,"none",null,null,"none"]
["HI980","Maui","URD",{"$f":"IF('Plant Control IR Template'!$V$2=B1157,C1157,\"\")","v":""},"468343","Uma rocky loamy coarse sand, 7 to 25 percent slopes","Uma","rocky",80,null,80,27,16,1.4,"none",null,null,"none"]
["HI980","Maui","W",{"$f":"IF('Plant Control IR Template'!$V$2=B1158,C1158,\"\")","v":""},"468344","Water > 40 acres","Water > 40 acres",null,100,null,80,0,null,null,"none",null,null,"none"]
["HI980","Maui","WbB",{"$f":"IF('Plant Control IR Template'!$V$2=B1159,C1159,\"\")","v":""},"468346","Wahikuli silty clay, 3 to 7 percent slopes","Wahikuli",null,100,"bedrock, lithic",32,6,5,2.6,"none",null,null,"none"]
["HI980","Maui","WcB",{"$f":"IF('Plant Control IR Template'!$V$2=B1160,C1160,\"\")","v":""},"468347","Wahikuli stony silty clay, 3 to 7 percent slopes","Wahikuli","stony",100,"bedrock, lithic",32,19,5,2.6,"none",null,null,"none"]
["HI980","Maui","WcC",{"$f":"IF('Plant Control IR Template'!$V$2=B1161,C1161,\"\")","v":""},"468348","Wahikuli stony silty clay, 7 to 15 percent slopes","Wahikuli","stony",100,"bedrock, lithic",32,19,11,2.6,"none",null,null,"none"]
["HI980","Maui","WdB",{"$f":"IF('Plant Control IR Template'!$V$2=B1162,C1162,\"\")","v":""},"468349","Wahikuli very stony silty clay, 3 to 7 percent slopes","Wahikuli","very stony",100,"bedrock, lithic",32,37,5,2.6,"none",null,null,"none"]
["HI980","Maui","WeB",{"$f":"IF('Plant Control IR Template'!$V$2=B1163,C1163,\"\")","v":""},"468350","Waiakoa silty clay loam, 3 to 7 percent slopes","Waiakoa",null,100,"bedrock, lithic",33,10,5,2.6,"none",null,null,"none"]
["HI980","Maui","WeC",{"$f":"IF('Plant Control IR Template'!$V$2=B1164,C1164,\"\")","v":""},"468351","Waiakoa silty clay loam, 7 to 15 percent slopes","Waiakoa",null,100,"bedrock, lithic",33,10,11,2.6,"none",null,null,"none"]
["HI980","Maui","WfB",{"$f":"IF('Plant Control IR Template'!$V$2=B1165,C1165,\"\")","v":""},"468352","Waiakoa cobbly silty clay loam, 3 to 7 percent slopes","Waiakoa","cobbly",100,"bedrock, lithic",33,15,5,2.5,"none",null,null,"none"]
["HI980","Maui","WgB",{"$f":"IF('Plant Control IR Template'!$V$2=B1166,C1166,\"\")","v":""},"468353","Waiakoa very stony silty clay loam, 3 to 7 percent slopes","Waiakoa","very stony",100,"bedrock, lithic",33,18,5,2.5,"none",null,null,"none"]
["HI980","Maui","WgC",{"$f":"IF('Plant Control IR Template'!$V$2=B1167,C1167,\"\")","v":""},"468354","Waiakoa very stony silty clay loam, 7 to 15 percent slopes","Waiakoa","very stony",100,"bedrock, lithic",33,18,11,2.5,"none",null,null,"none"]
["HI980","Maui","WhB",{"$f":"IF('Plant Control IR Template'!$V$2=B1168,C1168,\"\")","v":""},"468355","Waiakoa extremely stony silty clay loam, 3 to 7 percent slopes","Waiakoa","extremely stony",100,"bedrock, lithic",33,24,5,2.4,"none",null,null,"none"]
["HI980","Maui","WhC",{"$f":"IF('Plant Control IR Template'!$V$2=B1169,C1169,\"\")","v":""},"468356","Waiakoa extremely stony silty clay loam, 7 to 15 percent slopes","Waiakoa","extremely stony",100,"bedrock, lithic",33,24,11,2.4,"none",null,null,"none"]
["HI980","Maui","WID2",{"$f":"IF('Plant Control IR Template'!$V$2=B1170,C1170,\"\")","v":""},"468345","Waiakoa extremely stony silty clay loam, 3 to 25 percent slopes, eroded","Waiakoa","extremely stony",100,"bedrock, lithic",28,62,14,2.5,"none",null,null,"none"]
["HI980","Maui","WvB",{"$f":"IF('Plant Control IR Template'!$V$2=B1171,C1171,\"\")","v":""},"468357","Wailuku silty clay, 3 to 7 percent slopes","Wailuku",null,100,null,80,6,5,2.8,"none",null,null,"none"]
["HI980","Maui","WvC",{"$f":"IF('Plant Control IR Template'!$V$2=B1172,C1172,\"\")","v":""},"468358","Wailuku silty clay, 7 to 15 percent slopes","Wailuku",null,100,null,80,6,11,2.8,"none",null,null,"none"]
["HI980","Maui","WwC",{"$f":"IF('Plant Control IR Template'!$V$2=B1173,C1173,\"\")","v":""},"468359","Wailuku cobbly silty clay, 7 to 15 percent slopes","Wailuku","cobbly",100,null,80,16,11,2.8,"none",null,null,"none"]
["HI980","Maui","WxB",{"$f":"IF('Plant Control IR Template'!$V$2=B1174,C1174,\"\")","v":""},"468360","Wainee very stony silty clay, 3 to 7 percent slopes","Wainee","very stony",100,null,80,36,5,1.2,"none",null,null,"none"]
["HI980","Maui","WxC",{"$f":"IF('Plant Control IR Template'!$V$2=B1175,C1175,\"\")","v":""},"468361","Wainee very stony silty clay, 7 to 15 percent slopes","Wainee","very stony",100,null,80,36,11,1.2,"none",null,null,"none"]
["HI980","Maui","WyB",{"$f":"IF('Plant Control IR Template'!$V$2=B1176,C1176,\"\")","v":""},"468362","Wainee extremely stony silty clay, 3 to 7 percent slopes","Wainee","extremely stony",100,null,80,60,5,1.2,"none",null,null,"none"]
["HI980","Maui","WyC",{"$f":"IF('Plant Control IR Template'!$V$2=B1177,C1177,\"\")","v":""},"468363","Wainee extremely stony silty clay, 7 to 15 percent slopes","Wainee","extremely stony",100,null,80,60,11,1.2,"none",null,null,"none"]
["HI990","Oahu","AeE",{"$f":"IF('Plant Control IR Template'!$V$2=B1178,C1178,\"\")","v":""},"468379","Alaeloa silty clay, 15 to 35 percent slopes","Alaeloa",null,100,null,80,6,25,2.6,"none",null,null,"none"]
["HI990","Oahu","ALF",{"$f":"IF('Plant Control IR Template'!$V$2=B1179,C1179,\"\")","v":""},"468378","Alaeloa silty clay, 40 to 70 percent slopes","Alaeloa",null,100,null,80,6,55,2.6,"none",null,null,"none"]
["HI990","Oahu","BS",{"$f":"IF('Plant Control IR Template'!$V$2=B1180,C1180,\"\")","v":""},"468380","Beaches","Beaches",null,100,null,80,12,3,0.8,"frequent","very brief","January, February, March, April, May, June, July, August, September, October, November, December","none"]
["HI990","Oahu","CR",{"$f":"IF('Plant Control IR Template'!$V$2=B1181,C1181,\"\")","v":""},"468381","Coral outcrop","Coral outcrop",null,85,"bedrock, lithic",0,0,13,0,"rare","very brief",null,"none"]
["HI990","Oahu","EaB",{"$f":"IF('Plant Control IR Template'!$V$2=B1182,C1182,\"\")","v":""},"468382","Ewa silty clay loam, 3 to 6 percent slopes","Ewa",null,100,null,80,0,5,2.2000000000000002,"none",null,null,"none"]
["HI990","Oahu","EaC",{"$f":"IF('Plant Control IR Template'!$V$2=B1183,C1183,\"\")","v":""},"468383","Ewa silty clay loam, 6 to 12 percent slopes","Ewa",null,100,null,80,0,9,2.2000000000000002,"none",null,null,"none"]
["HI990","Oahu","EmA",{"$f":"IF('Plant Control IR Template'!$V$2=B1184,C1184,\"\")","v":""},"468384","Ewa silty clay loam, moderately shallow, 0 to 2 percent slopes","Ewa",null,100,"bedrock, paralithic",29,0,1,2.5,"none",null,null,"none"]
["HI990","Oahu","EmB",{"$f":"IF('Plant Control IR Template'!$V$2=B1185,C1185,\"\")","v":""},"468385","Ewa silty clay loam, moderately shallow, 2 to 6 percent slopes","Ewa",null,100,"bedrock, paralithic",29,0,4,2.5,"none",null,null,"none"]
["HI990","Oahu","EwA",{"$f":"IF('Plant Control IR Template'!$V$2=B1186,C1186,\"\")","v":""},"468386","Ewa stony silty clay, 0 to 2 percent slopes","Ewa",null,100,null,80,19,1,2,"none",null,null,"none"]
["HI990","Oahu","EwB",{"$f":"IF('Plant Control IR Template'!$V$2=B1187,C1187,\"\")","v":""},"468387","Ewa stony silty clay, 2 to 6 percent slopes","Ewa",null,100,null,80,19,4,2,"none",null,null,"none"]
["HI990","Oahu","EwC",{"$f":"IF('Plant Control IR Template'!$V$2=B1188,C1188,\"\")","v":""},"468388","Ewa stony silty clay, 6 to 12 percent slopes","Ewa",null,100,null,80,19,9,2,"none",null,null,"none"]
["HI990","Oahu","Fd",{"$f":"IF('Plant Control IR Template'!$V$2=B1189,C1189,\"\")","v":""},"468390","Fill land","Fill land",null,100,"bedrock, lithic",30,8,2,3,"occasional, rare","very brief","January, February, March, April, November, December","none"]
["HI990","Oahu","FL",{"$f":"IF('Plant Control IR Template'!$V$2=B1190,C1190,\"\")","v":""},"468389","Fill land, mixed","Fill land, mixed","mixed",100,"bedrock, lithic",60,20,2,1.8,"rare","very brief",null,"none"]
["HI990","Oahu","HeA",{"$f":"IF('Plant Control IR Template'!$V$2=B1191,C1191,\"\")","v":""},"468394","Haleiwa silty clay, 0 to 2 percent slopes","Haleiwa",null,85,null,80,8,1,2.8,"occasional, rare","very brief","January, February, March, April, November, December","none"]
["HI990","Oahu","HeB",{"$f":"IF('Plant Control IR Template'!$V$2=B1192,C1192,\"\")","v":""},"468395","Haleiwa silty clay, 2 to 6 percent slopes","Haleiwa",null,100,null,80,8,4,2.8,"occasional, rare","very brief","January, February, March, April, November, December","none"]
["HI990","Oahu","HJE",{"$f":"IF('Plant Control IR Template'!$V$2=B1193,C1193,\"\")","v":""},"468391","Halawa silt loam, 20 to 35 percent slopes","Halawa",null,100,"bedrock, paralithic",53,0,28,2.6,"none",null,null,"none"]
["HI990","Oahu","HJF2",{"$f":"IF('Plant Control IR Template'!$V$2=B1194,C1194,\"\")","v":""},"468392","Halawa silt loam, 35 to 70 percent slopes, eroded","Halawa",null,100,"bedrock, paralithic",45,0,53,2.6,"none",null,null,"none"]
["HI990","Oahu","HLMG",{"$f":"IF('Plant Control IR Template'!$V$2=B1195,C1195,\"\")","v":""},"468393","Helemano silty clay, 30 to 90 percent slopes","Helemano",null,100,null,80,9,60,2.2000000000000002,"none",null,null,"none"]
["HI990","Oahu","HnA",{"$f":"IF('Plant Control IR Template'!$V$2=B1196,C1196,\"\")","v":""},"468396","Hanalei silty clay, 0 to 2 percent slopes","Hanalei",null,85,null,80,4,1,3.3,"frequent, occasional","very brief","January, February, March, April, May, June, July, August, September, October, November, December","occasional, rare","very brief","January, February, March, April, November, December"]
["HI990","Oahu","HnB",{"$f":"IF('Plant Control IR Template'!$V$2=B1197,C1197,\"\")","v":""},"468397","Hanalei silty clay, 2 to 6 percent slopes","Hanalei",null,85,null,80,4,4,3.3,"frequent, occasional","very brief","January, February, March, April, May, June, July, August, September, October, November, December","rare","very brief"]
["HI990","Oahu","HoB",{"$f":"IF('Plant Control IR Template'!$V$2=B1198,C1198,\"\")","v":""},"468398","Hanalei stony silty clay, 2 to 6 percent slopes","Hanalei",null,85,null,80,22,4,3.1,"frequent, occasional","very brief","January, February, March, April, May, June, July, August, September, October, November, December","rare","very brief"]
["HI990","Oahu","HxA",{"$f":"IF('Plant Control IR Template'!$V$2=B1199,C1199,\"\")","v":""},"468399","Honouliuli clay, 0 to 2 percent slopes","Honouliuli",null,100,null,80,0,1,2.8,"rare","very brief",null,"rare","very brief"]
["HI990","Oahu","HxB",{"$f":"IF('Plant Control IR Template'!$V$2=B1200,C1200,\"\")","v":""},"468400","Honouliuli clay, 2 to 6 percent slopes","Honouliuli",null,100,null,80,0,4,2.8,"rare","very brief",null,"none"]
["HI990","Oahu","JaC",{"$f":"IF('Plant Control IR Template'!$V$2=B1201,C1201,\"\")","v":""},"468401","Jaucas sand, 0 to 15 percent slopes","Jaucas",null,100,null,80,0,8,1.1000000000000001,"rare","very brief",null,"none"]
["HI990","Oahu","JcC",{"$f":"IF('Plant Control IR Template'!$V$2=B1202,C1202,\"\")","v":""},"468402","Jaucas sand, saline, 0 to 12 percent slopes","Jaucas","saline",100,null,80,12,6,1.2,"rare",null,null,"none"]
["HI990","Oahu","KaB",{"$f":"IF('Plant Control IR Template'!$V$2=B1203,C1203,\"\")","v":""},"468410","Kaena clay, 2 to 6 percent slopes","Kaena",null,100,null,80,9,4,2.5,"none",null,null,"none"]
["HI990","Oahu","KaC",{"$f":"IF('Plant Control IR Template'!$V$2=B1204,C1204,\"\")","v":""},"468411","Kaena clay, 6 to 12 percent slopes","Kaena",null,100,null,80,9,9,2.5,"none",null,null,"none"]
["HI990","Oahu","KaeB",{"$f":"IF('Plant Control IR Template'!$V$2=B1205,C1205,\"\")","v":""},"468412","Kaena stony clay, 2 to 6 percent slopes","Kaena",null,100,null,80,21,4,2.4,"none",null,null,"none"]
["HI990","Oahu","KaeC",{"$f":"IF('Plant Control IR Template'!$V$2=B1206,C1206,\"\")","v":""},"468413","Kaena stony clay, 6 to 12 percent slopes","Kaena",null,100,null,80,21,9,2.4,"none",null,null,"none"]
["HI990","Oahu","KaeD",{"$f":"IF('Plant Control IR Template'!$V$2=B1207,C1207,\"\")","v":""},"468414","Kaena stony clay, 12 to 20 percent slopes","Kaena",null,100,null,80,21,16,2.4,"none",null,null,"none"]
["HI990","Oahu","KanE",{"$f":"IF('Plant Control IR Template'!$V$2=B1208,C1208,\"\")","v":""},"468415","Kaena very stony clay, 10 to 35 percent slopes","Kaena",null,100,null,80,37,23,2.2999999999999998,"none",null,null,"none"]
["HI990","Oahu","Kfa",{"$f":"IF('Plant Control IR Template'!$V$2=B1209,C1209,\"\")","v":""},"468416","Kaloko clay","Kaloko, drained",null,60,null,80,0,1,2.6,"occasional, rare","very brief","January, February, March, April, November, December","rare","brief"]
["HI990","Oahu","Kfa",{"$f":"IF('Plant Control IR Template'!$V$2=B1210,C1210,\"\")","v":""},"468416","Kaloko clay","Kaloko",null,40,null,80,0,1,2.6,"occasional, rare","very brief","January, February, March, April, November, December","occasional, rare","brief","January, February, March, April, November, December"]
["HI990","Oahu","Kfb",{"$f":"IF('Plant Control IR Template'!$V$2=B1211,C1211,\"\")","v":""},"468417","Kaloko clay, noncalcareous variant","Kaloko variant",null,85,null,80,0,1,2.6,"occasional, rare","very brief","January, February, March, April, November, December","occasional, rare","brief","January, February, March, April, November, December"]
["HI990","Oahu","KgB",{"$f":"IF('Plant Control IR Template'!$V$2=B1212,C1212,\"\")","v":""},"468418","Kaneohe silty clay, 3 to 8 percent slopes","Kaneohe",null,100,null,80,4,6,2.4,"none",null,null,"none"]
["HI990","Oahu","KgC",{"$f":"IF('Plant Control IR Template'!$V$2=B1213,C1213,\"\")","v":""},"468419","Kaneohe silty clay, 8 to 15 percent slopes","Kaneohe",null,100,null,80,4,12,2.4,"none",null,null,"none"]
["HI990","Oahu","KHMC",{"$f":"IF('Plant Control IR Template'!$V$2=B1214,C1214,\"\")","v":""},"468403","Kaneohe silty clay loam, 5 to 15 percent slopes","Kaneohe",null,100,null,80,4,10,2.4,"none",null,null,"none"]
["HI990","Oahu","KHME",{"$f":"IF('Plant Control IR Template'!$V$2=B1215,C1215,\"\")","v":""},"468404","Kaneohe silty clay loam, 15 to 30 percent slopes","Kaneohe",null,100,null,80,4,23,2.4,"none",null,null,"none"]
["HI990","Oahu","KHMF",{"$f":"IF('Plant Control IR Template'!$V$2=B1216,C1216,\"\")","v":""},"468405","Kaneohe silty clay loam, 30 to 65 percent slopes","Kaneohe",null,100,null,80,4,48,2.4,"none",null,null,"none"]
["HI990","Oahu","KHOF",{"$f":"IF('Plant Control IR Template'!$V$2=B1217,C1217,\"\")","v":""},"468406","Kaneohe silty clay, 30 to 65 percent slopes","Kaneohe",null,100,null,80,4,48,2.4,"none",null,null,"none"]
["HI990","Oahu","KIG",{"$f":"IF('Plant Control IR Template'!$V$2=B1218,C1218,\"\")","v":""},"468407","Kapaa silty clay, 40 to 100 percent slopes","Kapaa",null,100,null,80,2,70,2.5,"none",null,null,"none"]
["HI990","Oahu","KlA",{"$f":"IF('Plant Control IR Template'!$V$2=B1219,C1219,\"\")","v":""},"468420","Kawaihapai clay loam, 0 to 2 percent slopes","Kawaihapai",null,100,null,80,10,1,2.8,"occasional, rare","very brief","January, February, March, April, November, December","occasional, rare","very brief","January, February, March, April, November, December"]
["HI990","Oahu","KlaA",{"$f":"IF('Plant Control IR Template'!$V$2=B1220,C1220,\"\")","v":""},"468423","Kawaihapai stony clay loam, 0 to 2 percent slopes","Kawaihapai",null,100,null,80,22,1,2.4,"occasional, rare","very brief","January, February, March, April, November, December","occasional, rare","very brief","January, February, March, April, November, December"]
["HI990","Oahu","KlaB",{"$f":"IF('Plant Control IR Template'!$V$2=B1221,C1221,\"\")","v":""},"468424","Kawaihapai stony clay loam, 2 to 6 percent slopes","Kawaihapai",null,100,null,80,22,4,2.4,"occasional, rare","very brief","January, February, March, April, November, December","none"]
["HI990","Oahu","KlB",{"$f":"IF('Plant Control IR Template'!$V$2=B1222,C1222,\"\")","v":""},"468421","Kawaihapai clay loam, 2 to 6 percent slopes","Kawaihapai",null,100,null,80,10,4,2.8,"occasional, rare","very brief","January, February, March, April, November, December","none"]
["HI990","Oahu","KlbC",{"$f":"IF('Plant Control IR Template'!$V$2=B1223,C1223,\"\")","v":""},"468425","Kawaihapai very stony clay loam, 0 to 15 percent slopes","Kawaihapai",null,100,null,80,40,8,2,"occasional, rare","very brief","January, February, March, April, November, December","none"]
["HI990","Oahu","KlC",{"$f":"IF('Plant Control IR Template'!$V$2=B1224,C1224,\"\")","v":""},"468422","Kawaihapai clay loam, 6 to 15 percent slopes","Kawaihapai",null,100,null,80,10,11,2.8,"occasional, rare","very brief","January, February, March, April, November, December","none"]
["HI990","Oahu","KmA",{"$f":"IF('Plant Control IR Template'!$V$2=B1225,C1225,\"\")","v":""},"468426","Keaau clay, 0 to 2 percent slopes","Keaau",null,85,"cemented horizon",34,0,1,2.6,"occasional, rare","very brief","January, February, March, November, December","occasional, rare","very brief","January, February, March, April, November, December"]
["HI990","Oahu","KmaB",{"$f":"IF('Plant Control IR Template'!$V$2=B1226,C1226,\"\")","v":""},"468427","Keaau stony clay, 2 to 6 percent slopes","Keaau",null,85,"cemented horizon",34,16,4,2.6,"occasional, rare","very brief","January, February, March, November, December","occasional, rare","very brief","January, February, March, April, November, December"]
["HI990","Oahu","KmbA",{"$f":"IF('Plant Control IR Template'!$V$2=B1227,C1227,\"\")","v":""},"468428","Keaau clay, saline, 0 to 2 percent slopes","Keaau",null,85,"cemented horizon",34,0,1,2.6,"occasional, rare","very brief","January, February, March, November, December","occasional, rare","very brief","January, February, March, April, November, December"]
["HI990","Oahu","KpB",{"$f":"IF('Plant Control IR Template'!$V$2=B1228,C1228,\"\")","v":""},"468429","Kemoo silty clay, 2 to 6 percent slopes","Kemoo",null,100,null,80,0,4,3.1,"none",null,null,"none"]
["HI990","Oahu","KpC",{"$f":"IF('Plant Control IR Template'!$V$2=B1229,C1229,\"\")","v":""},"468430","Kemoo silty clay, 6 to 12 percent slopes","Kemoo",null,100,null,80,0,9,3.1,"none",null,null,"none"]
["HI990","Oahu","KpD",{"$f":"IF('Plant Control IR Template'!$V$2=B1230,C1230,\"\")","v":""},"468431","Kemoo silty clay, 12 to 20 percent slopes","Kemoo",null,100,null,80,0,16,3.1,"none",null,null,"none"]
["HI990","Oahu","KpE",{"$f":"IF('Plant Control IR Template'!$V$2=B1231,C1231,\"\")","v":""},"468432","Kemoo silty clay, 20 to 35 percent slopes","Kemoo",null,100,null,80,0,28,3.1,"none",null,null,"none"]
["HI990","Oahu","KpF",{"$f":"IF('Plant Control IR Template'!$V$2=B1232,C1232,\"\")","v":""},"468433","Kemoo silty clay, 35 to 70 percent slopes","Kemoo",null,100,null,80,0,53,3.1,"none",null,null,"none"]
["HI990","Oahu","KPZ",{"$f":"IF('Plant Control IR Template'!$V$2=B1233,C1233,\"\")","v":""},"468408","Kemoo-Badland complex","Kemoo",null,60,null,80,0,40,3.1,"none",null,null,"none"]
["HI990","Oahu","KPZ",{"$f":"IF('Plant Control IR Template'!$V$2=B1234,C1234,\"\")","v":""},"468408","Kemoo-Badland complex","Badland",null,40,"bedrock, paralithic",0,0,40,2,"none",null,null,"none"]
["HI990","Oahu","KsB",{"$f":"IF('Plant Control IR Template'!$V$2=B1235,C1235,\"\")","v":""},"468434","Koko silt loam, 2 to 6 percent slopes","Koko",null,100,"bedrock, paralithic",48,0,4,3.3,"none",null,null,"none"]
["HI990","Oahu","KsC",{"$f":"IF('Plant Control IR Template'!$V$2=B1236,C1236,\"\")","v":""},"468435","Koko silt loam, 6 to 12 percent slopes","Koko",null,100,"bedrock, paralithic",48,0,9,3.3,"none",null,null,"none"]
["HI990","Oahu","KsD",{"$f":"IF('Plant Control IR Template'!$V$2=B1237,C1237,\"\")","v":""},"468436","Koko silt loam, 12 to 25 percent slopes","Koko",null,100,"bedrock, paralithic",48,0,19,3.3,"none",null,null,"none"]
["HI990","Oahu","KtC",{"$f":"IF('Plant Control IR Template'!$V$2=B1238,C1238,\"\")","v":""},"468437","Kokokahi clay, 6 to 12 percent slopes","Kokokahi",null,100,null,80,10,9,2.6,"none",null,null,"none"]
["HI990","Oahu","KTKE",{"$f":"IF('Plant Control IR Template'!$V$2=B1239,C1239,\"\")","v":""},"468409","Kokokahi very stony clay, 0 to 35 percent slopes","Kokokahi",null,100,null,80,38,18,1.8,"none",null,null,"none"]
["HI990","Oahu","KuB",{"$f":"IF('Plant Control IR Template'!$V$2=B1240,C1240,\"\")","v":""},"468438","Kolekole silty clay loam, 1 to 6 percent slopes","Kolekole",null,100,null,80,0,4,2,"none",null,null,"none"]
["HI990","Oahu","KuC",{"$f":"IF('Plant Control IR Template'!$V$2=B1241,C1241,\"\")","v":""},"468439","Kolekole silty clay loam, 6 to 12 percent slopes","Kolekole",null,100,null,80,0,9,2,"none",null,null,"none"]
["HI990","Oahu","KuD",{"$f":"IF('Plant Control IR Template'!$V$2=B1242,C1242,\"\")","v":""},"468440","Kolekole silty clay loam, 12 to 25 percent slopes","Kolekole",null,100,null,80,0,19,2,"none",null,null,"none"]
["HI990","Oahu","KyA",{"$f":"IF('Plant Control IR Template'!$V$2=B1243,C1243,\"\")","v":""},"468441","Kunia silty clay, 0 to 3 percent slopes","Kunia",null,100,null,80,0,2,2.6,"none",null,null,"none"]
["HI990","Oahu","KyB",{"$f":"IF('Plant Control IR Template'!$V$2=B1244,C1244,\"\")","v":""},"468442","Kunia silty clay, 3 to 8 percent slopes","Kunia",null,100,null,80,0,6,2.6,"none",null,null,"none"]
["HI990","Oahu","KyC",{"$f":"IF('Plant Control IR Template'!$V$2=B1245,C1245,\"\")","v":""},"468443","Kunia silty clay, 8 to 15 percent slopes","Kunia",null,100,null,80,0,12,2.6,"none",null,null,"none"]
["HI990","Oahu","LaA",{"$f":"IF('Plant Control IR Template'!$V$2=B1246,C1246,\"\")","v":""},"468445","Lahaina silty clay, 0 to 3 percent slopes","Lahaina",null,100,null,80,0,2,2.2000000000000002,"none",null,null,"none"]
["HI990","Oahu","LaB",{"$f":"IF('Plant Control IR Template'!$V$2=B1247,C1247,\"\")","v":""},"468446","Lahaina silty clay, 3 to 7 percent slopes","Lahaina",null,100,null,80,0,5,2.2000000000000002,"none",null,null,"none"]
["HI990","Oahu","LaC",{"$f":"IF('Plant Control IR Template'!$V$2=B1248,C1248,\"\")","v":""},"468447","Lahaina silty clay, 7 to 15 percent slopes","Lahaina",null,100,null,80,0,11,2.2000000000000002,"none",null,null,"none"]
["HI990","Oahu","LaC3",{"$f":"IF('Plant Control IR Template'!$V$2=B1249,C1249,\"\")","v":""},"468448","Lahaina silty clay, 7 to 15 percent slopes, severely eroded","Lahaina",null,100,null,80,0,11,2.2000000000000002,"none",null,null,"none"]
["HI990","Oahu","LeB",{"$f":"IF('Plant Control IR Template'!$V$2=B1250,C1250,\"\")","v":""},"468449","Leilehua silty clay, 2 to 6 percent slopes","Leilehua",null,100,null,80,0,4,2.2000000000000002,"none",null,null,"none"]
["HI990","Oahu","LeC",{"$f":"IF('Plant Control IR Template'!$V$2=B1251,C1251,\"\")","v":""},"468450","Leilehua silty clay, 6 to 12 percent","Leilehua",null,100,null,80,0,9,2.2000000000000002,"none",null,null,"none"]
["HI990","Oahu","LoB",{"$f":"IF('Plant Control IR Template'!$V$2=B1252,C1252,\"\")","v":""},"468451","Lolekaa silty clay, 3 to 8 percent slopes","Lolekaa",null,100,null,80,4,6,2.2000000000000002,"none",null,null,"none"]
["HI990","Oahu","LoC",{"$f":"IF('Plant Control IR Template'!$V$2=B1253,C1253,\"\")","v":""},"468452","Lolekaa silty clay, 8 to 15 percent slopes","Lolekaa",null,100,null,80,4,12,2.2000000000000002,"none",null,null,"none"]
["HI990","Oahu","LoD",{"$f":"IF('Plant Control IR Template'!$V$2=B1254,C1254,\"\")","v":""},"468453","Lolekaa silty clay, 15 to 25 percent slopes","Lolekaa",null,100,null,80,4,20,2.2000000000000002,"none",null,null,"none"]
["HI990","Oahu","LoE",{"$f":"IF('Plant Control IR Template'!$V$2=B1255,C1255,\"\")","v":""},"468454","Lolekaa silty clay, 25 to 40 percent slopes","Lolekaa",null,100,null,80,4,33,2.2000000000000002,"none",null,null,"none"]
["HI990","Oahu","LoF",{"$f":"IF('Plant Control IR Template'!$V$2=B1256,C1256,\"\")","v":""},"468455","Lolekaa silty clay, 40 to 70 percent slopes","Lolekaa",null,100,null,80,4,55,2.2000000000000002,"none",null,null,"none"]
["HI990","Oahu","LPE",{"$f":"IF('Plant Control IR Template'!$V$2=B1257,C1257,\"\")","v":""},"468444","Lualualei extremely stony clay, 3 to 35 percent slopes","Lualualei","extremely stony",100,null,80,61,19,1.8,"none",null,null,"none"]
["HI990","Oahu","LuA",{"$f":"IF('Plant Control IR Template'!$V$2=B1258,C1258,\"\")","v":""},"468456","Lualualei clay, 0 to 2 percent slopes","Lualualei",null,100,null,80,8,1,2.2999999999999998,"rare","very brief",null,"none"]
["HI990","Oahu","LuB",{"$f":"IF('Plant Control IR Template'!$V$2=B1259,C1259,\"\")","v":""},"468457","Lualualei clay, 2 to 6 percent slopes","Lualualei",null,100,null,80,8,4,2.2999999999999998,"rare","very brief",null,"none"]
["HI990","Oahu","LvA",{"$f":"IF('Plant Control IR Template'!$V$2=B1260,C1260,\"\")","v":""},"468458","Lualualei stony clay, 0 to 2 percent slopes","Lualualei","stony",100,null,80,12,1,2.2999999999999998,"rare","very brief",null,"none"]
["HI990","Oahu","LvB",{"$f":"IF('Plant Control IR Template'!$V$2=B1261,C1261,\"\")","v":""},"468459","Lualualei stony clay, 2 to 6 percent slopes","Lualualei","stony",100,null,80,12,4,2.2999999999999998,"rare","very brief",null,"none"]
["HI990","Oahu","MBL",{"$f":"IF('Plant Control IR Template'!$V$2=B1262,C1262,\"\")","v":""},"468460","Mahana-Badland complex","Mahana",null,55,null,80,0,28,2.4,"none",null,null,"none"]
["HI990","Oahu","MBL",{"$f":"IF('Plant Control IR Template'!$V$2=B1263,C1263,\"\")","v":""},"468460","Mahana-Badland complex","Badland",null,45,"bedrock, paralithic",0,0,45,2,"none",null,null,"none"]
["HI990","Oahu","McC2",{"$f":"IF('Plant Control IR Template'!$V$2=B1264,C1264,\"\")","v":""},"468462","Mahana silty clay loam, 6 to 12 percent slopes, eroded","Mahana",null,100,null,80,0,9,2.4,"none",null,null,"none"]
["HI990","Oahu","McD2",{"$f":"IF('Plant Control IR Template'!$V$2=B1265,C1265,\"\")","v":""},"468463","Mahana silty clay loam, 12 to 20 percent slopes, eroded","Mahana",null,100,null,80,0,16,2.4,"none",null,null,"none"]
["HI990","Oahu","McE2",{"$f":"IF('Plant Control IR Template'!$V$2=B1266,C1266,\"\")","v":""},"468464","Mahana silty clay loam, 20 to 35 percent slopes, eroded","Mahana",null,100,null,80,0,28,2.4,"none",null,null,"none"]
["HI990","Oahu","MdB",{"$f":"IF('Plant Control IR Template'!$V$2=B1267,C1267,\"\")","v":""},"468465","Makalapa clay, 2 to 6 percent slopes","Makalapa",null,100,"bedrock, paralithic",38,13,4,2.4,"none",null,null,"none"]
["HI990","Oahu","MdC",{"$f":"IF('Plant Control IR Template'!$V$2=B1268,C1268,\"\")","v":""},"468466","Makalapa clay, 6 to 12 percent slopes","Makalapa",null,100,"bedrock, paralithic",38,13,9,2.4,"none",null,null,"none"]
["HI990","Oahu","MdD",{"$f":"IF('Plant Control IR Template'!$V$2=B1269,C1269,\"\")","v":""},"468467","Makalapa clay, 12 to 20 percent slopes","Makalapa",null,100,"bedrock, paralithic",38,13,16,2.4,"none",null,null,"none"]
["HI990","Oahu","MkA",{"$f":"IF('Plant Control IR Template'!$V$2=B1270,C1270,\"\")","v":""},"468468","Makiki clay loam, 0 to 2 percent slopes","Makiki",null,100,null,80,11,1,2.8,"none",null,null,"none"]
["HI990","Oahu","MlA",{"$f":"IF('Plant Control IR Template'!$V$2=B1271,C1271,\"\")","v":""},"468469","Makiki stony clay loam, 0 to 3 percent slopes","Makiki","stony",100,null,80,23,2,2.6,"none",null,null,"none"]
["HI990","Oahu","MnC",{"$f":"IF('Plant Control IR Template'!$V$2=B1272,C1272,\"\")","v":""},"468470","Mamala stony silty clay loam, 0 to 12 percent slopes","Mamala","stony",100,"bedrock, lithic",19,20,6,2.1,"rare","very brief",null,"none"]
["HI990","Oahu","MoB",{"$f":"IF('Plant Control IR Template'!$V$2=B1273,C1273,\"\")","v":""},"468471","Manana silty clay loam, 2 to 6 percent slopes","Manana",null,100,null,80,2,4,2,"none",null,null,"none"]
["HI990","Oahu","MoC",{"$f":"IF('Plant Control IR Template'!$V$2=B1274,C1274,\"\")","v":""},"468472","Manana silty clay loam, 6 to 12 percent slopes","Manana",null,100,null,80,2,9,2,"none",null,null,"none"]
["HI990","Oahu","MoD2",{"$f":"IF('Plant Control IR Template'!$V$2=B1275,C1275,\"\")","v":""},"468473","Manana silty clay loam, 12 to 25 percent slopes, eroded","Manana",null,100,null,80,2,19,2.1,"none",null,null,"none"]
["HI990","Oahu","MpB",{"$f":"IF('Plant Control IR Template'!$V$2=B1276,C1276,\"\")","v":""},"468474","Manana silty clay, 3 to 8 percent slopes","Manana",null,100,null,80,2,6,2,"none",null,null,"none"]
["HI990","Oahu","MpC",{"$f":"IF('Plant Control IR Template'!$V$2=B1277,C1277,\"\")","v":""},"468475","Manana silty clay, 8 to 15 percent slopes","Manana",null,100,null,80,2,12,2,"none",null,null,"none"]
["HI990","Oahu","MpD",{"$f":"IF('Plant Control IR Template'!$V$2=B1278,C1278,\"\")","v":""},"468476","Manana silty clay, 15 to 25 percent slopes","Manana",null,100,null,80,2,20,2,"none",null,null,"none"]
["HI990","Oahu","MpD2",{"$f":"IF('Plant Control IR Template'!$V$2=B1279,C1279,\"\")","v":""},"468477","Manana silty clay, 12 to 25 percent slopes, eroded","Manana",null,100,null,80,2,19,2.1,"none",null,null,"none"]
["HI990","Oahu","MpE",{"$f":"IF('Plant Control IR Template'!$V$2=B1280,C1280,\"\")","v":""},"468478","Manana silty clay, 25 to 40 percent slopes","Manana",null,100,null,80,2,33,2,"none",null,null,"none"]
["HI990","Oahu","Ms",{"$f":"IF('Plant Control IR Template'!$V$2=B1281,C1281,\"\")","v":""},"468479","Mokuleia loam","Mokuleia",null,100,null,80,7,1,2,"rare","very brief",null,"none"]
["HI990","Oahu","Mt",{"$f":"IF('Plant Control IR Template'!$V$2=B1282,C1282,\"\")","v":""},"468480","Mokuleia clay loam","Mokuleia",null,100,null,80,7,1,2.5,"rare","very brief",null,"none"]
["HI990","Oahu","Mtb",{"$f":"IF('Plant Control IR Template'!$V$2=B1283,C1283,\"\")","v":""},"468481","Mokuleia clay","Mokuleia",null,100,null,80,4,1,2.7,"rare","very brief",null,"none"]
["HI990","Oahu","MuA",{"$f":"IF('Plant Control IR Template'!$V$2=B1284,C1284,\"\")","v":""},"468482","Molokai silty clay loam, 0 to 3 percent slopes","Molokai",null,100,null,80,0,2,2.4,"none",null,null,"none"]
["HI990","Oahu","MuB",{"$f":"IF('Plant Control IR Template'!$V$2=B1285,C1285,\"\")","v":""},"468483","Molokai silty clay loam, 3 to 7 percent slopes","Molokai",null,100,null,80,0,5,2.4,"none",null,null,"none"]
["HI990","Oahu","MuC",{"$f":"IF('Plant Control IR Template'!$V$2=B1286,C1286,\"\")","v":""},"468484","Molokai silty clay loam, 7 to 15 percent slopes","Molokai",null,100,null,80,0,11,2.4,"none",null,null,"none"]
["HI990","Oahu","MuD",{"$f":"IF('Plant Control IR Template'!$V$2=B1287,C1287,\"\")","v":""},"468485","Molokai silty clay loam, 15 to 25 percent slopes","Molokai",null,100,null,80,0,20,2.4,"none",null,null,"none"]
["HI990","Oahu","MZ",{"$f":"IF('Plant Control IR Template'!$V$2=B1288,C1288,\"\")","v":""},"468461","Marsh","Marsh",null,100,null,80,0,1,5.3,"frequent","long","January, February, March, April, May, June, July, August, September, October, November, December","frequent","very long","January, February, March, April, May, June, July, August, September, October, November, December"]
["HI990","Oahu","PaC",{"$f":"IF('Plant Control IR Template'!$V$2=B1289,C1289,\"\")","v":""},"468491","Paaloa silty clay, 3 to 12 percent slopes","Paaloa",null,100,null,80,0,8,2.2000000000000002,"none",null,null,"none"]
["HI990","Oahu","PbC",{"$f":"IF('Plant Control IR Template'!$V$2=B1290,C1290,\"\")","v":""},"468492","Paaloa clay, 2 to 12 percent","Paaloa",null,100,null,80,0,7,2.2000000000000002,"none",null,null,"none"]
["HI990","Oahu","PeB",{"$f":"IF('Plant Control IR Template'!$V$2=B1291,C1291,\"\")","v":""},"468493","Paumalu silty clay, 3 to 8 percent slopes","Paumalu",null,100,null,80,0,6,2.2000000000000002,"none",null,null,"none"]
["HI990","Oahu","PeC",{"$f":"IF('Plant Control IR Template'!$V$2=B1292,C1292,\"\")","v":""},"468494","Paumalu silty clay, 8-15 percent slopes","Paumalu",null,100,null,80,0,12,2.2000000000000002,"none",null,null,"none"]
["HI990","Oahu","PeD",{"$f":"IF('Plant Control IR Template'!$V$2=B1293,C1293,\"\")","v":""},"468495","Paumalu silty clay, 15 to 25 percent slopes","Paumalu",null,100,null,80,0,20,2.2000000000000002,"none",null,null,"none"]
["HI990","Oahu","PeE",{"$f":"IF('Plant Control IR Template'!$V$2=B1294,C1294,\"\")","v":""},"468496","Paumalu silty clay, 25 to 40 percent slopes","Paumalu",null,100,null,80,0,33,2.2000000000000002,"none",null,null,"none"]
["HI990","Oahu","PeF",{"$f":"IF('Plant Control IR Template'!$V$2=B1295,C1295,\"\")","v":""},"468497","Paumalu silty clay, 40 to 70 percent slopes","Paumalu",null,100,null,80,0,55,2.2000000000000002,"none",null,null,"none"]
["HI990","Oahu","Ph",{"$f":"IF('Plant Control IR Template'!$V$2=B1296,C1296,\"\")","v":""},"468498","Pearl Harbor clay","Pearl Harbor",null,80,null,80,2,1,2.2000000000000002,"rare, occasional","very brief","January, February, March, November, December","occasional, frequent","long","January, February, March, April, May, June, July, August, September, October, November, December"]
["HI990","Oahu","PID",{"$f":"IF('Plant Control IR Template'!$V$2=B1297,C1297,\"\")","v":""},"468486","Pamoa silty clay, 5 to 20 percent slopes","Pamoa",null,100,null,80,9,13,1.1000000000000001,"none",null,null,"none"]
["HI990","Oahu","PkB",{"$f":"IF('Plant Control IR Template'!$V$2=B1298,C1298,\"\")","v":""},"468499","Pohakupu silty clay loam, 0 to 8 percent slopes","Pohakupu",null,100,null,80,0,4,2.6,"none",null,null,"none"]
["HI990","Oahu","PkC",{"$f":"IF('Plant Control IR Template'!$V$2=B1299,C1299,\"\")","v":""},"468500","Pohakupu silty clay loam, 8 to 15 percent slopes","Pohakupu",null,100,null,80,0,12,2.6,"none",null,null,"none"]
["HI990","Oahu","PsA",{"$f":"IF('Plant Control IR Template'!$V$2=B1300,C1300,\"\")","v":""},"468501","Pulehu clay loam, 0 to 3 percent slopes","Pulehu",null,100,null,80,14,2,2.8,"rare, occasional","very brief","January, February, March, November, December","none"]
["HI990","Oahu","PuB",{"$f":"IF('Plant Control IR Template'!$V$2=B1301,C1301,\"\")","v":""},"468502","Pulehu stony clay loam, 2 to 6 percent slopes","Pulehu","stony",100,null,80,27,4,2.8,"rare, occasional","very brief","January, February, March, November, December","none"]
["HI990","Oahu","PvC",{"$f":"IF('Plant Control IR Template'!$V$2=B1302,C1302,\"\")","v":""},"468503","Pulehu very stony clay loam, 0 to 12 percent slopes","Pulehu","very stony",100,null,80,38,6,2.2000000000000002,"rare, occasional","very brief","January, February, March, November, December","none"]
["HI990","Oahu","PYD",{"$f":"IF('Plant Control IR Template'!$V$2=B1303,C1303,\"\")","v":""},"468487","Papaa clay, 6 to 25 percent slopes","Papaa",null,100,"bedrock, paralithic",40,11,16,2.2000000000000002,"none",null,null,"none"]
["HI990","Oahu","PYE",{"$f":"IF('Plant Control IR Template'!$V$2=B1304,C1304,\"\")","v":""},"468488","Papaa clay, 20 to 35 percent slopes","Papaa",null,100,"bedrock, paralithic",40,11,28,2.2000000000000002,"none",null,null,"none"]
["HI990","Oahu","PYF",{"$f":"IF('Plant Control IR Template'!$V$2=B1305,C1305,\"\")","v":""},"468489","Papaa clay, 35 to 70 percent slopes","Papaa",null,100,"bedrock, paralithic",40,11,53,2.2000000000000002,"none",null,null,"none"]
["HI990","Oahu","PZ",{"$f":"IF('Plant Control IR Template'!$V$2=B1306,C1306,\"\")","v":""},"468490","Paumalu-Badland complex","Paumalu",null,50,null,80,0,40,2.2000000000000002,"none",null,null,"none"]
["HI990","Oahu","PZ",{"$f":"IF('Plant Control IR Template'!$V$2=B1307,C1307,\"\")","v":""},"468490","Paumalu-Badland complex","Badland",null,30,"bedrock, paralithic",0,0,40,2,"none",null,null,"none"]
["HI990","Oahu","QU",{"$f":"IF('Plant Control IR Template'!$V$2=B1308,C1308,\"\")","v":""},"468377","Quarry","Quarry",null,100,null,80,0,null,null,"none",null,null,"none"]
["HI990","Oahu","rAAE",{"$f":"IF('Plant Control IR Template'!$V$2=B1309,C1309,\"\")","v":""},"468529","Alakai mucky peat, 0 to 30 percent slopes","Alakai",null,100,"bedrock, paralithic",60,0,15,4.5,"none",null,null,"none"]
["HI990","Oahu","rCI",{"$f":"IF('Plant Control IR Template'!$V$2=B1310,C1310,\"\")","v":""},"468530","Cinder land","Cinder land",null,100,null,80,75,45,0.4,"none",null,null,"none"]
["HI990","Oahu","rRK",{"$f":"IF('Plant Control IR Template'!$V$2=B1311,C1311,\"\")","v":""},"468531","Rock land","Rock land",null,55,"bedrock, lithic",8,11,38,1.1000000000000001,"none",null,null,"none"]
["HI990","Oahu","rRO",{"$f":"IF('Plant Control IR Template'!$V$2=B1312,C1312,\"\")","v":""},"468532","Rock outcrop","Rock outcrop",null,100,"bedrock, lithic",0,0,52,0,"none",null,null,"none"]
["HI990","Oahu","rRT",{"$f":"IF('Plant Control IR Template'!$V$2=B1313,C1313,\"\")","v":""},"468533","Rough mountainous land","Rough mountainous land",null,100,"bedrock, paralithic",25,23,75,2.5,"none",null,null,"none"]
["HI990","Oahu","rST",{"$f":"IF('Plant Control IR Template'!$V$2=B1314,C1314,\"\")","v":""},"468534","Stony land","Stony land",null,100,null,80,72,23,1.8,"none",null,null,"none"]
["HI990","Oahu","rSY",{"$f":"IF('Plant Control IR Template'!$V$2=B1315,C1315,\"\")","v":""},"468535","Stony steep land","Stony steep land",null,100,null,80,74,55,1.8,"none",null,null,"none"]
["HI990","Oahu","rTP",{"$f":"IF('Plant Control IR Template'!$V$2=B1316,C1316,\"\")","v":""},"468536","Tropohumults-Dystrandepts association","Tropohumults",null,50,"placic",57,0,60,2.6,"none",null,null,"none"]
["HI990","Oahu","rTP",{"$f":"IF('Plant Control IR Template'!$V$2=B1317,C1317,\"\")","v":""},"468536","Tropohumults-Dystrandepts association","Dystrandepts",null,30,"bedrock, paralithic",50,10,60,3.5,"none",null,null,"none"]
["HI990","Oahu","TAE",{"$f":"IF('Plant Control IR Template'!$V$2=B1318,C1318,\"\")","v":""},"468504","Tantalus silt loam, 15 to 40 percent slopes","Tantalus",null,100,null,80,10,28,2.8,"none",null,null,"none"]
["HI990","Oahu","TAF",{"$f":"IF('Plant Control IR Template'!$V$2=B1319,C1319,\"\")","v":""},"468505","Tantalus silt loam, 40 to 70 percent slopes","Tantalus",null,100,null,80,10,55,2.8,"none",null,null,"none"]
["HI990","Oahu","TCC",{"$f":"IF('Plant Control IR Template'!$V$2=B1320,C1320,\"\")","v":""},"468506","Tantalus silty clay loam, 8 to 15 percent slopes","Tantalus",null,100,null,80,10,12,2.8,"none",null,null,"none"]
["HI990","Oahu","TCE",{"$f":"IF('Plant Control IR Template'!$V$2=B1321,C1321,\"\")","v":""},"468507","Tantalus silty clay loam, 15 to 40 percent slopes","Tantalus",null,100,null,80,10,28,2.8,"none",null,null,"none"]
["HI990","Oahu","TR",{"$f":"IF('Plant Control IR Template'!$V$2=B1322,C1322,\"\")","v":""},"468508","Tropaquepts","Tropaquepts",null,90,null,80,0,1,3.1,"frequent","long","January, February, March, April, May, June, July, August, September, October, November, December","frequent","long","January, February, March, April, May, June, July, August, September, October, November, December"]
["HI990","Oahu","W",{"$f":"IF('Plant Control IR Template'!$V$2=B1323,C1323,\"\")","v":""},"468509","Water > 40 acres","Water > 40 acres",null,100,null,80,0,null,null,"none",null,null,"none"]
["HI990","Oahu","WaA",{"$f":"IF('Plant Control IR Template'!$V$2=B1324,C1324,\"\")","v":""},"468510","Wahiawa silty clay, 0 to 3 percent slopes","Wahiawa",null,100,null,80,0,2,2.4,"none",null,null,"none"]
["HI990","Oahu","WaB",{"$f":"IF('Plant Control IR Template'!$V$2=B1325,C1325,\"\")","v":""},"468511","Wahiawa silty clay, 3 to 8 percent slopes","Wahiawa",null,100,null,80,0,6,2.4,"none",null,null,"none"]
["HI990","Oahu","WaC",{"$f":"IF('Plant Control IR Template'!$V$2=B1326,C1326,\"\")","v":""},"468512","Wahiawa silty clay, 8 to 15 percent slopes","Wahiawa",null,100,null,80,0,12,2.4,"none",null,null,"none"]
["HI990","Oahu","WaD2",{"$f":"IF('Plant Control IR Template'!$V$2=B1327,C1327,\"\")","v":""},"468513","Wahiawa silty clay, 15 to 25 percent slopes, eroded","Wahiawa",null,100,null,80,0,20,2.4,"none",null,null,"none"]
["HI990","Oahu","WkA",{"$f":"IF('Plant Control IR Template'!$V$2=B1328,C1328,\"\")","v":""},"468514","Waialua silty clay, 0 to 3 percent slopes","Waialua",null,100,null,80,6,2,2.8,"none",null,null,"none"]
["HI990","Oahu","WkB",{"$f":"IF('Plant Control IR Template'!$V$2=B1329,C1329,\"\")","v":""},"468515","Waialua silty clay, 3 to 8 percent slopes","Waialua",null,100,null,80,6,6,2.8,"none",null,null,"none"]
["HI990","Oahu","WlB",{"$f":"IF('Plant Control IR Template'!$V$2=B1330,C1330,\"\")","v":""},"468516","Waialua stony silty clay, 3 to 8 percent slopes","Waialua",null,100,null,80,24,6,2.6,"none",null,null,"none"]
["HI990","Oahu","WlE",{"$f":"IF('Plant Control IR Template'!$V$2=B1331,C1331,\"\")","v":""},"468517","Waialua stony silty clay, 12 to 30 percent slopes","Waialua","stony",100,null,80,24,21,2.6,"none",null,null,"none"]
["HI990","Oahu","WmD",{"$f":"IF('Plant Control IR Template'!$V$2=B1332,C1332,\"\")","v":""},"468518","Waialua very stony silty clay, 12 to 20 percent slopes","Waialua","very stony",100,null,80,37,16,2.6,"none",null,null,"none"]
["HI990","Oahu","WnB",{"$f":"IF('Plant Control IR Template'!$V$2=B1333,C1333,\"\")","v":""},"468519","Waialua clay, 2 to 6 percent slopes","Waialua",null,100,null,80,6,4,2.8,"none",null,null,"none"]
["HI990","Oahu","WpaE",{"$f":"IF('Plant Control IR Template'!$V$2=B1334,C1334,\"\")","v":""},"468525","Waikane stony silty clay, 15 to 30 percent slopes","Waikane","stony",100,null,80,14,23,2.2000000000000002,"none",null,null,"none"]
["HI990","Oahu","WpB",{"$f":"IF('Plant Control IR Template'!$V$2=B1335,C1335,\"\")","v":""},"468520","Waikane silty clay, 3 to 8 percent slopes","Waikane",null,100,null,80,5,6,2.2000000000000002,"none",null,null,"none"]
["HI990","Oahu","WpC",{"$f":"IF('Plant Control IR Template'!$V$2=B1336,C1336,\"\")","v":""},"468521","Waikane silty clay, 8 to 15 percent slopes","Waikane",null,100,null,80,5,12,2.2000000000000002,"none",null,null,"none"]
["HI990","Oahu","WpE",{"$f":"IF('Plant Control IR Template'!$V$2=B1337,C1337,\"\")","v":""},"468522","Waikane silty clay, 25 to 40 percent slopes","Waikane",null,100,null,80,5,33,2.2000000000000002,"none",null,null,"none"]
["HI990","Oahu","WpF",{"$f":"IF('Plant Control IR Template'!$V$2=B1338,C1338,\"\")","v":""},"468523","Waikane silty clay, 40 to 70 percent slopes","Waikane",null,100,null,80,5,55,2.2000000000000002,"none",null,null,"none"]
["HI990","Oahu","WpF2",{"$f":"IF('Plant Control IR Template'!$V$2=B1339,C1339,\"\")","v":""},"468524","Waikane silty clay, 40 to 70 percent slopes, eroded","Waikane",null,100,null,80,6,55,2.2000000000000002,"none",null,null,"none"]
["HI990","Oahu","WzA",{"$f":"IF('Plant Control IR Template'!$V$2=B1340,C1340,\"\")","v":""},"468526","Waipahu silty clay, 0 to 2 percent slopes","Waipahu",null,100,null,80,4,1,2.4,"rare","very brief",null,"none"]
["HI990","Oahu","WzB",{"$f":"IF('Plant Control IR Template'!$V$2=B1341,C1341,\"\")","v":""},"468527","Waipahu silty clay, 2 to 6 percent slopes","Waipahu",null,100,null,80,4,4,2.4,"rare","very brief",null,"none"]
["HI990","Oahu","WzC",{"$f":"IF('Plant Control IR Template'!$V$2=B1342,C1342,\"\")","v":""},"468528","Waipahu silty clay, 6 to 12 percent slopes","Waipahu",null,100,null,80,4,9,2.4,"none",null,null,"none"]
["HI995","Kahoolawe",1,{"$f":"IF('Plant Control IR Template'!$V$2=B1343,C1343,\"\")","v":""},"1909490","Typic Torriorthents, badlands-Typic Haplotorrox-Rock outcrop complex,10 to 30 percent slopes","Typic Torriorthents","badland",40,null,80,10,20,2.4,"none",null,null,"none"]
["HI995","Kahoolawe",1,{"$f":"IF('Plant Control IR Template'!$V$2=B1344,C1344,\"\")","v":""},"1909490","Typic Torriorthents, badlands-Typic Haplotorrox-Rock outcrop complex,10 to 30 percent slopes","Typic Haplotorrox",null,35,null,80,4,20,3.1,"none",null,null,"none"]
["HI995","Kahoolawe",1,{"$f":"IF('Plant Control IR Template'!$V$2=B1345,C1345,\"\")","v":""},"1909490","Typic Torriorthents, badlands-Typic Haplotorrox-Rock outcrop complex,10 to 30 percent slopes","Rock outcrop",null,25,"bedrock, lithic",0,0,20,0,"none",null,null,"none"]
["HI995","Kahoolawe",2,{"$f":"IF('Plant Control IR Template'!$V$2=B1346,C1346,\"\")","v":""},"1909491","Typic Torriorthents, badlands-Typic Torriorthents, eolian, complex,5 to 25 percent slopes","Typic Torriorthents","badland",50,null,80,10,15,2.4,"none",null,null,"none"]
["HI995","Kahoolawe",2,{"$f":"IF('Plant Control IR Template'!$V$2=B1347,C1347,\"\")","v":""},"1909491","Typic Torriorthents, badlands-Typic Torriorthents, eolian, complex,5 to 25 percent slopes","Typic Torriorthents","eolian",30,null,80,4,15,3,"none",null,null,"none"]
["HI995","Kahoolawe",4,{"$f":"IF('Plant Control IR Template'!$V$2=B1348,C1348,\"\")","v":""},"1909493","Beaches, 0 to 5 percent slopes","Beaches",null,95,null,80,0,3,1.1000000000000001,"rare","very brief",null,"none"]
["HI995","Kahoolawe",5,{"$f":"IF('Plant Control IR Template'!$V$2=B1349,C1349,\"\")","v":""},"1909494","Typic Haplotorrox, 5 to 15 percent slopes","Typic Haplotorrox",null,90,null,80,4,11,3.1,"none",null,null,"none"]
["HI995","Kahoolawe",6,{"$f":"IF('Plant Control IR Template'!$V$2=B1350,C1350,\"\")","v":""},"1909495","Typic Haplotorrox, wind polished, 3 to12 percent slopes","Typic Haplotorrox","wind polished",80,null,80,5,6,2.4,"none",null,null,"none"]
["HI995","Kahoolawe",7,{"$f":"IF('Plant Control IR Template'!$V$2=B1351,C1351,\"\")","v":""},"1909496","Typic Haplotorrox, wind polished, 12 to 20 percent slopes","Typic Haplotorrox","wind polished",80,null,80,5,16,2.4,"none",null,null,"none"]
["HI995","Kahoolawe",8,{"$f":"IF('Plant Control IR Template'!$V$2=B1352,C1352,\"\")","v":""},"1909497","Typic Haplotorrox, wind polished-Typic Torriorthents, badlands, complex, 3 to 12 percent slopes","Typic Haplotorrox","wind polished",40,null,80,5,8,2.4,"none",null,null,"none"]
["HI995","Kahoolawe",8,{"$f":"IF('Plant Control IR Template'!$V$2=B1353,C1353,\"\")","v":""},"1909497","Typic Haplotorrox, wind polished-Typic Torriorthents, badlands, complex, 3 to 12 percent slopes","Typic Torriorthents","badland",40,null,80,10,8,2.4,"none",null,null,"none"]
["HI995","Kahoolawe",9,{"$f":"IF('Plant Control IR Template'!$V$2=B1354,C1354,\"\")","v":""},"1909498","Typic Torriorthents, eolian, 3 to 15 percent slopes","Typic Torriorthents","eolian",80,null,80,4,8,3,"none",null,null,"none"]
["HI995","Kahoolawe",11,{"$f":"IF('Plant Control IR Template'!$V$2=B1355,C1355,\"\")","v":""},"1909500","Typic Torriorthents, eolian, 15 to 30 percent slopes","Typic Torriorthents","eolian",80,null,80,4,22,3,"none",null,null,"none"]
["HI995","Kahoolawe",12,{"$f":"IF('Plant Control IR Template'!$V$2=B1356,C1356,\"\")","v":""},"1909501","Typic Haplotorrerts, extremely stony, 3 to 15 percent slopes","Typic Haplotorrerts",null,80,null,80,8,10,1.8,"none",null,null,"none"]
["HI995","Kahoolawe",13,{"$f":"IF('Plant Control IR Template'!$V$2=B1357,C1357,\"\")","v":""},"1909502","Typic Torrifluvents, 0 to 6 percent slopes","Typic Torrifluvents",null,85,null,80,6,2,2.4,"rare, occasional","very brief","January, February, March, April, November, December","frequent",",long","January, February, March, April, November, December"]
["HI995","Kahoolawe",14,{"$f":"IF('Plant Control IR Template'!$V$2=B1358,C1358,\"\")","v":""},"1909503","Typic Haplocambids, moderately deep, 3 to 12 percent slopes","Typic Haplocambids","moderately deep",80,"bedrock, lithic",31,6,5,1.9,"none",null,null,"none"]
["HI995","Kahoolawe",15,{"$f":"IF('Plant Control IR Template'!$V$2=B1359,C1359,\"\")","v":""},"1909504","Typic Haplocambids, moderately deep-Rock outcrop complex, 5 to 20 percent slopes","Typic Haplocambids","moderately deep",60,"bedrock, lithic",31,6,11,1.9,"none",null,null,"none"]
["HI995","Kahoolawe",15,{"$f":"IF('Plant Control IR Template'!$V$2=B1360,C1360,\"\")","v":""},"1909504","Typic Haplocambids, moderately deep-Rock outcrop complex, 5 to 20 percent slopes","Rock outcrop",null,30,"bedrock, lithic",0,0,11,0,"none",null,null,"none"]
["HI995","Kahoolawe",16,{"$f":"IF('Plant Control IR Template'!$V$2=B1361,C1361,\"\")","v":""},"1909505","Typic Haplotorrox, windblown, 3 to 12 percent slopes","Typic Haplotorrox","wind blown",90,null,80,5,6,2.4,"none",null,null,"none"]
["HI995","Kahoolawe",17,{"$f":"IF('Plant Control IR Template'!$V$2=B1362,C1362,\"\")","v":""},"1909506","Typic Haplotorrox, windblown, 8 to 20 percent slopes","Typic Haplotorrox","wind blown",90,null,80,5,11,2.4,"none",null,null,"none"]
["HI995","Kahoolawe",18,{"$f":"IF('Plant Control IR Template'!$V$2=B1363,C1363,\"\")","v":""},"1909507","Typic Haplotorrox, black subsoil, 8 to 20 percent slopes, gullied","Typic Haplotorrox","black subsoil",85,null,80,5,11,2.4,"none",null,null,"none"]
["HI995","Kahoolawe",19,{"$f":"IF('Plant Control IR Template'!$V$2=B1364,C1364,\"\")","v":""},"1909508","Typic Haplotorrox, windblown, 3 to 8 percent slopes, hummocky","Typic Haplotorrox","wind blown",85,null,80,5,6,2.4,"none",null,null,"none"]
["HI995","Kahoolawe",20,{"$f":"IF('Plant Control IR Template'!$V$2=B1365,C1365,\"\")","v":""},"1909509","Rock outcrop-Lithic Torriorthents complex, 50 to 150 percent slopes","Rock outcrop",null,80,"bedrock, lithic",0,0,100,0,"none",null,null,"none"]
["HI995","Kahoolawe",20,{"$f":"IF('Plant Control IR Template'!$V$2=B1366,C1366,\"\")","v":""},"1909509","Rock outcrop-Lithic Torriorthents complex, 50 to 150 percent slopes","Lithic Torriorthents","extremely stony",20,"bedrock, lithic",16,0,100,1.5,"none",null,null,"none"]
["HI995","Kahoolawe",21,{"$f":"IF('Plant Control IR Template'!$V$2=B1367,C1367,\"\")","v":""},"1909510","Rock outcrop-Typic Haplotorrerts complex, 8 to 20 percent slopes","Rock outcrop",null,60,"bedrock, lithic",0,0,15,0,"none",null,null,"none"]
["HI995","Kahoolawe",21,{"$f":"IF('Plant Control IR Template'!$V$2=B1368,C1368,\"\")","v":""},"1909510","Rock outcrop-Typic Haplotorrerts complex, 8 to 20 percent slopes","Typic Haplotorrerts",null,35,null,80,8,15,1.8,"none",null,null,"none"]
["HI995","Kahoolawe",22,{"$f":"IF('Plant Control IR Template'!$V$2=B1369,C1369,\"\")","v":""},"1909511","Rock outcrop-Typic Haplocambid, moderately deep, complex, 12 to 25 percent slopes","Rock outcrop",null,55,"bedrock, lithic",0,0,18,0,"none",null,null,"none"]
["HI995","Kahoolawe",22,{"$f":"IF('Plant Control IR Template'!$V$2=B1370,C1370,\"\")","v":""},"1909511","Rock outcrop-Typic Haplocambid, moderately deep, complex, 12 to 25 percent slopes","Typic Haplocambids","moderately deep",45,"bedrock, lithic",31,6,18,1.9,"none",null,null,"none"]
["HI995","Kahoolawe",23,{"$f":"IF('Plant Control IR Template'!$V$2=B1371,C1371,\"\")","v":""},"1909879","Lithic Torriorthents-Rock outcrop complex, 5 to 15 percent slopes","Lithic Torriorthents","extremely stony",70,"bedrock, lithic",16,0,10,1.5,"none",null,null,"none"]
["HI995","Kahoolawe",23,{"$f":"IF('Plant Control IR Template'!$V$2=B1372,C1372,\"\")","v":""},"1909879","Lithic Torriorthents-Rock outcrop complex, 5 to 15 percent slopes","Rock outcrop",null,30,"bedrock, lithic",0,0,10,0,"none",null,null,"none"]
["HI995","Kahoolawe",24,{"$f":"IF('Plant Control IR Template'!$V$2=B1373,C1373,\"\")","v":""},"1909880","Lithic Torriorthents-Rock outcrop complex, 15 to 30 percent slopes","Lithic Torriorthents","extremely stony",55,"bedrock, lithic",16,0,25,1.5,"none",null,null,"none"]
["HI995","Kahoolawe",24,{"$f":"IF('Plant Control IR Template'!$V$2=B1374,C1374,\"\")","v":""},"1909880","Lithic Torriorthents-Rock outcrop complex, 15 to 30 percent slopes","Rock outcrop",null,45,"bedrock, lithic",0,0,25,0,"none",null,null,"none"]
["HI995","Kahoolawe",25,{"$f":"IF('Plant Control IR Template'!$V$2=B1375,C1375,\"\")","v":""},"1909881","Rock outcrop-Lithic Torriorthents complex, 30 to 50 percent slopes","Rock outcrop",null,60,"bedrock, lithic",0,0,40,0,"none",null,null,"none"]
["HI995","Kahoolawe",25,{"$f":"IF('Plant Control IR Template'!$V$2=B1376,C1376,\"\")","v":""},"1909881","Rock outcrop-Lithic Torriorthents complex, 30 to 50 percent slopes","Lithic Torriorthents","extremely stony",40,"bedrock, lithic",16,0,40,1.5,"none",null,null,"none"]
["HI995","Kahoolawe",26,{"$f":"IF('Plant Control IR Template'!$V$2=B1377,C1377,\"\")","v":""},"1909882","Rubble land, 3 to 12 percent slopes","Rubble land",null,85,null,80,80,8,1,"none",null,null,"none"]
["HI995","Kahoolawe",27,{"$f":"IF('Plant Control IR Template'!$V$2=B1378,C1378,\"\")","v":""},"1909883","Typic Torriorthents, saprolite-Rock outcrop complex, 5 to 20 percent slopes","Typic Torriorthents","saprolite",80,null,80,10,11,2.4,"none",null,null,"none"]
["HI995","Kahoolawe",27,{"$f":"IF('Plant Control IR Template'!$V$2=B1379,C1379,\"\")","v":""},"1909883","Typic Torriorthents, saprolite-Rock outcrop complex, 5 to 20 percent slopes","Rock outcrop",null,20,null,80,0,10,0,"none",null,null,"none"]
["HI995","Kahoolawe",28,{"$f":"IF('Plant Control IR Template'!$V$2=B1380,C1380,\"\")","v":""},"1909884","Typic Haplotorrerts, excavated-Urban Land complex, 0 to 8 percent slopes","Typic Haplotorrerts","excavated",80,null,80,8,4,1.8,"none",null,null,"none"]
["HI995","Kahoolawe",28,{"$f":"IF('Plant Control IR Template'!$V$2=B1381,C1381,\"\")","v":""},"1909884","Typic Haplotorrerts, excavated-Urban Land complex, 0 to 8 percent slopes","Urban land",null,20,"human-manufactured materials",0,0,4,0,"none",null,null,"none"]
["HI995","Kahoolawe",29,{"$f":"IF('Plant Control IR Template'!$V$2=B1382,C1382,\"\")","v":""},"1909885","Typic Haplocambids,deep, 3  to 12 percent slopes","Typic Haplocambids","deep",80,"bedrock, lithic",50,7,5,2.7,"none",null,null,"none"]
["HI995","Kahoolawe",30,{"$f":"IF('Plant Control IR Template'!$V$2=B1383,C1383,\"\")","v":""},"1909886","Typic Haplocambids,deep,  8 to 20 percent slopes","Typic Haplocambids","deep",80,"bedrock, lithic",50,7,15,2.7,"none",null,null,"none"]
["HI995","Kahoolawe",31,{"$f":"IF('Plant Control IR Template'!$V$2=B1384,C1384,\"\")","v":""},"1909887","Typic Haplocambids, deep-Typic Haplocambids, moderately deep complex, 3 to 8 percent slopes","Typic Haplocambids","deep",55,"bedrock, lithic",50,7,5,2.7,"none",null,null,"none"]
["HI995","Kahoolawe",31,{"$f":"IF('Plant Control IR Template'!$V$2=B1385,C1385,\"\")","v":""},"1909887","Typic Haplocambids, deep-Typic Haplocambids, moderately deep complex, 3 to 8 percent slopes","Typic Haplocambids","moderately deep",40,"bedrock, lithic",31,6,5,1.9,"none",null,null,"none"]
["HI995","Kahoolawe",32,{"$f":"IF('Plant Control IR Template'!$V$2=B1386,C1386,\"\")","v":""},"1909888","Typic Haplotorrox, dark surface, 3 to 8 percent slopes, severely eroded","Typic Haplotorrox dark surface",null,85,null,80,6,5,2,"none",null,null,"none"]
["PB630","American Samoa",1,{"$f":"IF('Plant Control IR Template'!$V$2=B1387,C1387,\"\")","v":""},"465394","Aua very stony silty clay loam, 15 to 30 percent slopes","AUA",null,85,null,80,34,23,2.5,"none",null,null,"none"]
["PB630","American Samoa",2,{"$f":"IF('Plant Control IR Template'!$V$2=B1388,C1388,\"\")","v":""},"465405","Aua very stony silty clay loam, 30 to 60 percent slopes","AUA",null,85,null,80,34,45,2.5,"none",null,null,"none"]
["PB630","American Samoa",3,{"$f":"IF('Plant Control IR Template'!$V$2=B1389,C1389,\"\")","v":""},"465416","Fagasa-Ofu silty clays, 30 to 60 percent slopes","FAGASA",null,50,"bedrock, paralithic",29,24,45,2.6,"none",null,null,"none"]
["PB630","American Samoa",3,{"$f":"IF('Plant Control IR Template'!$V$2=B1390,C1390,\"\")","v":""},"465416","Fagasa-Ofu silty clays, 30 to 60 percent slopes","OFU",null,35,null,80,0,45,2.6,"none",null,null,"none"]
["PB630","American Samoa",4,{"$f":"IF('Plant Control IR Template'!$V$2=B1391,C1391,\"\")","v":""},"465423","Fagasa family-Lithic Hapludolls-Rock outcrop association, very steep","FAGASA",null,50,"bedrock, paralithic",29,19,73,2.6,"none",null,null,"none"]
["PB630","American Samoa",4,{"$f":"IF('Plant Control IR Template'!$V$2=B1392,C1392,\"\")","v":""},"465423","Fagasa family-Lithic Hapludolls-Rock outcrop association, very steep","ROCK OUTCROP",null,15,"bedrock, lithic",0,0,85,0,"none",null,null,"none"]
["PB630","American Samoa",5,{"$f":"IF('Plant Control IR Template'!$V$2=B1393,C1393,\"\")","v":""},"465424","Iliili extremely stony mucky clay loam, 3 to 15 percent slopes","ILIILI",null,90,"bedrock, lithic",9,44,9,1.1000000000000001,"none",null,null,"none"]
["PB630","American Samoa",6,{"$f":"IF('Plant Control IR Template'!$V$2=B1394,C1394,\"\")","v":""},"465425","Insak mucky sandy loam","INSAK",null,95,"bedrock, lithic",26,13,1,2,"frequent","very long","January, February, March, April, May, June, July, August, September, October, November, December","rare","very long"]
["PB630","American Samoa",7,{"$f":"IF('Plant Control IR Template'!$V$2=B1395,C1395,\"\")","v":""},"465426","Insak variant clay loam","INSAK VARIANT",null,95,null,80,5,1,2.6,"none, occasional",",brief","January, February, March, October, November, December","none"]
["PB630","American Samoa",8,{"$f":"IF('Plant Control IR Template'!$V$2=B1396,C1396,\"\")","v":""},"465427","Leafu silty clay, 0 to 3 percent slopes","LEAFU",null,95,null,80,2,2,2.9,"occasional, none","brief,","January, February, March, April, May, October, November, December","none"]
["PB630","American Samoa",9,{"$f":"IF('Plant Control IR Template'!$V$2=B1397,C1397,\"\")","v":""},"465428","Leafu stony silty clay, 0 to 3 percent slopes","LEAFU","stony",95,null,80,16,2,2.7,"occasional, none","brief,","January, February, March, April, May, October, November, December","none"]
["PB630","American Samoa",10,{"$f":"IF('Plant Control IR Template'!$V$2=B1398,C1398,\"\")","v":""},"465395","Mesei variant peat","MESEI VARIANT",null,95,null,80,0,1,4.9000000000000004,"frequent","very long","January, February, March, April, May, June, July, August, September, October, November, December","none","very long"]
["PB630","American Samoa",11,{"$f":"IF('Plant Control IR Template'!$V$2=B1399,C1399,\"\")","v":""},"465396","Ngedebus mucky sand","NGEDEBUS",null,95,null,80,26,1,1.5,"occasional","very brief","January, February, March, April, May, June, July, August, September, October, November, December","none"]
["PB630","American Samoa",12,{"$f":"IF('Plant Control IR Template'!$V$2=B1400,C1400,\"\")","v":""},"465397","Ngedebus variant extremely cobbly sand, 0 to 5 percent slopes","NGEDEBUS VARIANT",null,95,null,80,51,3,0.6,"occasional","very brief","January, February, March, April, May, June, July, August, September, October, November, December","none"]
["PB630","American Samoa",13,{"$f":"IF('Plant Control IR Template'!$V$2=B1401,C1401,\"\")","v":""},"465398","Ngerungor variant mucky peat","NGERUNGOR VARIANT",null,95,null,80,0,1,4.9000000000000004,"frequent","long","January, February, March, April, May, June, July, August, September, October, November, December","none","very long"]
["PB630","American Samoa",14,{"$f":"IF('Plant Control IR Template'!$V$2=B1402,C1402,\"\")","v":""},"465399","Ofu silty clay, 15 to 40 percent slopes","OFU",null,90,null,80,0,28,2.6,"none",null,null,"none"]
["PB630","American Samoa",15,{"$f":"IF('Plant Control IR Template'!$V$2=B1403,C1403,\"\")","v":""},"465400","Ofu silty clay, 40 to 70 percent slopes","OFU",null,80,null,80,0,55,2.6,"none",null,null,"none"]
["PB630","American Samoa",16,{"$f":"IF('Plant Control IR Template'!$V$2=B1404,C1404,\"\")","v":""},"465401","Ofu variant silty clay, 6 to 20 percent slopes","OFU VARIANT",null,90,null,80,0,13,2.6,"none",null,null,"none"]
["PB630","American Samoa",17,{"$f":"IF('Plant Control IR Template'!$V$2=B1405,C1405,\"\")","v":""},"465402","Ofu variant silty clay, 20 to 40 percent slopes","OFU VARIANT",null,90,null,80,0,30,2.6,"none",null,null,"none"]
["PB630","American Samoa",18,{"$f":"IF('Plant Control IR Template'!$V$2=B1406,C1406,\"\")","v":""},"465403","Ofu variant-Rock outcrop complex, 40 to 70 percent slopes","OFU VARIANT",null,65,null,80,0,55,2.6,"none",null,null,"none"]
["PB630","American Samoa",18,{"$f":"IF('Plant Control IR Template'!$V$2=B1407,C1407,\"\")","v":""},"465403","Ofu variant-Rock outcrop complex, 40 to 70 percent slopes","ROCK OUTCROP",null,25,"bedrock, lithic",0,0,55,0,"none",null,null,"none"]
["PB630","American Samoa",19,{"$f":"IF('Plant Control IR Template'!$V$2=B1408,C1408,\"\")","v":""},"465404","Oloava silty clay loam, 6 to 12 percent slopes","OLOAVA",null,90,"strongly contrasting textural stratification",14,6,9,2.2999999999999998,"none",null,null,"none"]
["PB630","American Samoa",20,{"$f":"IF('Plant Control IR Template'!$V$2=B1409,C1409,\"\")","v":""},"465406","Oloava silty clay loam, 12 to 25 percent slopes","OLOAVA",null,90,"strongly contrasting textural stratification",14,6,19,2.2999999999999998,"none",null,null,"none"]
["PB630","American Samoa",21,{"$f":"IF('Plant Control IR Template'!$V$2=B1410,C1410,\"\")","v":""},"465407","Oloava silty clay loam, 40 to 100 percent slopes","OLOAVA",null,90,"strongly contrasting textural stratification",14,6,43,2.1,"none",null,null,"none"]
["PB630","American Samoa",22,{"$f":"IF('Plant Control IR Template'!$V$2=B1411,C1411,\"\")","v":""},"465408","Olotania family, 15 to 40 percent slopes","OLOTANIA",null,85,"bedrock, paralithic",35,8,28,3.1,"none",null,null,"none"]
["PB630","American Samoa",23,{"$f":"IF('Plant Control IR Template'!$V$2=B1412,C1412,\"\")","v":""},"465409","Pavaiai stony clay loam, 6 to 12 percent slopes","PAVAIAI",null,85,"bedrock, lithic",38,15,9,3.3,"none",null,null,"none"]
["PB630","American Samoa",24,{"$f":"IF('Plant Control IR Template'!$V$2=B1413,C1413,\"\")","v":""},"465410","Pavaiai stony clay loam, 12 to 25 percent slopes","PAVAIAI",null,85,"bedrock, lithic",38,15,19,3.3,"none",null,null,"none"]
["PB630","American Samoa",25,{"$f":"IF('Plant Control IR Template'!$V$2=B1414,C1414,\"\")","v":""},"465411","Pavaiai stony clay loam, 25 to 40 percent slopes","PAVAIAI",null,85,"bedrock, lithic",30,18,33,2.4,"none",null,null,"none"]
["PB630","American Samoa",26,{"$f":"IF('Plant Control IR Template'!$V$2=B1415,C1415,\"\")","v":""},"465412","Puapua-Rock outcrop complex, 40 to 100 percent slopes","PUAPUA",null,50,"bedrock, paralithic",16,5,43,3.6,"none",null,null,"none"]
["PB630","American Samoa",26,{"$f":"IF('Plant Control IR Template'!$V$2=B1416,C1416,\"\")","v":""},"465412","Puapua-Rock outcrop complex, 40 to 100 percent slopes","ROCK OUTCROP",null,30,"bedrock, lithic",0,0,70,0,"none",null,null,"none"]
["PB630","American Samoa",27,{"$f":"IF('Plant Control IR Template'!$V$2=B1417,C1417,\"\")","v":""},"465413","Rock outcrop-Hydrandepts-Dystrandepts association, very steep","ROCK OUTCROP",null,35,"bedrock, lithic",0,0,85,0,"none",null,null,"none"]
["PB630","American Samoa",27,{"$f":"IF('Plant Control IR Template'!$V$2=B1418,C1418,\"\")","v":""},"465413","Rock outcrop-Hydrandepts-Dystrandepts association, very steep","HYDRUDANDS",null,30,"bedrock, paralithic",30,10,85,3,"none",null,null,"none"]
["PB630","American Samoa",27,{"$f":"IF('Plant Control IR Template'!$V$2=B1419,C1419,\"\")","v":""},"465413","Rock outcrop-Hydrandepts-Dystrandepts association, very steep","DYSTRANDEPTS",null,25,"bedrock, paralithic",30,10,85,3,"none",null,null,"none"]
["PB630","American Samoa",28,{"$f":"IF('Plant Control IR Template'!$V$2=B1420,C1420,\"\")","v":""},"465414","Sogi-Puapua clay loams, 0 to 6 percent slopes","SOGI",null,50,"bedrock, paralithic",26,5,3,4.7,"none",null,null,"none"]
["PB630","American Samoa",28,{"$f":"IF('Plant Control IR Template'!$V$2=B1421,C1421,\"\")","v":""},"465414","Sogi-Puapua clay loams, 0 to 6 percent slopes","PUAPUA",null,35,"bedrock, paralithic",16,5,3,3.6,"none",null,null,"none"]
["PB630","American Samoa",29,{"$f":"IF('Plant Control IR Template'!$V$2=B1422,C1422,\"\")","v":""},"465415","Sogi-Puapua clay loams, 6 to 20 percent slopes","SOGI",null,45,"bedrock, paralithic",26,5,13,4.7,"none",null,null,"none"]
["PB630","American Samoa",29,{"$f":"IF('Plant Control IR Template'!$V$2=B1423,C1423,\"\")","v":""},"465415","Sogi-Puapua clay loams, 6 to 20 percent slopes","PUAPUA",null,40,"bedrock, paralithic",16,5,13,3.6,"none",null,null,"none"]
["PB630","American Samoa",30,{"$f":"IF('Plant Control IR Template'!$V$2=B1424,C1424,\"\")","v":""},"465417","Sogi-Puapua clay loams, 20 to 40 percent slopes","SOGI",null,45,"bedrock, paralithic",27,5,30,3.8,"none",null,null,"none"]
["PB630","American Samoa",30,{"$f":"IF('Plant Control IR Template'!$V$2=B1425,C1425,\"\")","v":""},"465417","Sogi-Puapua clay loams, 20 to 40 percent slopes","PUAPUA",null,40,"bedrock, paralithic",16,5,30,3.6,"none",null,null,"none"]
["PB630","American Samoa",31,{"$f":"IF('Plant Control IR Template'!$V$2=B1426,C1426,\"\")","v":""},"465418","Sogi variant-Pavaiai association, 15 to 50 percent slope","SOGI VARIANT",null,50,"bedrock, lithic",30,0,35,2.6,"none",null,null,"none"]
["PB630","American Samoa",31,{"$f":"IF('Plant Control IR Template'!$V$2=B1427,C1427,\"\")","v":""},"465418","Sogi variant-Pavaiai association, 15 to 50 percent slope","PAVAIAI",null,40,"bedrock, lithic",30,18,28,2.4,"none",null,null,"none"]
["PB630","American Samoa",32,{"$f":"IF('Plant Control IR Template'!$V$2=B1428,C1428,\"\")","v":""},"465419","Tafuna extremely stony muck, 3 to 15 percent slopes","TAFUNA",null,80,"bedrock, lithic",43,57,9,2.4,"none",null,null,"none"]
["PB630","American Samoa",33,{"$f":"IF('Plant Control IR Template'!$V$2=B1429,C1429,\"\")","v":""},"465420","Troporthents, 0 to 6 percent slopes","TROPORTHENTS",null,90,null,80,0,3,0,"none",null,null,"none"]
["PB630","American Samoa",34,{"$f":"IF('Plant Control IR Template'!$V$2=B1430,C1430,\"\")","v":""},"465421","Urban land-Aua-Leafu complex, 0 to 30 percent slopes","URBAN LAND",null,55,null,80,0,3,0,"none",null,null,"none"]
["PB630","American Samoa",34,{"$f":"IF('Plant Control IR Template'!$V$2=B1431,C1431,\"\")","v":""},"465421","Urban land-Aua-Leafu complex, 0 to 30 percent slopes","AUA",null,30,null,80,34,18,2.5,"none",null,null,"none"]
["PB630","American Samoa",34,{"$f":"IF('Plant Control IR Template'!$V$2=B1432,C1432,\"\")","v":""},"465421","Urban land-Aua-Leafu complex, 0 to 30 percent slopes","LEAFU",null,12,null,80,2,3,2.6,"occasional, none","brief,","January, February, March, April, May, October, November, December","none"]
["PB630","American Samoa",35,{"$f":"IF('Plant Control IR Template'!$V$2=B1433,C1433,\"\")","v":""},"465422","Urban land-Ngedebus complex","URBAN LAND",null,55,null,80,0,3,0,"none",null,null,"none"]
["PB630","American Samoa",35,{"$f":"IF('Plant Control IR Template'!$V$2=B1434,C1434,\"\")","v":""},"465422","Urban land-Ngedebus complex","NGEDEBUS",null,40,null,80,21,3,1.2,"occasional","very brief","January, February, March, April, May, June, July, August, September, October, November, December","none"]
["PB630","American Samoa","W",{"$f":"IF('Plant Control IR Template'!$V$2=B1435,C1435,\"\")","v":""},"465429","Water","Water",null,100,null,80,0,null,null,"none",null,null,"none"]
["PB640","Guam",1,{"$f":"IF('Plant Control IR Template'!$V$2=B1436,C1436,\"\")","v":""},"465524","Agfayan clay, 15 to 30 percent slopes","Agfayan",null,85,"bedrock, paralithic",14,9,23,2.4,"none",null,null,"none"]
["PB640","Guam",2,{"$f":"IF('Plant Control IR Template'!$V$2=B1437,C1437,\"\")","v":""},"465535","Agfayan clay, 30 to 60 percent slopes","Agfayan",null,85,"bedrock, paralithic",14,0,45,2.4,"none",null,null,"none"]
["PB640","Guam",3,{"$f":"IF('Plant Control IR Template'!$V$2=B1438,C1438,\"\")","v":""},"465546","Agfayan-Rock outcrop complex, 7 to 15 percent slopes","Agfayan",null,60,"bedrock, paralithic",14,0,11,2.4,"none",null,null,"none"]
["PB640","Guam",3,{"$f":"IF('Plant Control IR Template'!$V$2=B1439,C1439,\"\")","v":""},"465546","Agfayan-Rock outcrop complex, 7 to 15 percent slopes","Rock outcrop",null,20,"bedrock, lithic",0,0,11,0,"none",null,null,"none"]
["PB640","Guam",4,{"$f":"IF('Plant Control IR Template'!$V$2=B1440,C1440,\"\")","v":""},"465557","Agfayan-Rock outcrop complex, 15 to 30 percent slopes","Agfayan",null,60,"bedrock, paralithic",14,0,23,2.4,"none",null,null,"none"]
["PB640","Guam",4,{"$f":"IF('Plant Control IR Template'!$V$2=B1441,C1441,\"\")","v":""},"465557","Agfayan-Rock outcrop complex, 15 to 30 percent slopes","Rock outcrop",null,20,"bedrock, lithic",0,0,23,0,"none",null,null,"none"]
["PB640","Guam",5,{"$f":"IF('Plant Control IR Template'!$V$2=B1442,C1442,\"\")","v":""},"465568","Agfayan-Rock outcrop complex, 30 to 60 percent slopes","Agfayan",null,65,"bedrock, paralithic",14,0,45,2.4,"none",null,null,"none"]
["PB640","Guam",5,{"$f":"IF('Plant Control IR Template'!$V$2=B1443,C1443,\"\")","v":""},"465568","Agfayan-Rock outcrop complex, 30 to 60 percent slopes","Rock outcrop",null,25,"bedrock, lithic",0,0,45,0,"none",null,null,"none"]
["PB640","Guam",6,{"$f":"IF('Plant Control IR Template'!$V$2=B1444,C1444,\"\")","v":""},"465576","Agfayan-Akina association, extremely steep","Agfayan",null,60,"bedrock, paralithic",14,0,65,2.4,"none",null,null,"none"]
["PB640","Guam",6,{"$f":"IF('Plant Control IR Template'!$V$2=B1445,C1445,\"\")","v":""},"465576","Agfayan-Akina association, extremely steep","Akina",null,30,"bedrock, paralithic",24,4,65,2.2000000000000002,"none",null,null,"none"]
["PB640","Guam",7,{"$f":"IF('Plant Control IR Template'!$V$2=B1446,C1446,\"\")","v":""},"465577","Agfayan-Akina-Rock outcrop association, extremely steep","Agfayan",null,50,"bedrock, paralithic",14,0,60,2.4,"none",null,null,"none"]
["PB640","Guam",7,{"$f":"IF('Plant Control IR Template'!$V$2=B1447,C1447,\"\")","v":""},"465577","Agfayan-Akina-Rock outcrop association, extremely steep","Akina",null,25,"bedrock, paralithic",24,0,60,2.2000000000000002,"none",null,null,"none"]
["PB640","Guam",7,{"$f":"IF('Plant Control IR Template'!$V$2=B1448,C1448,\"\")","v":""},"465577","Agfayan-Akina-Rock outcrop association, extremely steep","Rock outcrop",null,20,"bedrock, lithic",0,0,60,0,"none",null,null,"none"]
["PB640","Guam",8,{"$f":"IF('Plant Control IR Template'!$V$2=B1449,C1449,\"\")","v":""},"465578","Akina silty clay, 3 to 7 percent slopes","Akina",null,90,"bedrock, paralithic",24,0,5,2.2000000000000002,"none",null,null,"none"]
["PB640","Guam",9,{"$f":"IF('Plant Control IR Template'!$V$2=B1450,C1450,\"\")","v":""},"465579","Akina silty clay 7 to 15 percent slopes","Akina",null,90,"bedrock, paralithic",24,0,11,2.2000000000000002,"none",null,null,"none"]
["PB640","Guam",10,{"$f":"IF('Plant Control IR Template'!$V$2=B1451,C1451,\"\")","v":""},"465525","Akina silty clay, 15 to 30 percent slopes","Akina",null,90,"bedrock, paralithic",24,0,23,2.2000000000000002,"none",null,null,"none"]
["PB640","Guam",11,{"$f":"IF('Plant Control IR Template'!$V$2=B1452,C1452,\"\")","v":""},"465526","Akina slity clay, 30 to 60 percent slopes","Akina",null,90,"bedrock, paralithic",24,0,45,2.2000000000000002,"none",null,null,"none"]
["PB640","Guam",12,{"$f":"IF('Plant Control IR Template'!$V$2=B1453,C1453,\"\")","v":""},"465527","Akina-Agfayan association, steep","Akina",null,50,"bedrock, paralithic",24,0,45,2.2000000000000002,"none",null,null,"none"]
["PB640","Guam",12,{"$f":"IF('Plant Control IR Template'!$V$2=B1454,C1454,\"\")","v":""},"465527","Akina-Agfayan association, steep","Agfayan",null,30,"bedrock, paralithic",14,0,45,2.4,"none",null,null,"none"]
["PB640","Guam",13,{"$f":"IF('Plant Control IR Template'!$V$2=B1455,C1455,\"\")","v":""},"465528","Akina-Atate slity clays, 0 to 7 percent slopes","Akina",null,50,"bedrock, paralithic",24,0,4,2.2000000000000002,"none",null,null,"none"]
["PB640","Guam",13,{"$f":"IF('Plant Control IR Template'!$V$2=B1456,C1456,\"\")","v":""},"465528","Akina-Atate slity clays, 0 to 7 percent slopes","Atate",null,40,"bedrock, paralithic",43,0,4,2.4,"none",null,null,"none"]
["PB640","Guam",14,{"$f":"IF('Plant Control IR Template'!$V$2=B1457,C1457,\"\")","v":""},"465529","Akina-Atate silty clays, 7 to 15 percent slopes","Akina",null,50,"bedrock, paralithic",24,0,11,2.2000000000000002,"none",null,null,"none"]
["PB640","Guam",14,{"$f":"IF('Plant Control IR Template'!$V$2=B1458,C1458,\"\")","v":""},"465529","Akina-Atate silty clays, 7 to 15 percent slopes","Atate",null,40,"bedrock, paralithic",43,0,11,2.4,"none",null,null,"none"]
["PB640","Guam",15,{"$f":"IF('Plant Control IR Template'!$V$2=B1459,C1459,\"\")","v":""},"465530","Akina-Atate silty clays, 15 to 30 percent slopes","Akina",null,50,"bedrock, paralithic",24,0,23,2.2000000000000002,"none",null,null,"none"]
["PB640","Guam",15,{"$f":"IF('Plant Control IR Template'!$V$2=B1460,C1460,\"\")","v":""},"465530","Akina-Atate silty clays, 15 to 30 percent slopes","Atate",null,40,"bedrock, paralithic",43,0,23,2.4,"none",null,null,"none"]
["PB640","Guam",16,{"$f":"IF('Plant Control IR Template'!$V$2=B1461,C1461,\"\")","v":""},"465531","Akina-Atate silty clays, 30 to 60 percent slopes","Akina",null,50,"bedrock, paralithic",24,0,45,2.2000000000000002,"none",null,null,"none"]
["PB640","Guam",16,{"$f":"IF('Plant Control IR Template'!$V$2=B1462,C1462,\"\")","v":""},"465531","Akina-Atate silty clays, 30 to 60 percent slopes","Atate",null,40,"bedrock, paralithic",43,0,45,2.4,"none",null,null,"none"]
["PB640","Guam",17,{"$f":"IF('Plant Control IR Template'!$V$2=B1463,C1463,\"\")","v":""},"465532","Akina-Atate association, steep","Akina",null,55,"bedrock, paralithic",24,0,40,2.2000000000000002,"none",null,null,"none"]
["PB640","Guam",17,{"$f":"IF('Plant Control IR Template'!$V$2=B1464,C1464,\"\")","v":""},"465532","Akina-Atate association, steep","Atate",null,35,"bedrock, paralithic",43,0,40,2.4,"none",null,null,"none"]
["PB640","Guam",18,{"$f":"IF('Plant Control IR Template'!$V$2=B1465,C1465,\"\")","v":""},"465533","Akina-Badland complex, 7 to 15 percent slopes","Akina",null,65,"bedrock, paralithic",24,0,11,2.2000000000000002,"none",null,null,"none"]
["PB640","Guam",18,{"$f":"IF('Plant Control IR Template'!$V$2=B1466,C1466,\"\")","v":""},"465533","Akina-Badland complex, 7 to 15 percent slopes","Badland",null,30,"bedrock, paralithic",0,0,11,0,"none",null,null,"none"]
["PB640","Guam",19,{"$f":"IF('Plant Control IR Template'!$V$2=B1467,C1467,\"\")","v":""},"465534","Akina-Badland complex, 15 to 30 percent slopes","Akina",null,65,"bedrock, paralithic",24,0,23,2.2000000000000002,"none",null,null,"none"]
["PB640","Guam",19,{"$f":"IF('Plant Control IR Template'!$V$2=B1468,C1468,\"\")","v":""},"465534","Akina-Badland complex, 15 to 30 percent slopes","Badland",null,30,"bedrock, paralithic",0,0,23,0,"none",null,null,"none"]
["PB640","Guam",20,{"$f":"IF('Plant Control IR Template'!$V$2=B1469,C1469,\"\")","v":""},"465536","Akina-Badland complex, 30 to 60 percent slopes","Akina",null,65,"bedrock, paralithic",24,0,45,2.2000000000000002,"none",null,null,"none"]
["PB640","Guam",20,{"$f":"IF('Plant Control IR Template'!$V$2=B1470,C1470,\"\")","v":""},"465536","Akina-Badland complex, 30 to 60 percent slopes","Badland",null,30,"bedrock, paralithic",0,0,45,0,"none",null,null,"none"]
["PB640","Guam",21,{"$f":"IF('Plant Control IR Template'!$V$2=B1471,C1471,\"\")","v":""},"465537","Akina-Badland association, steep","Akina",null,60,"bedrock, paralithic",24,0,40,2.2000000000000002,"none",null,null,"none"]
["PB640","Guam",21,{"$f":"IF('Plant Control IR Template'!$V$2=B1472,C1472,\"\")","v":""},"465537","Akina-Badland association, steep","Badland",null,25,"bedrock, paralithic",0,0,40,0,"none",null,null,"none"]
["PB640","Guam",22,{"$f":"IF('Plant Control IR Template'!$V$2=B1473,C1473,\"\")","v":""},"465538","Akina-Urban land complex, 0 to 7 percent slopes","Akina",null,60,"bedrock, paralithic",24,0,4,2.2000000000000002,"none",null,null,"none"]
["PB640","Guam",22,{"$f":"IF('Plant Control IR Template'!$V$2=B1474,C1474,\"\")","v":""},"465538","Akina-Urban land complex, 0 to 7 percent slopes","Urban land",null,30,null,80,0,4,0,"none",null,null,"none"]
["PB640","Guam",23,{"$f":"IF('Plant Control IR Template'!$V$2=B1475,C1475,\"\")","v":""},"465539","Chacha clay, 0 to 5 percent slopes","Chacha",null,90,"bedrock, paralithic",43,0,3,2.6,"rare",null,null,"none"]
["PB640","Guam",24,{"$f":"IF('Plant Control IR Template'!$V$2=B1476,C1476,\"\")","v":""},"465540","Chacha variant clay, 0 to 3 percent slopes","Chacha variant",null,90,null,80,0,2,2.6,"none",null,null,"rare",",long"]
["PB640","Guam",25,{"$f":"IF('Plant Control IR Template'!$V$2=B1477,C1477,\"\")","v":""},"465541","Guam cobbly clay loam, 3 to 7 percent slopes","Guam",null,90,"bedrock, lithic",8,28,5,1.7,"none",null,null,"none"]
["PB640","Guam",26,{"$f":"IF('Plant Control IR Template'!$V$2=B1478,C1478,\"\")","v":""},"465542","Guam cobbly clay loam, 7 to 15 percent slopes","Guam",null,90,"bedrock, lithic",8,0,11,1.7,"none",null,null,"none"]
["PB640","Guam",27,{"$f":"IF('Plant Control IR Template'!$V$2=B1479,C1479,\"\")","v":""},"465543","Guam-Saipan complex, 0 to 7 percent slopes","Guam",null,60,"bedrock, lithic",8,0,4,1.7,"none",null,null,"none"]
["PB640","Guam",27,{"$f":"IF('Plant Control IR Template'!$V$2=B1480,C1480,\"\")","v":""},"465543","Guam-Saipan complex, 0 to 7 percent slopes","Saipan",null,30,null,80,5,2,2.4,"none",null,null,"none"]
["PB640","Guam",28,{"$f":"IF('Plant Control IR Template'!$V$2=B1481,C1481,\"\")","v":""},"465544","Guam-Urban land complex, 0 to 3 percent slopes","Guam",null,55,"bedrock, lithic",8,0,2,1.7,"none",null,null,"none"]
["PB640","Guam",28,{"$f":"IF('Plant Control IR Template'!$V$2=B1482,C1482,\"\")","v":""},"465544","Guam-Urban land complex, 0 to 3 percent slopes","Urban land",null,45,null,80,0,2,0,"none",null,null,"none"]
["PB640","Guam",29,{"$f":"IF('Plant Control IR Template'!$V$2=B1483,C1483,\"\")","v":""},"465545","Guam-Yigo complex, 0 to 7 percent slopes","Guam",null,55,"bedrock, lithic",8,0,4,1.7,"none",null,null,"none"]
["PB640","Guam",29,{"$f":"IF('Plant Control IR Template'!$V$2=B1484,C1484,\"\")","v":""},"465545","Guam-Yigo complex, 0 to 7 percent slopes","Yigo",null,40,"bedrock, lithic",64,5,2,1.8,"none",null,null,"none"]
["PB640","Guam",30,{"$f":"IF('Plant Control IR Template'!$V$2=B1485,C1485,\"\")","v":""},"465547","Inarajan clay, 0 to 4 percent slopes","Inarajan",null,95,null,80,0,2,3.2,"none, occasional",",brief","June, July, August, September, October, November","none"]
["PB640","Guam",31,{"$f":"IF('Plant Control IR Template'!$V$2=B1486,C1486,\"\")","v":""},"465548","Inarajan sandy clay loam, 0 to 3 percent slopes","Inarajan","sandy clay loam",85,null,80,0,2,2.8,"none, occasional",",brief","June, July, August, September, October, November","none"]
["PB640","Guam",32,{"$f":"IF('Plant Control IR Template'!$V$2=B1487,C1487,\"\")","v":""},"465549","Inarajan variant mucky clay, 0 to 3 percent slopes","Inarajan variant",null,90,null,80,0,2,2.9,"none, frequent",",brief","June, July, August, September, October, November","none"]
["PB640","Guam",33,{"$f":"IF('Plant Control IR Template'!$V$2=B1488,C1488,\"\")","v":""},"465550","Pulantat clay, 3 to 7 percent slopes","Pulantat",null,90,"bedrock, paralithic",12,11,3,2.8,"none",null,null,"none"]
["PB640","Guam",34,{"$f":"IF('Plant Control IR Template'!$V$2=B1489,C1489,\"\")","v":""},"465551","Pulantat clay, 7 to 15 percent slopes","Pulantat",null,90,"bedrock, paralithic",12,0,11,2.8,"none",null,null,"none"]
["PB640","Guam",35,{"$f":"IF('Plant Control IR Template'!$V$2=B1490,C1490,\"\")","v":""},"465552","Pulantat clay, 15 to 30 percent slopes","Pulantat",null,90,"bedrock, paralithic",12,0,23,2.8,"none",null,null,"none"]
["PB640","Guam",36,{"$f":"IF('Plant Control IR Template'!$V$2=B1491,C1491,\"\")","v":""},"465553","Pulantat clay, 30 to 60 percent slopes","Pulantat",null,90,"bedrock, paralithic",12,0,45,2.8,"none",null,null,"none"]
["PB640","Guam",37,{"$f":"IF('Plant Control IR Template'!$V$2=B1492,C1492,\"\")","v":""},"465554","Pulantat-Chacha clays, undulating","Pulantat",null,60,"bedrock, paralithic",12,0,5,2.8,"none",null,null,"none"]
["PB640","Guam",37,{"$f":"IF('Plant Control IR Template'!$V$2=B1493,C1493,\"\")","v":""},"465554","Pulantat-Chacha clays, undulating","Chacha",null,35,"bedrock, paralithic",43,0,3,2.6,"rare",null,null,"none"]
["PB640","Guam",38,{"$f":"IF('Plant Control IR Template'!$V$2=B1494,C1494,\"\")","v":""},"465555","Pulantat-Chacha clays, rolling","Pulantat",null,60,"bedrock, paralithic",12,0,11,2.8,"none",null,null,"none"]
["PB640","Guam",38,{"$f":"IF('Plant Control IR Template'!$V$2=B1495,C1495,\"\")","v":""},"465555","Pulantat-Chacha clays, rolling","Chacha",null,35,"bedrock, paralithic",43,0,3,2.6,"rare",null,null,"none"]
["PB640","Guam",39,{"$f":"IF('Plant Control IR Template'!$V$2=B1496,C1496,\"\")","v":""},"465556","Pulantat-Kagman clays, 0 to 7 percent slopes","Pulantat",null,60,"bedrock, paralithic",12,0,5,2.8,"none",null,null,"none"]
["PB640","Guam",39,{"$f":"IF('Plant Control IR Template'!$V$2=B1497,C1497,\"\")","v":""},"465556","Pulantat-Kagman clays, 0 to 7 percent slopes","Kagman",null,30,"bedrock, lithic",59,6,2,2.7,"none",null,null,"none"]
["PB640","Guam",40,{"$f":"IF('Plant Control IR Template'!$V$2=B1498,C1498,\"\")","v":""},"465558","Pulantat-Kagman clays, 7 to 15 percent slopes","Pulantat",null,60,"bedrock, paralithic",12,0,11,2.8,"none",null,null,"none"]
["PB640","Guam",40,{"$f":"IF('Plant Control IR Template'!$V$2=B1499,C1499,\"\")","v":""},"465558","Pulantat-Kagman clays, 7 to 15 percent slopes","Kagman",null,30,"bedrock, lithic",59,0,11,2.7,"none",null,null,"none"]
["PB640","Guam",41,{"$f":"IF('Plant Control IR Template'!$V$2=B1500,C1500,\"\")","v":""},"465559","Pulantat-Urban land complex, 0 to 7 percent slopes","Pulantat",null,50,"bedrock, paralithic",12,0,4,2.8,"none",null,null,"none"]
["PB640","Guam",41,{"$f":"IF('Plant Control IR Template'!$V$2=B1501,C1501,\"\")","v":""},"465559","Pulantat-Urban land complex, 0 to 7 percent slopes","Urban land",null,35,null,80,0,4,0,"none",null,null,"none"]
["PB640","Guam",42,{"$f":"IF('Plant Control IR Template'!$V$2=B1502,C1502,\"\")","v":""},"465560","Pulantat-Urban land complex, 7 to 15 percent slopes","Pulantat",null,70,"bedrock, paralithic",12,0,11,2.8,"none",null,null,"none"]
["PB640","Guam",42,{"$f":"IF('Plant Control IR Template'!$V$2=B1503,C1503,\"\")","v":""},"465560","Pulantat-Urban land complex, 7 to 15 percent slopes","Urban land",null,30,null,80,0,11,0,"none",null,null,"none"]
["PB640","Guam",43,{"$f":"IF('Plant Control IR Template'!$V$2=B1504,C1504,\"\")","v":""},"465561","Ritidian-Rock outcrop complex, 3 to 15 percent slopes","Ritidian",null,45,"bedrock, lithic",10,64,9,0.7,"none",null,null,"none"]
["PB640","Guam",43,{"$f":"IF('Plant Control IR Template'!$V$2=B1505,C1505,\"\")","v":""},"465561","Ritidian-Rock outcrop complex, 3 to 15 percent slopes","Rock outcrop",null,40,"bedrock, lithic",0,0,9,0,"none",null,null,"none"]
["PB640","Guam",44,{"$f":"IF('Plant Control IR Template'!$V$2=B1506,C1506,\"\")","v":""},"465562","Ritidian-Rock outcrop complex, 15 to 60 percent slopes","Ritidian",null,50,"bedrock, lithic",10,0,38,0.7,"none",null,null,"none"]
["PB640","Guam",44,{"$f":"IF('Plant Control IR Template'!$V$2=B1507,C1507,\"\")","v":""},"465562","Ritidian-Rock outcrop complex, 15 to 60 percent slopes","Rock outcrop",null,45,"bedrock, lithic",0,0,38,0,"none",null,null,"none"]
["PB640","Guam",45,{"$f":"IF('Plant Control IR Template'!$V$2=B1508,C1508,\"\")","v":""},"465563","Rock outcrop-Ritidian complex, 60 to 99 percent slopes","Rock outcrop",null,50,"bedrock, lithic",0,0,80,0,"none",null,null,"none"]
["PB640","Guam",45,{"$f":"IF('Plant Control IR Template'!$V$2=B1509,C1509,\"\")","v":""},"465563","Rock outcrop-Ritidian complex, 60 to 99 percent slopes","Ritidian",null,45,"bedrock, lithic",10,0,80,0.7,"none",null,null,"none"]
["PB640","Guam",46,{"$f":"IF('Plant Control IR Template'!$V$2=B1510,C1510,\"\")","v":""},"465564","Sasalaguan clay, 7 to 15 percent slopes","Sasalaguan",null,90,"bedrock, paralithic",28,0,11,2.8,"none",null,null,"none"]
["PB640","Guam",47,{"$f":"IF('Plant Control IR Template'!$V$2=B1511,C1511,\"\")","v":""},"465565","Shioya loamy sand, 0 to 5 percent slopes","Shioya",null,85,"bedrock, lithic",63,10,3,1.6,"rare",null,null,"none"]
["PB640","Guam",48,{"$f":"IF('Plant Control IR Template'!$V$2=B1512,C1512,\"\")","v":""},"465566","Togcha-Akina silty clays, 3 to 7 percent slopes","Togcha",null,65,null,80,0,5,2.2999999999999998,"none",null,null,"none"]
["PB640","Guam",48,{"$f":"IF('Plant Control IR Template'!$V$2=B1513,C1513,\"\")","v":""},"465566","Togcha-Akina silty clays, 3 to 7 percent slopes","Akina",null,25,"bedrock, paralithic",24,0,5,2.2000000000000002,"none",null,null,"none"]
["PB640","Guam",49,{"$f":"IF('Plant Control IR Template'!$V$2=B1514,C1514,\"\")","v":""},"465567","Togcha-Akina silty clays, 7 to 15 percent slopes","Togcha",null,65,null,80,0,11,2.2999999999999998,"none",null,null,"none"]
["PB640","Guam",49,{"$f":"IF('Plant Control IR Template'!$V$2=B1515,C1515,\"\")","v":""},"465567","Togcha-Akina silty clays, 7 to 15 percent slopes","Akina",null,25,"bedrock, paralithic",24,0,11,2.2000000000000002,"none",null,null,"none"]
["PB640","Guam",50,{"$f":"IF('Plant Control IR Template'!$V$2=B1516,C1516,\"\")","v":""},"465569","Togcha-Ylig complex, 3 to 7 percent slopes","Togcha",null,60,null,80,0,5,2.2999999999999998,"none",null,null,"none"]
["PB640","Guam",50,{"$f":"IF('Plant Control IR Template'!$V$2=B1517,C1517,\"\")","v":""},"465569","Togcha-Ylig complex, 3 to 7 percent slopes","Ylig",null,35,null,80,4,5,3.4,"rare",null,null,"none"]
["PB640","Guam",51,{"$f":"IF('Plant Control IR Template'!$V$2=B1518,C1518,\"\")","v":""},"465570","Togcha-Ylig complex, 7 to 15 percent slopes","Togcha",null,60,null,80,0,11,2.2999999999999998,"none",null,null,"none"]
["PB640","Guam",51,{"$f":"IF('Plant Control IR Template'!$V$2=B1519,C1519,\"\")","v":""},"465570","Togcha-Ylig complex, 7 to 15 percent slopes","Ylig",null,35,null,80,0,11,3.4,"rare",null,null,"none"]
["PB640","Guam",52,{"$f":"IF('Plant Control IR Template'!$V$2=B1520,C1520,\"\")","v":""},"465571","Troposaprists, 0 to 1 percent slopes","Troposaprists",null,90,null,80,0,1,5.5,"none, frequent",",brief","June, July, August, September, October, November","frequent","very long","January, February, March, April, May, June, July, August, September, October, November, December"]
["PB640","Guam",53,{"$f":"IF('Plant Control IR Template'!$V$2=B1521,C1521,\"\")","v":""},"465572","Urban land-Ustorthents complex, nearly level","Urban land",null,60,null,80,0,3,0,"none",null,null,"none"]
["PB640","Guam",53,{"$f":"IF('Plant Control IR Template'!$V$2=B1522,C1522,\"\")","v":""},"465572","Urban land-Ustorthents complex, nearly level","Ustorthents",null,30,null,80,0,3,null,"none",null,null,"none"]
["PB640","Guam",54,{"$f":"IF('Plant Control IR Template'!$V$2=B1523,C1523,\"\")","v":""},"465573","Ylig clay, 0 to 3 percent slopes","Ylig",null,90,null,80,0,2,3.4,"rare",null,null,"none"]
["PB640","Guam",55,{"$f":"IF('Plant Control IR Template'!$V$2=B1524,C1524,\"\")","v":""},"465574","Ylig clay, 3 to 7 percent slopes","Ylig",null,90,null,80,0,5,3.4,"rare",null,null,"none"]
["PB640","Guam",56,{"$f":"IF('Plant Control IR Template'!$V$2=B1525,C1525,\"\")","v":""},"465575","Water","Water",null,100,null,80,0,null,null,"none",null,null,"none"]
["PB645","Northern Mariana Islands",1,{"$f":"IF('Plant Control IR Template'!$V$2=B1526,C1526,\"\")","v":""},"465589","Agfayan variant-Rock outcrop complex, 15 to 30 percent slopes","Agfayan variant",null,55,"bedrock, paralithic",14,30,23,1.5,"none",null,null,"none"]
["PB645","Northern Mariana Islands",1,{"$f":"IF('Plant Control IR Template'!$V$2=B1527,C1527,\"\")","v":""},"465589","Agfayan variant-Rock outcrop complex, 15 to 30 percent slopes","Rock outcrop",null,30,"bedrock, lithic",0,0,23,null,"none",null,null,"none"]
["PB645","Northern Mariana Islands",2,{"$f":"IF('Plant Control IR Template'!$V$2=B1528,C1528,\"\")","v":""},"465600","Agfayan variant-Rock outcrop complex, 30 to 60 percent slopes","Agfayan variant",null,55,"bedrock, paralithic",14,30,45,1.5,"none",null,null,"none"]
["PB645","Northern Mariana Islands",2,{"$f":"IF('Plant Control IR Template'!$V$2=B1529,C1529,\"\")","v":""},"465600","Agfayan variant-Rock outcrop complex, 30 to 60 percent slopes","Rock outcrop",null,30,"bedrock, lithic",0,0,45,null,"none",null,null,"none"]
["PB645","Northern Mariana Islands",3,{"$f":"IF('Plant Control IR Template'!$V$2=B1530,C1530,\"\")","v":""},"465611","Akina-Badland complex, 15 to 30 percent slopes","Akina",null,60,"bedrock, paralithic",24,0,23,2.2000000000000002,"none",null,null,"none"]
["PB645","Northern Mariana Islands",3,{"$f":"IF('Plant Control IR Template'!$V$2=B1531,C1531,\"\")","v":""},"465611","Akina-Badland complex, 15 to 30 percent slopes","Badland",null,30,"bedrock, paralithic",0,0,23,0,"none",null,null,"none"]
["PB645","Northern Mariana Islands",4,{"$f":"IF('Plant Control IR Template'!$V$2=B1532,C1532,\"\")","v":""},"465622","Akina-Badland complex, 30 to 60 percent slopes","Akina",null,60,"bedrock, paralithic",24,0,45,2.2000000000000002,"none",null,null,"none"]
["PB645","Northern Mariana Islands",4,{"$f":"IF('Plant Control IR Template'!$V$2=B1533,C1533,\"\")","v":""},"465622","Akina-Badland complex, 30 to 60 percent slopes","Badland",null,30,"bedrock, paralithic",0,0,45,null,"none",null,null,"none"]
["PB645","Northern Mariana Islands",5,{"$f":"IF('Plant Control IR Template'!$V$2=B1534,C1534,\"\")","v":""},"465633","Banaderu clay loam, 3 to 5 percent slopes","Banaderu",null,85,"bedrock, lithic",19,12,4,2.6,"none",null,null,"none"]
["PB645","Northern Mariana Islands",6,{"$f":"IF('Plant Control IR Template'!$V$2=B1535,C1535,\"\")","v":""},"465639","Banaderu clay loam, 5 to 15 percent slopes","Banaderu",null,85,"bedrock, lithic",19,12,10,2.6,"none",null,null,"none"]
["PB645","Northern Mariana Islands",7,{"$f":"IF('Plant Control IR Template'!$V$2=B1536,C1536,\"\")","v":""},"465640","Banaderu-Rock outcrop complex, 5 to 15 percent slopes","Banaderu",null,55,"bedrock, lithic",19,12,10,2.6,"none",null,null,"none"]
["PB645","Northern Mariana Islands",7,{"$f":"IF('Plant Control IR Template'!$V$2=B1537,C1537,\"\")","v":""},"465640","Banaderu-Rock outcrop complex, 5 to 15 percent slopes","Rock outcrop",null,35,"bedrock, lithic",0,0,10,null,"none",null,null,"none"]
["PB645","Northern Mariana Islands",8,{"$f":"IF('Plant Control IR Template'!$V$2=B1538,C1538,\"\")","v":""},"465641","Banaderu-Rock outcrop complex, 15 to 30 percent slopes","Banaderu",null,55,"bedrock, lithic",19,12,23,2.6,"none",null,null,"none"]
["PB645","Northern Mariana Islands",8,{"$f":"IF('Plant Control IR Template'!$V$2=B1539,C1539,\"\")","v":""},"465641","Banaderu-Rock outcrop complex, 15 to 30 percent slopes","Rock outcrop",null,35,"bedrock, lithic",0,0,23,null,"none",null,null,"none"]
["PB645","Northern Mariana Islands",9,{"$f":"IF('Plant Control IR Template'!$V$2=B1540,C1540,\"\")","v":""},"465642","Chacha clay, drained, 0 to 5 percent slopes","Chacha","drained",90,"bedrock, paralithic",39,3,3,2.6,"none",null,null,"none"]
["PB645","Northern Mariana Islands",10,{"$f":"IF('Plant Control IR Template'!$V$2=B1541,C1541,\"\")","v":""},"465590","Chinen clay loam, 0 to 5 percent slopes","Chinen",null,80,"bedrock, lithic",14,10,3,1.8,"none",null,null,"none"]
["PB645","Northern Mariana Islands",11,{"$f":"IF('Plant Control IR Template'!$V$2=B1542,C1542,\"\")","v":""},"465591","Chinen clay loam, 5 to 15 percent slopes","Chinen",null,80,"bedrock, lithic",14,10,10,1.8,"none",null,null,"none"]
["PB645","Northern Mariana Islands",12,{"$f":"IF('Plant Control IR Template'!$V$2=B1543,C1543,\"\")","v":""},"465592","Chinen clay loam, 15 to 30 percent slopes","Chinen",null,80,"bedrock, lithic",14,10,23,1.8,"none",null,null,"none"]
["PB645","Northern Mariana Islands",13,{"$f":"IF('Plant Control IR Template'!$V$2=B1544,C1544,\"\")","v":""},"465593","Chinen very gravelly sandy loam, 0 to 5 percent slopes","Chinen","very gravelly sandy loam",80,"bedrock, lithic",21,35,3,1.7,"none",null,null,"none"]
["PB645","Northern Mariana Islands",14,{"$f":"IF('Plant Control IR Template'!$V$2=B1545,C1545,\"\")","v":""},"465594","Chinen very gravelly sandy loam, 5 to 15 percent slopes","Chinen","very gravelly sandy loam",80,"bedrock, lithic",21,35,10,1.7,"none",null,null,"none"]
["PB645","Northern Mariana Islands",15,{"$f":"IF('Plant Control IR Template'!$V$2=B1546,C1546,\"\")","v":""},"465595","Chinen-Rock outcrop complex, 3 to 15 percent slopes","Chinen",null,50,"bedrock, lithic",14,10,9,1.8,"none",null,null,"none"]
["PB645","Northern Mariana Islands",15,{"$f":"IF('Plant Control IR Template'!$V$2=B1547,C1547,\"\")","v":""},"465595","Chinen-Rock outcrop complex, 3 to 15 percent slopes","Rock outcrop",null,30,"bedrock, lithic",0,0,9,null,"none",null,null,"none"]
["PB645","Northern Mariana Islands",16,{"$f":"IF('Plant Control IR Template'!$V$2=B1548,C1548,\"\")","v":""},"465596","Chinen-Rock outcrop complex, 15 to 30 percent slopes","Chinen",null,50,"bedrock, lithic",14,10,23,1.8,"none",null,null,"none"]
["PB645","Northern Mariana Islands",16,{"$f":"IF('Plant Control IR Template'!$V$2=B1549,C1549,\"\")","v":""},"465596","Chinen-Rock outcrop complex, 15 to 30 percent slopes","Rock outcrop",null,30,"bedrock, lithic",0,0,23,null,"none",null,null,"none"]
["PB645","Northern Mariana Islands",17,{"$f":"IF('Plant Control IR Template'!$V$2=B1550,C1550,\"\")","v":""},"465597","Chinen-Urban land complex, 0 to 5 percent slopes","Chinen",null,50,"bedrock, lithic",14,10,3,1.8,"none",null,null,"none"]
["PB645","Northern Mariana Islands",17,{"$f":"IF('Plant Control IR Template'!$V$2=B1551,C1551,\"\")","v":""},"465597","Chinen-Urban land complex, 0 to 5 percent slopes","Urban land",null,30,null,80,0,3,0,"none",null,null,"none"]
["PB645","Northern Mariana Islands",18,{"$f":"IF('Plant Control IR Template'!$V$2=B1552,C1552,\"\")","v":""},"465598","Chinen-Urban land complex, 5 to 15 percent slopes","Chinen",null,55,"bedrock, lithic",14,10,10,1.8,"none",null,null,"none"]
["PB645","Northern Mariana Islands",18,{"$f":"IF('Plant Control IR Template'!$V$2=B1553,C1553,\"\")","v":""},"465598","Chinen-Urban land complex, 5 to 15 percent slopes","Urban land",null,25,null,80,0,10,0,"none",null,null,"none"]
["PB645","Northern Mariana Islands",19,{"$f":"IF('Plant Control IR Template'!$V$2=B1554,C1554,\"\")","v":""},"465599","Dandan-Chinen complex, 0 to 5 percent slopes","Dandan",null,50,"bedrock, lithic",26,5,3,2.6,"none",null,null,"none"]
["PB645","Northern Mariana Islands",19,{"$f":"IF('Plant Control IR Template'!$V$2=B1555,C1555,\"\")","v":""},"465599","Dandan-Chinen complex, 0 to 5 percent slopes","Chinen",null,40,"bedrock, lithic",14,10,3,1.8,"none",null,null,"none"]
["PB645","Northern Mariana Islands",20,{"$f":"IF('Plant Control IR Template'!$V$2=B1556,C1556,\"\")","v":""},"465601","Dandan-Chinen complex, 5 to 15 percent slopes","Dandan",null,50,"bedrock, lithic",26,0,10,2.6,"none",null,null,"none"]
["PB645","Northern Mariana Islands",20,{"$f":"IF('Plant Control IR Template'!$V$2=B1557,C1557,\"\")","v":""},"465601","Dandan-Chinen complex, 5 to 15 percent slopes","Chinen",null,40,"bedrock, lithic",14,10,10,1.8,"none",null,null,"none"]
["PB645","Northern Mariana Islands",21,{"$f":"IF('Plant Control IR Template'!$V$2=B1558,C1558,\"\")","v":""},"465602","Dandan-Chinen-Pits complex, 0 to 5 percent slopes","Dandan",null,30,"bedrock, lithic",26,0,3,2.6,"none",null,null,"none"]
["PB645","Northern Mariana Islands",21,{"$f":"IF('Plant Control IR Template'!$V$2=B1559,C1559,\"\")","v":""},"465602","Dandan-Chinen-Pits complex, 0 to 5 percent slopes","Chinen",null,30,"bedrock, lithic",14,10,3,1.8,"none",null,null,"none"]
["PB645","Northern Mariana Islands",21,{"$f":"IF('Plant Control IR Template'!$V$2=B1560,C1560,\"\")","v":""},"465602","Dandan-Chinen-Pits complex, 0 to 5 percent slopes","Pits",null,30,null,80,0,2,0,"none",null,null,"none"]
["PB645","Northern Mariana Islands",22,{"$f":"IF('Plant Control IR Template'!$V$2=B1561,C1561,\"\")","v":""},"465603","Dandan-Chinen-Pits complex, 5 to 15 percent slopes","Pits",null,30,null,80,0,10,0,"none",null,null,"none"]
["PB645","Northern Mariana Islands",22,{"$f":"IF('Plant Control IR Template'!$V$2=B1562,C1562,\"\")","v":""},"465603","Dandan-Chinen-Pits complex, 5 to 15 percent slopes","Chinen",null,30,"bedrock, lithic",14,10,10,1.8,"none",null,null,"none"]
["PB645","Northern Mariana Islands",22,{"$f":"IF('Plant Control IR Template'!$V$2=B1563,C1563,\"\")","v":""},"465603","Dandan-Chinen-Pits complex, 5 to 15 percent slopes","Dandan",null,30,"bedrock, lithic",26,0,10,2.6,"none",null,null,"none"]
["PB645","Northern Mariana Islands",23,{"$f":"IF('Plant Control IR Template'!$V$2=B1564,C1564,\"\")","v":""},"465604","Dandan-Saipan clays, 0 to 5 percent slopes","Dandan",null,50,"bedrock, lithic",26,0,3,2.6,"none",null,null,"none"]
["PB645","Northern Mariana Islands",23,{"$f":"IF('Plant Control IR Template'!$V$2=B1565,C1565,\"\")","v":""},"465604","Dandan-Saipan clays, 0 to 5 percent slopes","Saipan",null,35,"bedrock, lithic",47,0,3,2.4,"none",null,null,"none"]
["PB645","Northern Mariana Islands",24,{"$f":"IF('Plant Control IR Template'!$V$2=B1566,C1566,\"\")","v":""},"465605","Dandan-Saipan clays, 5 to 15 percent slopes","Dandan",null,50,"bedrock, lithic",26,0,10,2.6,"none",null,null,"none"]
["PB645","Northern Mariana Islands",24,{"$f":"IF('Plant Control IR Template'!$V$2=B1567,C1567,\"\")","v":""},"465605","Dandan-Saipan clays, 5 to 15 percent slopes","Saipan",null,35,"bedrock, lithic",47,0,10,2.4,"none",null,null,"none"]
["PB645","Northern Mariana Islands",25,{"$f":"IF('Plant Control IR Template'!$V$2=B1568,C1568,\"\")","v":""},"465606","Inarajan clay, 0 to 5 percent slopes","Inarajan",null,90,null,80,0,3,3,"none, occasional",",brief","June, July, August, September, October, November","none"]
["PB645","Northern Mariana Islands",26,{"$f":"IF('Plant Control IR Template'!$V$2=B1569,C1569,\"\")","v":""},"465607","Kagman clay, 0 to 5 percent slopes","Kagman",null,80,null,80,6,3,2.7,"none",null,null,"none"]
["PB645","Northern Mariana Islands",27,{"$f":"IF('Plant Control IR Template'!$V$2=B1570,C1570,\"\")","v":""},"465608","Kagman clay, 5 to 15 percent slopes","Kagman",null,80,null,80,0,10,2.7,"none",null,null,"none"]
["PB645","Northern Mariana Islands",28,{"$f":"IF('Plant Control IR Template'!$V$2=B1571,C1571,\"\")","v":""},"465609","Kagman very gravelly sandy loam, 0 to 5 percent slopes","Kagman","very gravelly sandy loam",90,null,80,33,3,1.9,"none",null,null,"none"]
["PB645","Northern Mariana Islands",29,{"$f":"IF('Plant Control IR Template'!$V$2=B1572,C1572,\"\")","v":""},"465610","Kagman-Urban land complex, 0 to 5 percent slopes","Kagman",null,50,null,80,0,3,2.7,"none",null,null,"none"]
["PB645","Northern Mariana Islands",29,{"$f":"IF('Plant Control IR Template'!$V$2=B1573,C1573,\"\")","v":""},"465610","Kagman-Urban land complex, 0 to 5 percent slopes","Urban land",null,30,null,80,0,3,null,"none",null,null,"none"]
["PB645","Northern Mariana Islands",30,{"$f":"IF('Plant Control IR Template'!$V$2=B1574,C1574,\"\")","v":""},"465612","Laolao clay, 0 to 5 percent slopes","Laolao",null,90,"bedrock, paralithic",32,2,3,2.9,"none",null,null,"none"]
["PB645","Northern Mariana Islands",31,{"$f":"IF('Plant Control IR Template'!$V$2=B1575,C1575,\"\")","v":""},"465613","Laolao clay, 5 to 15 percent slopes","Laolao",null,80,"bedrock, paralithic",32,0,10,2.9,"none",null,null,"none"]
["PB645","Northern Mariana Islands",32,{"$f":"IF('Plant Control IR Template'!$V$2=B1576,C1576,\"\")","v":""},"465614","Laolao clay, 15 to 30 percent slopes","Laolao",null,75,"bedrock, paralithic",32,0,23,2.9,"none",null,null,"none"]
["PB645","Northern Mariana Islands",33,{"$f":"IF('Plant Control IR Template'!$V$2=B1577,C1577,\"\")","v":""},"465615","Laolao clay, 30 to 60 percent slopes","Laolao",null,75,"bedrock, paralithic",32,0,45,2.9,"none",null,null,"none"]
["PB645","Northern Mariana Islands",34,{"$f":"IF('Plant Control IR Template'!$V$2=B1578,C1578,\"\")","v":""},"465616","Luta cobbly clay loam, 0 to 5 percent slopes","Luta",null,85,"bedrock, lithic",12,13,3,0.9,"none",null,null,"none"]
["PB645","Northern Mariana Islands",35,{"$f":"IF('Plant Control IR Template'!$V$2=B1579,C1579,\"\")","v":""},"465617","Luta cobbly clay loam, 5 to 15 percent slopes","Luta",null,85,"bedrock, lithic",12,7,10,0.9,"none",null,null,"none"]
["PB645","Northern Mariana Islands",36,{"$f":"IF('Plant Control IR Template'!$V$2=B1580,C1580,\"\")","v":""},"465618","Luta cobbly clay loam, moist, 0 to 5 percent slopes","Luta","moist",85,"bedrock, lithic",12,7,3,0.9,"none",null,null,"none"]
["PB645","Northern Mariana Islands",37,{"$f":"IF('Plant Control IR Template'!$V$2=B1581,C1581,\"\")","v":""},"465619","Luta cobbly clay loam, moist, 5 to 15 percent slopes","Luta","moist",85,"bedrock, lithic",12,7,10,0.9,"none",null,null,"none"]
["PB645","Northern Mariana Islands",38,{"$f":"IF('Plant Control IR Template'!$V$2=B1582,C1582,\"\")","v":""},"465620","Luta-Rock outcrop complex, 0 to 5 percent slopes","Luta",null,60,"bedrock, lithic",6,21,3,0.9,"none",null,null,"none"]
["PB645","Northern Mariana Islands",38,{"$f":"IF('Plant Control IR Template'!$V$2=B1583,C1583,\"\")","v":""},"465620","Luta-Rock outcrop complex, 0 to 5 percent slopes","Rock outcrop",null,25,"bedrock, lithic",0,0,3,null,"none",null,null,"none"]
["PB645","Northern Mariana Islands",39,{"$f":"IF('Plant Control IR Template'!$V$2=B1584,C1584,\"\")","v":""},"465621","Luta-Rock outcrop complex, 5 to 15 percent slopes","Luta",null,60,"bedrock, lithic",6,11,10,0.9,"none",null,null,"none"]
["PB645","Northern Mariana Islands",39,{"$f":"IF('Plant Control IR Template'!$V$2=B1585,C1585,\"\")","v":""},"465621","Luta-Rock outcrop complex, 5 to 15 percent slopes","Rock outcrop",null,25,"bedrock, lithic",0,0,10,null,"none",null,null,"none"]
["PB645","Northern Mariana Islands",40,{"$f":"IF('Plant Control IR Template'!$V$2=B1586,C1586,\"\")","v":""},"465623","Luta-Rock outcrop complex, 15 to 30 percent slopes","Luta",null,60,"bedrock, lithic",6,11,23,0.9,"none",null,null,"none"]
["PB645","Northern Mariana Islands",40,{"$f":"IF('Plant Control IR Template'!$V$2=B1587,C1587,\"\")","v":""},"465623","Luta-Rock outcrop complex, 15 to 30 percent slopes","Rock outcrop",null,35,"bedrock, lithic",0,0,23,null,"none",null,null,"none"]
["PB645","Northern Mariana Islands",41,{"$f":"IF('Plant Control IR Template'!$V$2=B1588,C1588,\"\")","v":""},"465624","Mesei variant muck, 0 to 2 percent slopes","Mesei variant",null,85,null,80,13,1,4.9000000000000004,"none, frequent",",very brief","July, August, September, October, November","rare","very long"]
["PB645","Northern Mariana Islands",42,{"$f":"IF('Plant Control IR Template'!$V$2=B1589,C1589,\"\")","v":""},"465625","Rock outcrop-Takpochao complex, 60 to 99 percent slopes","Rock outcrop",null,50,"bedrock, lithic",0,0,80,null,"none",null,null,"none"]
["PB645","Northern Mariana Islands",42,{"$f":"IF('Plant Control IR Template'!$V$2=B1590,C1590,\"\")","v":""},"465625","Rock outcrop-Takpochao complex, 60 to 99 percent slopes","Takpochao",null,40,"bedrock, lithic",12,38,80,1.3,"none",null,null,"none"]
["PB645","Northern Mariana Islands",43,{"$f":"IF('Plant Control IR Template'!$V$2=B1591,C1591,\"\")","v":""},"465626","Saipan clay, 0 to 5 percent slopes","Saipan",null,80,"bedrock, lithic",47,0,3,2.4,"none",null,null,"none"]
["PB645","Northern Mariana Islands",44,{"$f":"IF('Plant Control IR Template'!$V$2=B1592,C1592,\"\")","v":""},"465627","Saipan clay, 5 to 15 percent slopes","Saipan",null,80,"bedrock, lithic",47,0,10,2.4,"none",null,null,"none"]
["PB645","Northern Mariana Islands",45,{"$f":"IF('Plant Control IR Template'!$V$2=B1593,C1593,\"\")","v":""},"465628","Saipan very gravelly sandy loam, 0 to 5 percent slopes","Saipan","very gravelly sandy loam",90,"bedrock, lithic",55,33,3,1.9,"none",null,null,"none"]
["PB645","Northern Mariana Islands",46,{"$f":"IF('Plant Control IR Template'!$V$2=B1594,C1594,\"\")","v":""},"465629","Saipan very gravelly sandy loam, 5 to 15 percent slopes","Saipan","very gravelly sandy loam",80,"bedrock, lithic",59,33,10,1.9,"none",null,null,"none"]
["PB645","Northern Mariana Islands",47,{"$f":"IF('Plant Control IR Template'!$V$2=B1595,C1595,\"\")","v":""},"465630","Saipan-Rock outcrop complex, 0 to 5 percent slopes","Saipan",null,70,"bedrock, lithic",47,0,3,2.4,"none",null,null,"none"]
["PB645","Northern Mariana Islands",47,{"$f":"IF('Plant Control IR Template'!$V$2=B1596,C1596,\"\")","v":""},"465630","Saipan-Rock outcrop complex, 0 to 5 percent slopes","Rock outcrop",null,15,"bedrock, lithic",0,0,3,null,"none",null,null,"none"]
["PB645","Northern Mariana Islands",48,{"$f":"IF('Plant Control IR Template'!$V$2=B1597,C1597,\"\")","v":""},"465631","Shioya loamy sand, 0 to 3 percent slopes","Shioya",null,90,"bedrock, lithic",63,11,2,1.5,"rare",null,null,"none"]
["PB645","Northern Mariana Islands",49,{"$f":"IF('Plant Control IR Template'!$V$2=B1598,C1598,\"\")","v":""},"465632","Shioya-Urban land complex, 0 to 3 percent slopes","Shioya",null,60,"bedrock, lithic",63,3,2,1.5,"rare",null,null,"none"]
["PB645","Northern Mariana Islands",49,{"$f":"IF('Plant Control IR Template'!$V$2=B1599,C1599,\"\")","v":""},"465632","Shioya-Urban land complex, 0 to 3 percent slopes","Urban land",null,30,null,80,0,2,0,"none",null,null,"none"]
["PB645","Northern Mariana Islands",50,{"$f":"IF('Plant Control IR Template'!$V$2=B1600,C1600,\"\")","v":""},"465634","Takpochao-Rock outcrop complex, 3 to 15 percent slopes","Takpochao",null,50,"bedrock, lithic",12,38,9,1.3,"none",null,null,"none"]
["PB645","Northern Mariana Islands",50,{"$f":"IF('Plant Control IR Template'!$V$2=B1601,C1601,\"\")","v":""},"465634","Takpochao-Rock outcrop complex, 3 to 15 percent slopes","Rock outcrop",null,40,"bedrock, lithic",0,0,9,null,"none",null,null,"none"]
["PB645","Northern Mariana Islands",51,{"$f":"IF('Plant Control IR Template'!$V$2=B1602,C1602,\"\")","v":""},"465635","Takpochao-Rock outcrop complex, 15 to 30 percent slopes","Takpochao",null,50,"bedrock, lithic",12,38,23,1.3,"none",null,null,"none"]
["PB645","Northern Mariana Islands",51,{"$f":"IF('Plant Control IR Template'!$V$2=B1603,C1603,\"\")","v":""},"465635","Takpochao-Rock outcrop complex, 15 to 30 percent slopes","Rock outcrop",null,40,"bedrock, lithic",0,0,23,null,"none",null,null,"none"]
["PB645","Northern Mariana Islands",52,{"$f":"IF('Plant Control IR Template'!$V$2=B1604,C1604,\"\")","v":""},"465636","Takpochao-Rock outcrop complex, 30 to 60 percent slopes","Takpochao",null,50,"bedrock, lithic",12,38,45,1.3,"none",null,null,"none"]
["PB645","Northern Mariana Islands",52,{"$f":"IF('Plant Control IR Template'!$V$2=B1605,C1605,\"\")","v":""},"465636","Takpochao-Rock outcrop complex, 30 to 60 percent slopes","Rock outcrop",null,40,"bedrock, lithic",0,0,45,null,"none",null,null,"none"]
["PB645","Northern Mariana Islands",53,{"$f":"IF('Plant Control IR Template'!$V$2=B1606,C1606,\"\")","v":""},"465637","Takpochao variant-Shioya complex, 1 to 10 percent slopes","Takpochao variant",null,60,"bedrock, lithic",6,40,7,0.4,"rare",null,null,"none"]
["PB645","Northern Mariana Islands",53,{"$f":"IF('Plant Control IR Template'!$V$2=B1607,C1607,\"\")","v":""},"465637","Takpochao variant-Shioya complex, 1 to 10 percent slopes","Shioya",null,30,"bedrock, lithic",63,3,7,1.5,"rare",null,null,"none"]
["PB645","Northern Mariana Islands",54,{"$f":"IF('Plant Control IR Template'!$V$2=B1608,C1608,\"\")","v":""},"465644","Quarry","Quarry",null,100,null,80,0,null,null,"none",null,null,"none"]
["PB645","Northern Mariana Islands",55,{"$f":"IF('Plant Control IR Template'!$V$2=B1609,C1609,\"\")","v":""},"465643","Landfill","Landfill",null,100,null,80,0,null,null,"none",null,null,"none"]
["PB645","Northern Mariana Islands",56,{"$f":"IF('Plant Control IR Template'!$V$2=B1610,C1610,\"\")","v":""},"465638","Water","Water",null,100,null,80,0,null,null,"none",null,null,"none"]
["PB646","Northern Mariana Islands",101,{"$f":"IF('Plant Control IR Template'!$V$2=B1611,C1611,\"\")","v":""},"471949","Lava flows, `a`a lava, 0 to 45 percent slopes","Lava flows","`a`a lava, cobbly",90,"bedrock, lithic",39,95,10,0,"none",null,null,"none"]
["PB646","Northern Mariana Islands",102,{"$f":"IF('Plant Control IR Template'!$V$2=B1612,C1612,\"\")","v":""},"471952","Lava flows, `a`a lava, 15 to 150 percent slopes, very bouldery","Lava flows","`a`a lava, bouldery",90,"bedrock, lithic",39,95,100,0,"none",null,null,"none"]
["PB646","Northern Mariana Islands",103,{"$f":"IF('Plant Control IR Template'!$V$2=B1613,C1613,\"\")","v":""},"471953","Lava flows-Vitrandic Ustorthents, sandy complex, 15 to 45 percent slopes, extremely stony","Lava flows","`a`a lava, extremely stony",65,"bedrock, lithic",39,75,30,0,"none",null,null,"none"]
["PB646","Northern Mariana Islands",103,{"$f":"IF('Plant Control IR Template'!$V$2=B1614,C1614,\"\")","v":""},"471953","Lava flows-Vitrandic Ustorthents, sandy complex, 15 to 45 percent slopes, extremely stony","Vitrandic Ustorthents","sandy",25,null,80,7,30,1.4,"none",null,null,"none"]
["PB646","Northern Mariana Islands",104,{"$f":"IF('Plant Control IR Template'!$V$2=B1615,C1615,\"\")","v":""},"471954","Lava flows-Vitrandic Ustorthents, sandy, complex, 45 to 100 percent slopes, extremely stony","Lava flows","`a`a lava, extremely stony",65,"bedrock, lithic",39,75,75,0,"none",null,null,"none"]
["PB646","Northern Mariana Islands",104,{"$f":"IF('Plant Control IR Template'!$V$2=B1616,C1616,\"\")","v":""},"471954","Lava flows-Vitrandic Ustorthents, sandy, complex, 45 to 100 percent slopes, extremely stony","Vitrandic Ustorthents","sandy",25,null,80,7,75,1.4,"none",null,null,"none"]
["PB646","Northern Mariana Islands",106,{"$f":"IF('Plant Control IR Template'!$V$2=B1617,C1617,\"\")","v":""},"471956","Apilam ashy silt loam, 8 to 15 percent slopes","Apilam",null,80,"densic material",44,0,13,3.7,"none",null,null,"none"]
["PB646","Northern Mariana Islands",107,{"$f":"IF('Plant Control IR Template'!$V$2=B1618,C1618,\"\")","v":""},"471957","Apilam ashy silt loam, 15 to 45 percent slopes","Apilam",null,65,"densic material",28,0,30,4.3,"none",null,null,"none"]
["PB646","Northern Mariana Islands",108,{"$f":"IF('Plant Control IR Template'!$V$2=B1619,C1619,\"\")","v":""},"471958","Apilam ashy silt loam, 45 to 150 percent slopes","Apilam",null,70,"densic material",53,0,78,3.7,"none",null,null,"none"]
["PB646","Northern Mariana Islands",109,{"$f":"IF('Plant Control IR Template'!$V$2=B1620,C1620,\"\")","v":""},"471959","Beaches-rock outcrop complex, 10 to 30 percent slopes, bouldery","Beaches","bouldery",90,null,80,12,20,0.8,"frequent","very brief","January, February, March, April, May, June, July, August, September, October, November, December","none"]
["PB646","Northern Mariana Islands",109,{"$f":"IF('Plant Control IR Template'!$V$2=B1621,C1621,\"\")","v":""},"471959","Beaches-rock outcrop complex, 10 to 30 percent slopes, bouldery","Rock outcrop",null,10,"bedrock, lithic",0,0,85,0,"none",null,null,"none"]
["PB646","Northern Mariana Islands",110,{"$f":"IF('Plant Control IR Template'!$V$2=B1622,C1622,\"\")","v":""},"471960","Beaches, sand and coral, 8 to 60 percent slopes","Beaches","sand and coral",90,null,80,12,34,0.8,"frequent","very brief","January, February, March, April, May, June, July, August, September, October, November, December","none"]
["PB646","Northern Mariana Islands",111,{"$f":"IF('Plant Control IR Template'!$V$2=B1623,C1623,\"\")","v":""},"471961","Beaches, black sand, 8 to 60 percent slopes","Beaches","black sand",90,null,80,12,34,0.8,"frequent","very brief","January, February, March, April, May, June, July, August, September, October, November, December","none"]
["PB646","Northern Mariana Islands",112,{"$f":"IF('Plant Control IR Template'!$V$2=B1624,C1624,\"\")","v":""},"471962","Benedicto silt loam, 0 to 8 percent slopes","Benedicto",null,85,null,80,0,0.5,4.5999999999999996,"none",null,null,"rare, occasional, frequent","very brief,brief","May, June, July, August, September, October, November"]
["PB646","Northern Mariana Islands",113,{"$f":"IF('Plant Control IR Template'!$V$2=B1625,C1625,\"\")","v":""},"471963","Cinder land, 0 to 8 percent slopes","Cinder land","rocky",85,null,80,45,5,0.8,"none",null,null,"none"]
["PB646","Northern Mariana Islands",114,{"$f":"IF('Plant Control IR Template'!$V$2=B1626,C1626,\"\")","v":""},"471964","Cinder land, 15 to 45 percent slopes","Cinder land",null,85,null,80,54,35,0.8,"none",null,null,"none"]
["PB646","Northern Mariana Islands",116,{"$f":"IF('Plant Control IR Template'!$V$2=B1627,C1627,\"\")","v":""},"471966","Cinder land, tuff substrate, 3 to 15 percent slopes","Cinder land","tuff substrate",95,null,80,0,6,null,"none",null,null,"none"]
["PB646","Northern Mariana Islands",117,{"$f":"IF('Plant Control IR Template'!$V$2=B1628,C1628,\"\")","v":""},"471967","Cinder land, tuff substrate, 15 to 60 percent slopes","Cinder land","tuff substrate",95,null,80,0,52,null,"none",null,null,"none"]
["PB646","Northern Mariana Islands",118,{"$f":"IF('Plant Control IR Template'!$V$2=B1629,C1629,\"\")","v":""},"471968","Cinder land complex, 0 to 25 percent slopes","Cinder land",null,45,null,80,54,12,0.8,"none",null,null,"none"]
["PB646","Northern Mariana Islands",118,{"$f":"IF('Plant Control IR Template'!$V$2=B1630,C1630,\"\")","v":""},"471968","Cinder land complex, 0 to 25 percent slopes","Cinder land","alluvial",45,null,80,54,5,1.3,"none",null,null,"none"]
["PB646","Northern Mariana Islands",119,{"$f":"IF('Plant Control IR Template'!$V$2=B1631,C1631,\"\")","v":""},"471969","Cinder land, `a`a lava substratum-Rock outcrop complex, 15 to 45 percent slopes","Cinder land","`a`a lava substratum",85,null,80,54,25,1.5,"none",null,null,"none"]
["PB646","Northern Mariana Islands",119,{"$f":"IF('Plant Control IR Template'!$V$2=B1632,C1632,\"\")","v":""},"471969","Cinder land, `a`a lava substratum-Rock outcrop complex, 15 to 45 percent slopes","Rock outcrop",null,10,"bedrock, lithic",0,0,25,0,"none",null,null,"none"]
["PB646","Northern Mariana Islands",120,{"$f":"IF('Plant Control IR Template'!$V$2=B1633,C1633,\"\")","v":""},"471970","Cinder land, `a`a lava substratum-Rock outcrop complex, 45 to 125 percent slopes","Cinder land","`a`a lava substratum",85,null,80,54,70,1.5,"none",null,null,"none"]
["PB646","Northern Mariana Islands",120,{"$f":"IF('Plant Control IR Template'!$V$2=B1634,C1634,\"\")","v":""},"471970","Cinder land, `a`a lava substratum-Rock outcrop complex, 45 to 125 percent slopes","Rock outcrop",null,10,"bedrock, lithic",0,0,70,0,"none",null,null,"none"]
["PB646","Northern Mariana Islands",121,{"$f":"IF('Plant Control IR Template'!$V$2=B1635,C1635,\"\")","v":""},"471971","Cinder land-Rock outcrop-Vitrandic Ustorthents complex, 10 to 45 percent slopes","Cinder land",null,45,null,80,54,25,0.8,"none",null,null,"none"]
["PB646","Northern Mariana Islands",121,{"$f":"IF('Plant Control IR Template'!$V$2=B1636,C1636,\"\")","v":""},"471971","Cinder land-Rock outcrop-Vitrandic Ustorthents complex, 10 to 45 percent slopes","Rock outcrop",null,25,"bedrock, lithic",0,0,25,0,"none",null,null,"none"]
["PB646","Northern Mariana Islands",121,{"$f":"IF('Plant Control IR Template'!$V$2=B1637,C1637,\"\")","v":""},"471971","Cinder land-Rock outcrop-Vitrandic Ustorthents complex, 10 to 45 percent slopes","Vitrandic Ustorthents",null,25,null,80,7,25,1.4,"none",null,null,"none"]
["PB646","Northern Mariana Islands",122,{"$f":"IF('Plant Control IR Template'!$V$2=B1638,C1638,\"\")","v":""},"471972","Cinder land-Rock outcrop-Vitrandic Ustorthents complex, 35 to 100 percent slopes","Cinder land",null,45,null,80,54,80,0.8,"none",null,null,"none"]
["PB646","Northern Mariana Islands",122,{"$f":"IF('Plant Control IR Template'!$V$2=B1639,C1639,\"\")","v":""},"471972","Cinder land-Rock outcrop-Vitrandic Ustorthents complex, 35 to 100 percent slopes","Rock outcrop",null,30,"bedrock, lithic",0,0,80,0,"none",null,null,"none"]
["PB646","Northern Mariana Islands",122,{"$f":"IF('Plant Control IR Template'!$V$2=B1640,C1640,\"\")","v":""},"471972","Cinder land-Rock outcrop-Vitrandic Ustorthents complex, 35 to 100 percent slopes","Vitrandic Ustorthents",null,20,null,80,7,45,1.4,"none",null,null,"none"]
["PB646","Northern Mariana Islands",123,{"$f":"IF('Plant Control IR Template'!$V$2=B1641,C1641,\"\")","v":""},"471973","Dekairu ashy fine sandy loam, 8 to 15 percent slopes","Dekairu",null,85,"bedrock, paralithic",27,34,12,3.5,"none",null,null,"none"]
["PB646","Northern Mariana Islands",124,{"$f":"IF('Plant Control IR Template'!$V$2=B1642,C1642,\"\")","v":""},"471974","Dekairu ashy fine sandy loam, 15 to 45 percent slopes","Dekairu",null,75,"bedrock, paralithic",27,34,34,3.5,"none",null,null,"none"]
["PB646","Northern Mariana Islands",125,{"$f":"IF('Plant Control IR Template'!$V$2=B1643,C1643,\"\")","v":""},"471975","Dekairu very gravelly ashy loamy fine sand, deep, 15 to 45 percent slopes","Dekairu","deep",75,"bedrock, paralithic",44,26,32,4,"none",null,null,"none"]
["PB646","Northern Mariana Islands",126,{"$f":"IF('Plant Control IR Template'!$V$2=B1644,C1644,\"\")","v":""},"471976","Dekairu, very gravelly ashy loamy fine sand, 45 to 100 percent slopes","Dekairu",null,80,"bedrock, paralithic",24,26,60,4.0999999999999996,"none",null,null,"none"]
["PB646","Northern Mariana Islands",127,{"$f":"IF('Plant Control IR Template'!$V$2=B1645,C1645,\"\")","v":""},"471977","Dekairu-Vitrandic Ustorthents, leveled land, association, 0 to 8 percent slopes","Dekairu","very gravelly loamy fine sand",45,"bedrock, paralithic",27,34,3,3.5,"none",null,null,"none"]
["PB646","Northern Mariana Islands",127,{"$f":"IF('Plant Control IR Template'!$V$2=B1646,C1646,\"\")","v":""},"471977","Dekairu-Vitrandic Ustorthents, leveled land, association, 0 to 8 percent slopes","Vitrandic Ustorthents","leveled land",30,"bedrock, paralithic",27,81,0.5,1.3,"none",null,null,"none"]
["PB646","Northern Mariana Islands",128,{"$f":"IF('Plant Control IR Template'!$V$2=B1647,C1647,\"\")","v":""},"471945","Vitrandic Ustorthents-Cinder land complex, 15 to 35 percent","Vitrandic Ustorthents",null,55,null,80,7,12,1.4,"none",null,null,"none"]
["PB646","Northern Mariana Islands",128,{"$f":"IF('Plant Control IR Template'!$V$2=B1648,C1648,\"\")","v":""},"471945","Vitrandic Ustorthents-Cinder land complex, 15 to 35 percent","Cinder land",null,30,null,80,54,25,0.8,"none",null,null,"none"]
["PB646","Northern Mariana Islands",129,{"$f":"IF('Plant Control IR Template'!$V$2=B1649,C1649,\"\")","v":""},"471894","Vitrandic Ustorthents-Cinder land complex, 35 to 99 percent","Vitrandic Ustorthents",null,55,null,80,7,40,1.4,"none",null,null,"none"]
["PB646","Northern Mariana Islands",129,{"$f":"IF('Plant Control IR Template'!$V$2=B1650,C1650,\"\")","v":""},"471894","Vitrandic Ustorthents-Cinder land complex, 35 to 99 percent","Cinder land",null,30,null,80,54,60,0.8,"none",null,null,"none"]
["PB646","Northern Mariana Islands",130,{"$f":"IF('Plant Control IR Template'!$V$2=B1651,C1651,\"\")","v":""},"471978","Vitrandic Ustorthents, colluvial, 8 to 15 percent slopes","Vitrandic Ustorthents","colluvial",90,null,80,45,13,1.4,"none",null,null,"none"]
["PB646","Northern Mariana Islands",131,{"$f":"IF('Plant Control IR Template'!$V$2=B1652,C1652,\"\")","v":""},"471979","Vitrandic Ustorthents, colluvial, 15 to 45 percent slopes","Vitrandic Ustorthents","colluvial",90,null,80,45,30,1.4,"none",null,null,"none"]
["PB646","Northern Mariana Islands",132,{"$f":"IF('Plant Control IR Template'!$V$2=B1653,C1653,\"\")","v":""},"471980","Hatisu-Apilam complex, 45 to 150 percent slopes","Hatisu",null,70,null,80,4,83,4.7,"none",null,null,"none"]
["PB646","Northern Mariana Islands",132,{"$f":"IF('Plant Control IR Template'!$V$2=B1654,C1654,\"\")","v":""},"471980","Hatisu-Apilam complex, 45 to 150 percent slopes","Apilam",null,20,"densic material",71,0,70,4.9000000000000004,"none",null,null,"none"]
["PB646","Northern Mariana Islands",133,{"$f":"IF('Plant Control IR Template'!$V$2=B1655,C1655,\"\")","v":""},"471981","Lava flows, coastal escarpments, 0 to 99 percent slopes","Lava flows","`a`a lava, coastal",80,"bedrock, lithic",0,0,40,null,"none",null,null,"none"]
["PB646","Northern Mariana Islands",133,{"$f":"IF('Plant Control IR Template'!$V$2=B1656,C1656,\"\")","v":""},"471981","Lava flows, coastal escarpments, 0 to 99 percent slopes","Rubble land",null,5,null,80,0,75,null,"none",null,null,"none"]
["PB646","Northern Mariana Islands",134,{"$f":"IF('Plant Control IR Template'!$V$2=B1657,C1657,\"\")","v":""},"471983","Plasanbola very gravely highly organic ashy loam, 15 to 35 percent slope","Plasanbola","highly organic ashy gravely loam",65,"bedrock, lithic",5,45,25,0.9,"none",null,null,"none"]
["PB646","Northern Mariana Islands",135,{"$f":"IF('Plant Control IR Template'!$V$2=B1658,C1658,\"\")","v":""},"471984","Plasanbola very gravely highly organic ashy loam, 35 to 125 percent slope","Plasanbola","highly organic ashy gravely loam",80,"bedrock, lithic",1,45,70,0.2,"none",null,null,"none"]
["PB646","Northern Mariana Islands",136,{"$f":"IF('Plant Control IR Template'!$V$2=B1659,C1659,\"\")","v":""},"471982","Plasanbola very gravely highly organic ashy loam, 8 to 15 percent slope","Plasanbola","highly organic ashy gravely loam",70,"bedrock, lithic",5,45,12,0.9,"none",null,null,"none"]
["PB646","Northern Mariana Islands",137,{"$f":"IF('Plant Control IR Template'!$V$2=B1660,C1660,\"\")","v":""},"471985","Plasanbola-Rock outcrop complex, 45 to 125 percent slopes","Plasanbola",null,65,"bedrock, lithic",1,45,100,0.2,"none",null,null,"none"]
["PB646","Northern Mariana Islands",137,{"$f":"IF('Plant Control IR Template'!$V$2=B1661,C1661,\"\")","v":""},"471985","Plasanbola-Rock outcrop complex, 45 to 125 percent slopes","Rock outcrop",null,25,"bedrock, lithic",0,0,80,0,"none",null,null,"none"]
["PB646","Northern Mariana Islands",138,{"$f":"IF('Plant Control IR Template'!$V$2=B1662,C1662,\"\")","v":""},"471986","Rock outcrop, escarpment-Rubble land complex, 45 to 150 percent slopes","Rock outcrop","scarp",45,"bedrock, lithic",0,0,67,0,"none",null,null,"none"]
["PB646","Northern Mariana Islands",138,{"$f":"IF('Plant Control IR Template'!$V$2=B1663,C1663,\"\")","v":""},"471986","Rock outcrop, escarpment-Rubble land complex, 45 to 150 percent slopes","Rubble land",null,45,null,80,0,75,null,"none",null,null,"none"]
["PB646","Northern Mariana Islands",139,{"$f":"IF('Plant Control IR Template'!$V$2=B1664,C1664,\"\")","v":""},"471987","Rock outcrop, tuff escarpments-Cinder land complex, 45 to 150 percent slopes","Rock outcrop","tuff",60,"bedrock, lithic",0,0,85,0,"none",null,null,"none"]
["PB646","Northern Mariana Islands",140,{"$f":"IF('Plant Control IR Template'!$V$2=B1665,C1665,\"\")","v":""},"471988","Haplustands-Rock outcrop-, 45 to 150 percent slopes complex","Haplustands","extremely stony",40,null,80,70,75,4.0999999999999996,"none",null,null,"none"]
["PB646","Northern Mariana Islands",140,{"$f":"IF('Plant Control IR Template'!$V$2=B1666,C1666,\"\")","v":""},"471988","Haplustands-Rock outcrop-, 45 to 150 percent slopes complex","Haplustands","moderately deep",40,null,80,0,75,4.3,"none",null,null,"none"]
["PB646","Northern Mariana Islands",140,{"$f":"IF('Plant Control IR Template'!$V$2=B1667,C1667,\"\")","v":""},"471988","Haplustands-Rock outcrop-, 45 to 150 percent slopes complex","Rock outcrop",null,15,"bedrock, lithic",0,0,99,0,"none",null,null,"none"]
["PB646","Northern Mariana Islands",141,{"$f":"IF('Plant Control IR Template'!$V$2=B1668,C1668,\"\")","v":""},"471989","Shomushon-Cinder land complex, 0 to 8 percent slopes","Shomushon",null,65,null,80,7,2,1.4,"none",null,null,"none"]
["PB646","Northern Mariana Islands",141,{"$f":"IF('Plant Control IR Template'!$V$2=B1669,C1669,\"\")","v":""},"471989","Shomushon-Cinder land complex, 0 to 8 percent slopes","Cinder land",null,15,null,80,54,5,1.3,"none",null,null,"none"]
["PB646","Northern Mariana Islands",142,{"$f":"IF('Plant Control IR Template'!$V$2=B1670,C1670,\"\")","v":""},"471991","Shomushon-Cinder land complex, 15 to 45 percent slopes","Shomushon",null,50,null,80,7,32,1.4,"none",null,null,"none"]
["PB646","Northern Mariana Islands",142,{"$f":"IF('Plant Control IR Template'!$V$2=B1671,C1671,\"\")","v":""},"471991","Shomushon-Cinder land complex, 15 to 45 percent slopes","Cinder land",null,30,null,80,60,35,1.4,"none",null,null,"none"]
["PB646","Northern Mariana Islands",143,{"$f":"IF('Plant Control IR Template'!$V$2=B1672,C1672,\"\")","v":""},"471990","Shomushon-Cinder land complex, 8 to 15 percent slopes","Shomushon",null,65,null,80,7,12,1.4,"none",null,null,"none"]
["PB646","Northern Mariana Islands",144,{"$f":"IF('Plant Control IR Template'!$V$2=B1673,C1673,\"\")","v":""},"471992","Songsong, ashy loam, 0 to 8 percent slopes","Songsong",null,70,null,80,22,5,2.4,"none",null,null,"none"]
["PB646","Northern Mariana Islands",145,{"$f":"IF('Plant Control IR Template'!$V$2=B1674,C1674,\"\")","v":""},"471994","Songsong, ashy loam, 15 to 45 percent slopes","Songsong",null,70,null,80,22,37,2.2999999999999998,"none",null,null,"none"]
["PB646","Northern Mariana Islands",146,{"$f":"IF('Plant Control IR Template'!$V$2=B1675,C1675,\"\")","v":""},"471995","Songsong, ashy loam, 45 to 100 percent slopes","Songsong",null,70,null,80,22,83,2.2999999999999998,"none",null,null,"none"]
["PB646","Northern Mariana Islands",147,{"$f":"IF('Plant Control IR Template'!$V$2=B1676,C1676,\"\")","v":""},"471993","Songsong, ashy loam, 8 to 15 percent slopes","Songsong",null,70,null,80,22,10,2.4,"none",null,null,"none"]
["PB646","Northern Mariana Islands",148,{"$f":"IF('Plant Control IR Template'!$V$2=B1677,C1677,\"\")","v":""},"471996","Vitrandic Ustorthents, cinder cones, 50 to 80 percent slopes","Vitrandic Ustorthents","cinder cones",75,null,80,55,61,1.4,"none",null,null,"none"]
["PB646","Northern Mariana Islands",149,{"$f":"IF('Plant Control IR Template'!$V$2=B1678,C1678,\"\")","v":""},"471997","Rock outcrop, volcanic craters, 0 to 150 percent slopes","Rock outcrop","Volcanic craters",95,null,80,0,75,null,"none",null,null,"none"]
["PB646","Northern Mariana Islands",149,{"$f":"IF('Plant Control IR Template'!$V$2=B1679,C1679,\"\")","v":""},"471997","Rock outcrop, volcanic craters, 0 to 150 percent slopes","Rubble land",null,5,null,80,0,75,null,"none",null,null,"none"]
["PB646","Northern Mariana Islands",150,{"$f":"IF('Plant Control IR Template'!$V$2=B1680,C1680,\"\")","v":""},"471998","Water","Water",null,100,null,80,0,0,null,"none",null,null,"none"]
["PB931","FSM",100,{"$f":"IF('Plant Control IR Template'!$V$2=B1681,C1681,\"\")","v":""},"465430","Dolen silty clay loam, 30 to 60 percent slopes","Dolen",null,75,null,80,9,45,3.5,"none",null,null,"none"]
["PB931","FSM",101,{"$f":"IF('Plant Control IR Template'!$V$2=B1682,C1682,\"\")","v":""},"465431","Finol very gravelly silty clay loam, 30 to 60 percent slopes","Finol",null,80,"bedrock, lithic",22,45,45,2.6,"none",null,null,"none"]
["PB931","FSM",102,{"$f":"IF('Plant Control IR Template'!$V$2=B1683,C1683,\"\")","v":""},"465432","Fomseng gravelly silty clay loam, 30 to 60 percent slopes","Fomseng",null,75,"bedrock, paralithic",18,21,45,3.1,"none",null,null,"none"]
["PB931","FSM",103,{"$f":"IF('Plant Control IR Template'!$V$2=B1684,C1684,\"\")","v":""},"465433","Fomseng gravelly silty clay loam, 60 to 100 percent slopes","Fomseng",null,80,"bedrock, paralithic",18,21,80,3.1,"none",null,null,"none"]
["PB931","FSM",104,{"$f":"IF('Plant Control IR Template'!$V$2=B1685,C1685,\"\")","v":""},"465434","Inkosr silty clay loam, 0 to 2 percent slopes","Inkosr",null,80,null,80,11,1,3.3,"occasional","brief","January, February, March, April, May, June, July, August, September, October, November, December","none"]
["PB931","FSM",105,{"$f":"IF('Plant Control IR Template'!$V$2=B1686,C1686,\"\")","v":""},"465435","Insak peaty loamy sand, 0 to 2 percent slopes","Insak",null,80,"bedrock, lithic",30,20,1,1.8,"frequent","very long","January, February, March, April, May, June, July, August, September, October, November, December","rare","very long"]
["PB931","FSM",106,{"$f":"IF('Plant Control IR Template'!$V$2=B1687,C1687,\"\")","v":""},"465436","Naniak mucky silt loam, 0 to 2 percent slopes","Naniak",null,80,null,80,10,1,4.3,"frequent","very long","January, February, March, April, May, June, July, August, September, October, November, December","rare","very long"]
["PB931","FSM",107,{"$f":"IF('Plant Control IR Template'!$V$2=B1688,C1688,\"\")","v":""},"465437","Nansepsep silty clay loam, 0 to 2 percent slopes","Nansepsep",null,80,null,80,13,1,3.2,"occasional","very brief","January, February, March, April, May, June, July, August, September, October, November, December","none"]
["PB931","FSM",108,{"$f":"IF('Plant Control IR Template'!$V$2=B1689,C1689,\"\")","v":""},"465438","Ngedebus loamy sand, 0 to 2 percent slopes","Ngedebus",null,85,null,80,21,1,1.3,"occasional","very brief","January, February, March, April, May, June, July, August, September, October, November, December","none"]
["PB931","FSM",109,{"$f":"IF('Plant Control IR Template'!$V$2=B1690,C1690,\"\")","v":""},"465439","Ngedebus-Urban land complex, 0 to 2 percent slopes","Ngedebus",null,50,null,80,21,1,1.3,"occasional","very brief","January, February, March, April, May, June, July, August, September, October, November, December","none"]
["PB931","FSM",109,{"$f":"IF('Plant Control IR Template'!$V$2=B1691,C1691,\"\")","v":""},"465439","Ngedebus-Urban land complex, 0 to 2 percent slopes","Urban land",null,40,null,80,0,1,0,"none",null,null,"none"]
["PB931","FSM",110,{"$f":"IF('Plant Control IR Template'!$V$2=B1692,C1692,\"\")","v":""},"465440","Ngedebus variant very cobbly loamy sand, 0 to 2 percent slopes","Ngedebus variant",null,85,null,80,51,1,0.6,"occasional","very brief","January, February, March, April, May, June, July, August, September, October, November, December","none"]
["PB931","FSM",111,{"$f":"IF('Plant Control IR Template'!$V$2=B1693,C1693,\"\")","v":""},"465441","Ngerungor mucky peat, 0 to 1 percent slopes","Ngerungor",null,85,null,80,0,1,4.9000000000000004,"frequent","very long","January, February, March, April, May, June, July, August, September, October, November, December","rare","very long"]
["PB931","FSM",112,{"$f":"IF('Plant Control IR Template'!$V$2=B1694,C1694,\"\")","v":""},"465442","Oatuu-Fomseng complex, 60 to 100 percent slopes","Oatuu",null,50,"bedrock, paralithic",8,40,80,1,"none",null,null,"none"]
["PB931","FSM",112,{"$f":"IF('Plant Control IR Template'!$V$2=B1695,C1695,\"\")","v":""},"465442","Oatuu-Fomseng complex, 60 to 100 percent slopes","Fomseng",null,30,"bedrock, paralithic",18,21,80,3.1,"none",null,null,"none"]
["PB931","FSM",113,{"$f":"IF('Plant Control IR Template'!$V$2=B1696,C1696,\"\")","v":""},"465443","Sonahnpil very stony silty clay loam, 0 to 5 percent slopes","Sonahnpil",null,80,null,80,47,3,2.2000000000000002,"occasional","very brief","January, February, March, April, May, June, July, August, September, October, November, December","none"]
["PB931","FSM",114,{"$f":"IF('Plant Control IR Template'!$V$2=B1697,C1697,\"\")","v":""},"465444","Tolonier very stony silty clay loam, 6 to 30 percent slopes","Tolonier",null,80,null,80,40,18,2.4,"none",null,null,"none"]
["PB931","FSM",115,{"$f":"IF('Plant Control IR Template'!$V$2=B1698,C1698,\"\")","v":""},"465445","Umpump very gravelly clay loam, 2 to 8 percent slopes","Umpump",null,80,"bedrock, paralithic",28,34,5,2.7,"none",null,null,"none"]
["PB931","FSM",116,{"$f":"IF('Plant Control IR Template'!$V$2=B1699,C1699,\"\")","v":""},"465446","Water","Water",null,100,null,80,0,null,null,"none",null,null,"none"]
["PB932","FSM",300,{"$f":"IF('Plant Control IR Template'!$V$2=B1700,C1700,\"\")","v":""},"465447","Dolekei-Fomseng association, 15 to 30 percent slopes","Dolekei",null,50,"bedrock, paralithic",29,20,23,3.6,"none",null,null,"none"]
["PB932","FSM",300,{"$f":"IF('Plant Control IR Template'!$V$2=B1701,C1701,\"\")","v":""},"465447","Dolekei-Fomseng association, 15 to 30 percent slopes","Fomseng",null,30,"bedrock, paralithic",14,20,23,2.5,"none",null,null,"none"]
["PB932","FSM",301,{"$f":"IF('Plant Control IR Template'!$V$2=B1702,C1702,\"\")","v":""},"465448","Dolekei-Fomseng association, 30 to 60 percent slopes","Dolekei",null,50,"bedrock, paralithic",29,20,45,3.6,"none",null,null,"none"]
["PB932","FSM",301,{"$f":"IF('Plant Control IR Template'!$V$2=B1703,C1703,\"\")","v":""},"465448","Dolekei-Fomseng association, 30 to 60 percent slopes","Fomseng",null,30,"bedrock, paralithic",14,20,45,2.5,"none",null,null,"none"]
["PB932","FSM",302,{"$f":"IF('Plant Control IR Template'!$V$2=B1704,C1704,\"\")","v":""},"465449","Dolekei-Fomseng association, 15 to 30 percent slopes, cobbly","Dolekei",null,50,"bedrock, paralithic",29,26,23,3.5,"none",null,null,"none"]
["PB932","FSM",302,{"$f":"IF('Plant Control IR Template'!$V$2=B1705,C1705,\"\")","v":""},"465449","Dolekei-Fomseng association, 15 to 30 percent slopes, cobbly","Fomseng",null,30,"bedrock, paralithic",14,21,23,2.6,"none",null,null,"none"]
["PB932","FSM",303,{"$f":"IF('Plant Control IR Template'!$V$2=B1706,C1706,\"\")","v":""},"465450","Dolekei-Fomseng association, 30 to 60 percent slopes, cobbly","Dolekei",null,50,"bedrock, paralithic",29,26,45,3.5,"none",null,null,"none"]
["PB932","FSM",303,{"$f":"IF('Plant Control IR Template'!$V$2=B1707,C1707,\"\")","v":""},"465450","Dolekei-Fomseng association, 30 to 60 percent slopes, cobbly","Fomseng",null,30,"bedrock, paralithic",14,21,45,2.6,"none",null,null,"none"]
["PB932","FSM",304,{"$f":"IF('Plant Control IR Template'!$V$2=B1708,C1708,\"\")","v":""},"465451","Dolen cobbly silty clay loam, 6 to 15 percent slopes","Dolen",null,80,null,80,16,11,3.3,"none",null,null,"none"]
["PB932","FSM",305,{"$f":"IF('Plant Control IR Template'!$V$2=B1709,C1709,\"\")","v":""},"465452","Dolen cobbly silty clay loam, 15 to 30 percent slopes","Dolen",null,80,null,80,16,23,3.3,"none",null,null,"none"]
["PB932","FSM",306,{"$f":"IF('Plant Control IR Template'!$V$2=B1710,C1710,\"\")","v":""},"465453","Fomseng-Dolekei association, 60 to 100 percent slopes","Fomseng",null,50,"bedrock, paralithic",14,17,80,2.7,"none",null,null,"none"]
["PB932","FSM",306,{"$f":"IF('Plant Control IR Template'!$V$2=B1711,C1711,\"\")","v":""},"465453","Fomseng-Dolekei association, 60 to 100 percent slopes","Dolekei",null,30,"bedrock, paralithic",29,20,80,3.6,"none",null,null,"none"]
["PB932","FSM",307,{"$f":"IF('Plant Control IR Template'!$V$2=B1712,C1712,\"\")","v":""},"465454","Fomseng variant silt loam, 15 to 30 percent slopes","Fomseng variant",null,80,"bedrock, paralithic",7,12,23,1.2,"none",null,null,"none"]
["PB932","FSM",308,{"$f":"IF('Plant Control IR Template'!$V$2=B1713,C1713,\"\")","v":""},"465455","Fomseng variant silt loam, 30 to 60 percent slopes","Fomseng variant",null,80,"bedrock, paralithic",7,12,45,1.2,"none",null,null,"none"]
["PB932","FSM",309,{"$f":"IF('Plant Control IR Template'!$V$2=B1714,C1714,\"\")","v":""},"465456","Inkosr gravelly sandy clay loam, 0 to 2 percent slopes","Inkosr",null,85,null,72,25,1,3.1,"occasional","brief","January, February, March, April, May, June, July, August, September, October, November, December","none"]
["PB932","FSM",310,{"$f":"IF('Plant Control IR Template'!$V$2=B1715,C1715,\"\")","v":""},"465457","Mesei variant mucky peat, 0 to 2 percent slopes","Mesei variant",null,75,"bedrock, lithic",24,0,1,4.9000000000000004,"frequent","very long","January, February, March, April, May, June, July, August, September, October, November, December","none","very long"]
["PB932","FSM",311,{"$f":"IF('Plant Control IR Template'!$V$2=B1716,C1716,\"\")","v":""},"465458","Naniak mucky silt loam, 0 to 2 percent slopes","Naniak",null,80,null,80,10,1,4.3,"frequent","very long","January, February, March, April, May, June, July, August, September, October, November, December","rare","very long"]
["PB932","FSM",312,{"$f":"IF('Plant Control IR Template'!$V$2=B1717,C1717,\"\")","v":""},"465459","Nansepsep silt loam, 0 to 2 percent slopes","Nansepsep",null,85,null,80,13,1,3.3,"occasional","very brief","January, February, March, April, May, June, July, August, September, October, November, December","none"]
["PB932","FSM",313,{"$f":"IF('Plant Control IR Template'!$V$2=B1718,C1718,\"\")","v":""},"465460","Ngedebus-Rubble land association, 0 to 2 percent slopes","Ngedebus",null,50,null,80,19,1,1.3,"occasional","very brief","January, February, March, April, May, June, July, August, September, October, November, December","none"]
["PB932","FSM",313,{"$f":"IF('Plant Control IR Template'!$V$2=B1719,C1719,\"\")","v":""},"465460","Ngedebus-Rubble land association, 0 to 2 percent slopes","Rubble land",null,30,null,80,0,1,null,"none",null,null,"none"]
["PB932","FSM",314,{"$f":"IF('Plant Control IR Template'!$V$2=B1720,C1720,\"\")","v":""},"465461","Rakied extremely gravelly sandy loam, 0 to 5 percent slopes","Rakied",null,80,null,80,54,3,1.3,"none",null,null,"none"]
["PB932","FSM",315,{"$f":"IF('Plant Control IR Template'!$V$2=B1721,C1721,\"\")","v":""},"465462","Rakied extremely gravelly sandy loam, 0 to 2 percent slopes, high water table","Rakied",null,85,null,80,54,1,1.3,"none",null,null,"none"]
["PB932","FSM",316,{"$f":"IF('Plant Control IR Template'!$V$2=B1722,C1722,\"\")","v":""},"465463","Rakied-Urban land complex, 0 to 5 percent slopes","Rakied",null,45,null,80,54,3,1.3,"none",null,null,"none"]
["PB932","FSM",316,{"$f":"IF('Plant Control IR Template'!$V$2=B1723,C1723,\"\")","v":""},"465463","Rakied-Urban land complex, 0 to 5 percent slopes","Urban land",null,35,null,80,0,3,0,"none",null,null,"none"]
["PB932","FSM",317,{"$f":"IF('Plant Control IR Template'!$V$2=B1724,C1724,\"\")","v":""},"465464","Sonahnpil very stony silty clay loam, 0 to 5 percent slopes","Sonahnpil",null,80,null,80,47,3,2.2000000000000002,"occasional","very brief","January, February, March, April, May, June, July, August, September, October, November, December","none"]
["PB932","FSM",318,{"$f":"IF('Plant Control IR Template'!$V$2=B1725,C1725,\"\")","v":""},"465465","Tolonier-Dolen association, 30 to 60 percent slopes","Tolonier",null,50,null,80,36,45,2.5,"none",null,null,"none"]
["PB932","FSM",318,{"$f":"IF('Plant Control IR Template'!$V$2=B1726,C1726,\"\")","v":""},"465465","Tolonier-Dolen association, 30 to 60 percent slopes","Dolen",null,30,null,80,16,45,3.3,"none",null,null,"none"]
["PB932","FSM",319,{"$f":"IF('Plant Control IR Template'!$V$2=B1727,C1727,\"\")","v":""},"465466","Tolonier-Dolen association, 60 to 100 percent slopes","Tolonier",null,45,null,80,36,80,2.5,"none",null,null,"none"]
["PB932","FSM",319,{"$f":"IF('Plant Control IR Template'!$V$2=B1728,C1728,\"\")","v":""},"465466","Tolonier-Dolen association, 60 to 100 percent slopes","Dolen",null,30,null,80,16,80,3.3,"none",null,null,"none"]
["PB932","FSM",320,{"$f":"IF('Plant Control IR Template'!$V$2=B1729,C1729,\"\")","v":""},"465467","Typic Troporthents-Urban land complex, 0 to 1 percent slopes","Typic Troporthents",null,50,null,80,0,1,null,"none",null,null,"none"]
["PB932","FSM",320,{"$f":"IF('Plant Control IR Template'!$V$2=B1730,C1730,\"\")","v":""},"465467","Typic Troporthents-Urban land complex, 0 to 1 percent slopes","Urban land",null,30,null,80,0,1,null,"none",null,null,"none"]
["PB932","FSM",321,{"$f":"IF('Plant Control IR Template'!$V$2=B1731,C1731,\"\")","v":""},"465468","Umpump silty clay loam, 2 to 8 percent slopes","Umpump",null,80,"bedrock, paralithic",28,20,5,2.9,"none",null,null,"none"]
["PB932","FSM",322,{"$f":"IF('Plant Control IR Template'!$V$2=B1732,C1732,\"\")","v":""},"465469","Umpump gravelly sandy clay loam, 2 to 15 percent slopes","Umpump",null,70,"bedrock, paralithic",28,29,9,2.8,"none",null,null,"none"]
["PB932","FSM",323,{"$f":"IF('Plant Control IR Template'!$V$2=B1733,C1733,\"\")","v":""},"465470","Umpump gravelly silty clay loam, 2 to 8 percent slopes","Umpump",null,80,"bedrock, paralithic",28,29,5,2.8,"none",null,null,"none"]
["PB932","FSM",324,{"$f":"IF('Plant Control IR Template'!$V$2=B1734,C1734,\"\")","v":""},"465471","Umpump very gravelly clay loam, 2 to 8 percent slopes","Umpump",null,70,"bedrock, paralithic",28,34,5,2.7,"none",null,null,"none"]
["PB932","FSM",325,{"$f":"IF('Plant Control IR Template'!$V$2=B1735,C1735,\"\")","v":""},"465472","Umpump-Urban land complex, 2 to 8 percent slopes","Umpump",null,45,"bedrock, paralithic",28,29,5,2.8,"none",null,null,"none"]
["PB932","FSM",325,{"$f":"IF('Plant Control IR Template'!$V$2=B1736,C1736,\"\")","v":""},"465472","Umpump-Urban land complex, 2 to 8 percent slopes","Urban land",null,35,null,80,0,5,0,"none",null,null,"none"]
["PB932","FSM",326,{"$f":"IF('Plant Control IR Template'!$V$2=B1737,C1737,\"\")","v":""},"465473","Wahrekdam very gravelly sandy loam, 2 to 8 percent slopes","Wahrekdam",null,75,"bedrock, lithic",32,42,5,2.4,"none",null,null,"none"]
["PB932","FSM","W",{"$f":"IF('Plant Control IR Template'!$V$2=B1738,C1738,\"\")","v":""},"465474","Water","Water",null,100,null,80,0,null,null,"none",null,null,"none"]
["PB933","FSM",200,{"$f":"IF('Plant Control IR Template'!$V$2=B1739,C1739,\"\")","v":""},"465475","Chia mucky peat, 0 to 2 percent slopes","Chia",null,85,null,80,0,1,4.9000000000000004,"frequent","very long","January, February, March, April, May, June, July, August, September, October, November, December","rare","very long"]
["PB933","FSM",201,{"$f":"IF('Plant Control IR Template'!$V$2=B1740,C1740,\"\")","v":""},"465476","Dolen silty clay loam, 6 to 12 percent slopes","Dolen",null,80,null,80,9,9,3.5,"none",null,null,"none"]
["PB933","FSM",202,{"$f":"IF('Plant Control IR Template'!$V$2=B1741,C1741,\"\")","v":""},"465477","Dolen silty clay loam, 12 to 30 percent slopes","Dolen",null,80,null,80,9,21,3.5,"none",null,null,"none"]
["PB933","FSM",203,{"$f":"IF('Plant Control IR Template'!$V$2=B1742,C1742,\"\")","v":""},"465478","Dolen silty clay loam, 30 to 50 percent slopes","Dolen",null,80,null,80,9,40,3.5,"none",null,null,"none"]
["PB933","FSM",204,{"$f":"IF('Plant Control IR Template'!$V$2=B1743,C1743,\"\")","v":""},"465479","Dolen silty clay loam, 50 to 75 percent slopes","Dolen",null,80,null,80,9,63,3.5,"none",null,null,"none"]
["PB933","FSM",205,{"$f":"IF('Plant Control IR Template'!$V$2=B1744,C1744,\"\")","v":""},"465480","Dublon loamy fine sand, 0 to 2 percent slopes","Dublon",null,85,null,80,13,1,2,"occasional","very brief","January, February, March, April, May, June, July, August, September, October, November, December","none"]
["PB933","FSM",206,{"$f":"IF('Plant Control IR Template'!$V$2=B1745,C1745,\"\")","v":""},"465481","Insak variant sandy peat, 0 to 2 percent slopes","Insak variant",null,85,"bedrock, lithic",18,11,1,3.3,"frequent","very long","January, February, March, April, May, June, July, August, September, October, November, December","rare","very long"]
["PB933","FSM",207,{"$f":"IF('Plant Control IR Template'!$V$2=B1746,C1746,\"\")","v":""},"465482","Mesei variant mucky peat, 0 to 2 percent slopes","Mesei variant",null,85,"bedrock, lithic",24,0,1,4.9000000000000004,"frequent","very long","January, February, March, April, May, June, July, August, September, October, November, December","none","very long"]
["PB933","FSM",208,{"$f":"IF('Plant Control IR Template'!$V$2=B1747,C1747,\"\")","v":""},"465483","Ngerungor mucky peat, 0 to 1 percent slopes","Ngerungor",null,85,null,80,0,1,4.9000000000000004,"frequent","very long","January, February, March, April, May, June, July, August, September, October, November, December","rare","very long"]
["PB933","FSM",209,{"$f":"IF('Plant Control IR Template'!$V$2=B1748,C1748,\"\")","v":""},"465484","Rock outcrop-Rubble land complex","Rock outcrop",null,50,"bedrock, lithic",0,0,50,0,"none",null,null,"none"]
["PB933","FSM",209,{"$f":"IF('Plant Control IR Template'!$V$2=B1749,C1749,\"\")","v":""},"465484","Rock outcrop-Rubble land complex","Rubble land",null,30,"bedrock, lithic",40,59,33,1,"none",null,null,"none"]
["PB933","FSM",210,{"$f":"IF('Plant Control IR Template'!$V$2=B1750,C1750,\"\")","v":""},"465485","Tolonier very stony silty clay loam, 6 to 12 percent slopes","Tolonier",null,75,null,80,39,9,2.4,"none",null,null,"none"]
["PB933","FSM",211,{"$f":"IF('Plant Control IR Template'!$V$2=B1751,C1751,\"\")","v":""},"465486","Tolonier very stony silty clay loam, 12 to 30 percent slopes","Tolonier",null,75,null,80,39,21,2.4,"none",null,null,"none"]
["PB933","FSM",212,{"$f":"IF('Plant Control IR Template'!$V$2=B1752,C1752,\"\")","v":""},"465487","Tolonier very stony silty clay loam, 30 to 50 percent slopes","Tolonier",null,75,null,80,39,40,2.4,"none",null,null,"none"]
["PB933","FSM",213,{"$f":"IF('Plant Control IR Template'!$V$2=B1753,C1753,\"\")","v":""},"465488","Tolonier very stony silty clay loam, 50 to 75 percent slopes","Tolonier",null,75,null,80,39,63,2.4,"none",null,null,"none"]
["PB933","FSM",214,{"$f":"IF('Plant Control IR Template'!$V$2=B1754,C1754,\"\")","v":""},"465489","Typic Troporthents-Urban land complex, 0 to 1 percent slopes","Typic Troporthents",null,50,null,80,0,1,null,"none",null,null,"none"]
["PB933","FSM",214,{"$f":"IF('Plant Control IR Template'!$V$2=B1755,C1755,\"\")","v":""},"465489","Typic Troporthents-Urban land complex, 0 to 1 percent slopes","Urban land",null,30,null,80,0,1,null,"none",null,null,"none"]
["PB933","FSM",215,{"$f":"IF('Plant Control IR Template'!$V$2=B1756,C1756,\"\")","v":""},"465490","Wahrekdam variant-Wahrekdam complex, 2 to 8 percent slopes","Wahrekdam Variant",null,50,"bedrock, lithic",12,48,5,1.4,"none",null,null,"none"]
["PB933","FSM",215,{"$f":"IF('Plant Control IR Template'!$V$2=B1757,C1757,\"\")","v":""},"465490","Wahrekdam variant-Wahrekdam complex, 2 to 8 percent slopes","Wahrekdam",null,35,"bedrock, lithic",32,42,5,2.4,"none",null,null,"none"]
["PB933","FSM",216,{"$f":"IF('Plant Control IR Template'!$V$2=B1758,C1758,\"\")","v":""},"465491","Water","Water",null,100,null,80,0,null,null,"none",null,null,"none"]
["PB934","FSM",500,{"$f":"IF('Plant Control IR Template'!$V$2=B1759,C1759,\"\")","v":""},"465492","Dechel mucky silt loam, 0 to 2 percent slopes","Dechel",null,90,null,80,0,1,3.5,"frequent","very long","January, February, March, April, May, June, July, August, September, October, November, December","rare","very long"]
["PB934","FSM",501,{"$f":"IF('Plant Control IR Template'!$V$2=B1760,C1760,\"\")","v":""},"465493","Dublon loamy fine sand, 0 to 4 percent slopes","Dublon",null,90,null,80,13,2,2,"occasional","very brief","January, February, March, April, May, June, July, August, September, October, November, December","none"]
["PB934","FSM",502,{"$f":"IF('Plant Control IR Template'!$V$2=B1761,C1761,\"\")","v":""},"465494","Dublon variant sandy clay loam, 0 to 4 percent slopes","Dublon variant",null,75,null,80,16,2,1.6,"occasional","very brief","January, February, March, April, May, June, July, August, September, October, November, December","none"]
["PB934","FSM",503,{"$f":"IF('Plant Control IR Template'!$V$2=B1762,C1762,\"\")","v":""},"465495","Gagil extremely gravelly loam, 2 to 12 percent slopes","Gagil",null,90,null,80,47,7,2.2999999999999998,"none",null,null,"none"]
["PB934","FSM",504,{"$f":"IF('Plant Control IR Template'!$V$2=B1763,C1763,\"\")","v":""},"465496","Gagil silty clay loam, 2 to 6 percent slopes","Gagil",null,95,null,80,6,4,2.8,"none",null,null,"none"]
["PB934","FSM",505,{"$f":"IF('Plant Control IR Template'!$V$2=B1764,C1764,\"\")","v":""},"465497","Gagil silty clay loam, 6 to 12 percent slopes","Gagil",null,95,null,80,6,9,2.8,"none",null,null,"none"]
["PB934","FSM",506,{"$f":"IF('Plant Control IR Template'!$V$2=B1765,C1765,\"\")","v":""},"465498","Gagil silty clay loam, 12 to 30 percent slopes","Gagil",null,90,null,80,6,21,2.8,"none",null,null,"none"]
["PB934","FSM",507,{"$f":"IF('Plant Control IR Template'!$V$2=B1766,C1766,\"\")","v":""},"465499","Gagil silty clay loam, 30 to 50 percent slopes","Gagil",null,85,null,80,6,40,2.8,"none",null,null,"none"]
["PB934","FSM",508,{"$f":"IF('Plant Control IR Template'!$V$2=B1767,C1767,\"\")","v":""},"465500","Gitam very gravelly silty clay loam, 0 to 2 percent slopes","Gitam",null,85,"bedrock, paralithic",35,28,1,2.8,"none",null,null,"none"]
["PB934","FSM",509,{"$f":"IF('Plant Control IR Template'!$V$2=B1768,C1768,\"\")","v":""},"465501","Gitam very gravelly silty clay loam, 2 to 6 percent slopes","Gitam",null,85,"bedrock, paralithic",35,28,4,2.8,"none",null,null,"none"]
["PB934","FSM",510,{"$f":"IF('Plant Control IR Template'!$V$2=B1769,C1769,\"\")","v":""},"465502","Gitam very gravelly silty clay loam, 6 to 12 percent slopes","Gitam",null,85,"bedrock, paralithic",35,28,9,2.8,"none",null,null,"none"]
["PB934","FSM",511,{"$f":"IF('Plant Control IR Template'!$V$2=B1770,C1770,\"\")","v":""},"465503","Ilachetomel peat, 0 to 1 percent slopes","Ilachetomel",null,75,null,80,0,1,4.9000000000000004,"frequent","very long","January, February, March, April, May, June, July, August, September, October, November, December","none","very long"]
["PB934","FSM",512,{"$f":"IF('Plant Control IR Template'!$V$2=B1771,C1771,\"\")","v":""},"465504","Mesei mucky peat, 0 to 1 percent slopes","Mesei",null,90,null,80,0,1,4.9000000000000004,"frequent","very long","January, February, March, April, May, June, July, August, September, October, November, December","rare","very long"]
["PB934","FSM",513,{"$f":"IF('Plant Control IR Template'!$V$2=B1772,C1772,\"\")","v":""},"465505","Ngedebus sand, 0 to 4 percent slopes","Ngedebus",null,85,null,80,22,2,1.2,"occasional","very brief","January, February, March, April, May, June, July, August, September, October, November, December","none"]
["PB934","FSM",514,{"$f":"IF('Plant Control IR Template'!$V$2=B1773,C1773,\"\")","v":""},"465506","Ngedebus variant very gravelly loamy sand, 0 to 6 percent slopes","Ngedebus variant",null,85,null,80,43,3,0.9,"occasional","very brief","January, February, March, April, May, June, July, August, September, October, November, December","none"]
["PB934","FSM",515,{"$f":"IF('Plant Control IR Template'!$V$2=B1774,C1774,\"\")","v":""},"465507","Ngersuul variant silty clay loam, 2 to 8 percent slopes","Ngersuul variant",null,75,null,80,19,5,2.6,"rare",null,null,"none"]
["PB934","FSM",516,{"$f":"IF('Plant Control IR Template'!$V$2=B1775,C1775,\"\")","v":""},"465508","Peleliu extremely cobbly silt loam, 0 to 8 percent slopes","Peleliu",null,90,"bedrock, lithic",12,51,4,1.1000000000000001,"none",null,null,"none"]
["PB934","FSM",517,{"$f":"IF('Plant Control IR Template'!$V$2=B1776,C1776,\"\")","v":""},"465509","Peleliu-Rock outcrop complex, 15 to 75 percent slopes","Peleliu",null,75,"bedrock, lithic",12,51,45,1.1000000000000001,"none",null,null,"none"]
["PB934","FSM",517,{"$f":"IF('Plant Control IR Template'!$V$2=B1777,C1777,\"\")","v":""},"465509","Peleliu-Rock outcrop complex, 15 to 75 percent slopes","Rock outcrop",null,25,"bedrock, lithic",0,0,45,0,"none",null,null,"none"]
["PB934","FSM",518,{"$f":"IF('Plant Control IR Template'!$V$2=B1778,C1778,\"\")","v":""},"465510","Rock outcrop, phosphate strip mine","Rock outcrop",null,99,null,80,0,null,null,"none",null,null,"none"]
["PB934","FSM",519,{"$f":"IF('Plant Control IR Template'!$V$2=B1779,C1779,\"\")","v":""},"465511","Rumung-Weloy complex, 12 to 30 percent slopes","Rumung",null,45,"bedrock, lithic",19,42,21,2.2999999999999998,"none",null,null,"none"]
["PB934","FSM",519,{"$f":"IF('Plant Control IR Template'!$V$2=B1780,C1780,\"\")","v":""},"465511","Rumung-Weloy complex, 12 to 30 percent slopes","Weloy",null,35,"bedrock, lithic",22,30,21,2.6,"none",null,null,"none"]
["PB934","FSM",520,{"$f":"IF('Plant Control IR Template'!$V$2=B1781,C1781,\"\")","v":""},"465512","Rumung-Weloy complex, 30 to 50 percent slopes","Rumung",null,45,"bedrock, lithic",19,42,40,2.2999999999999998,"none",null,null,"none"]
["PB934","FSM",520,{"$f":"IF('Plant Control IR Template'!$V$2=B1782,C1782,\"\")","v":""},"465512","Rumung-Weloy complex, 30 to 50 percent slopes","Weloy",null,35,"bedrock, lithic",22,30,40,2.6,"none",null,null,"none"]
["PB934","FSM",521,{"$f":"IF('Plant Control IR Template'!$V$2=B1783,C1783,\"\")","v":""},"465513","Rumung-Weloy complex, 50 to 75 percent slopes","Rumung",null,50,"bedrock, lithic",19,42,63,2.2999999999999998,"none",null,null,"none"]
["PB934","FSM",521,{"$f":"IF('Plant Control IR Template'!$V$2=B1784,C1784,\"\")","v":""},"465513","Rumung-Weloy complex, 50 to 75 percent slopes","Weloy",null,30,"bedrock, lithic",22,30,63,2.6,"none",null,null,"none"]
["PB934","FSM",522,{"$f":"IF('Plant Control IR Template'!$V$2=B1785,C1785,\"\")","v":""},"465514","Sonahnpil variant extremely gravelly silt loam, 0 to 4 percent slopes","Sonahnpil variant",null,85,null,80,55,2,1.7,"occasional","very brief","January, February, March, April, May, June, July, August, September, October, November, December","none"]
["PB934","FSM",523,{"$f":"IF('Plant Control IR Template'!$V$2=B1786,C1786,\"\")","v":""},"465515","Tabecheding variant silty clay loam, 0 to 4 percent slopes","Tabecheding variant",null,85,null,80,0,2,3.3,"frequent","very brief","January, February, March, April, May, June, July, August, September, October, November, December","none"]
["PB934","FSM",524,{"$f":"IF('Plant Control IR Template'!$V$2=B1787,C1787,\"\")","v":""},"465516","Typic Troporthents, severely eroded","Typic Troporthents",null,85,null,80,0,57,null,"none",null,null,"none"]
["PB934","FSM",525,{"$f":"IF('Plant Control IR Template'!$V$2=B1788,C1788,\"\")","v":""},"465517","Typic Troporthents-Urban land complex, 0 to 1 percent slopes","Urban land",null,60,null,80,0,1,null,"none",null,null,"none"]
["PB934","FSM",525,{"$f":"IF('Plant Control IR Template'!$V$2=B1789,C1789,\"\")","v":""},"465517","Typic Troporthents-Urban land complex, 0 to 1 percent slopes","Typic Troporthents",null,35,null,80,0,1,null,"none",null,null,"none"]
["PB934","FSM",526,{"$f":"IF('Plant Control IR Template'!$V$2=B1790,C1790,\"\")","v":""},"465518","Weloy-Rumung complex, 2 to 12 percent slopes","Weloy",null,55,"bedrock, lithic",22,30,7,2.6,"none",null,null,"none"]
["PB934","FSM",526,{"$f":"IF('Plant Control IR Template'!$V$2=B1791,C1791,\"\")","v":""},"465518","Weloy-Rumung complex, 2 to 12 percent slopes","Rumung",null,25,"bedrock, lithic",19,42,7,2.2999999999999998,"none",null,null,"none"]
["PB934","FSM",527,{"$f":"IF('Plant Control IR Template'!$V$2=B1792,C1792,\"\")","v":""},"465519","Yap silty clay loam, 0 to 2 percent slopes","Yap",null,90,null,80,5,1,3.3,"none",null,null,"none"]
["PB934","FSM",528,{"$f":"IF('Plant Control IR Template'!$V$2=B1793,C1793,\"\")","v":""},"465520","Yap silty clay loam, 2 to 6 percent slopes","Yap",null,90,null,80,5,4,3.3,"none",null,null,"none"]
["PB934","FSM",529,{"$f":"IF('Plant Control IR Template'!$V$2=B1794,C1794,\"\")","v":""},"465521","Yap silty clay loam, 6 to 12 percent slopes","Yap",null,90,null,80,5,9,3.3,"none",null,null,"none"]
["PB934","FSM",530,{"$f":"IF('Plant Control IR Template'!$V$2=B1795,C1795,\"\")","v":""},"465522","Yap silty clay loam, 12 to 30 percent slopes","Yap",null,85,null,80,5,21,3.3,"none",null,null,"none"]
["PB934","FSM",531,{"$f":"IF('Plant Control IR Template'!$V$2=B1796,C1796,\"\")","v":""},"465523","Water","Water",null,100,null,80,0,null,null,"none",null,null,"none"]
["PB935","Palau",600,{"$f":"IF('Plant Control IR Template'!$V$2=B1797,C1797,\"\")","v":""},"1859244","Aimeliik silt loam, 2 to 6 percent slopes","Aimeliik",null,85,"abrupt textural change",7,3,4,2.5,"none",null,null,"none"]
["PB935","Palau",601,{"$f":"IF('Plant Control IR Template'!$V$2=B1798,C1798,\"\")","v":""},"1859243","Aimeliik silt loam, 6 to 12 percent slopes","Aimeliik",null,85,"abrupt textural change",5,3,9,2.2999999999999998,"none",null,null,"none"]
["PB935","Palau",602,{"$f":"IF('Plant Control IR Template'!$V$2=B1799,C1799,\"\")","v":""},"1859242","Aimeliik silt loam, 12 to 30 percent slopes","Aimeliik",null,85,"abrupt textural change",10,3,21,2.6,"none",null,null,"none"]
["PB935","Palau",603,{"$f":"IF('Plant Control IR Template'!$V$2=B1800,C1800,\"\")","v":""},"1859241","Aimeliik silt loam, 30 to 50 percent slopes","Aimeliik",null,85,"abrupt textural change",5,3,40,2.2999999999999998,"none",null,null,"none"]
["PB935","Palau",604,{"$f":"IF('Plant Control IR Template'!$V$2=B1801,C1801,\"\")","v":""},"1859240","Aimeliik silt loam, 50 to 75 percent slopes","Aimeliik",null,85,"abrupt textural change",3,3,63,2.2000000000000002,"none",null,null,"none"]
["PB935","Palau",605,{"$f":"IF('Plant Control IR Template'!$V$2=B1802,C1802,\"\")","v":""},"1859256","Aimeliik silt loam, bedded tuff substratum, 2 to 6 percent slopes","Aimeliik","bedded tuff substratum",85,"abrupt textural change",7,3,4,2.4,"none",null,null,"none"]
["PB935","Palau",606,{"$f":"IF('Plant Control IR Template'!$V$2=B1803,C1803,\"\")","v":""},"1859257","Aimeliik silt loam, bedded tuff substratum, 6 to 12 percent slopes","Aimeliik","bedded tuff substratum",90,"abrupt textural change",3,3,9,2.2000000000000002,"none",null,null,"none"]
["PB935","Palau",607,{"$f":"IF('Plant Control IR Template'!$V$2=B1804,C1804,\"\")","v":""},"1859258","Aimeliik silt loam, bedded tuff substratum, 12 to 30 percent slopes","Aimeliik","bedded tuff substratum",90,"abrupt textural change",7,3,21,2.5,"none",null,null,"none"]
["PB935","Palau",608,{"$f":"IF('Plant Control IR Template'!$V$2=B1805,C1805,\"\")","v":""},"1859260","Aimeliik silt loam, volcanic bedded substratum, 30 to 50 percent slopes","Aimeliik","bedded tuff substratum",90,"abrupt textural change",4,3,40,2.2999999999999998,"none",null,null,"none"]
["PB935","Palau",609,{"$f":"IF('Plant Control IR Template'!$V$2=B1806,C1806,\"\")","v":""},"1859259","Aimeliik silty clay loam, bedded tuff substratum, 50 to 75 percent slopes","Aimeliik","bedded tuff substratum",90,"abrupt textural change",8,3,63,2.5,"none",null,null,"none"]
["PB935","Palau",610,{"$f":"IF('Plant Control IR Template'!$V$2=B1807,C1807,\"\")","v":""},"1859266","Aimeliik-Ollei complex, 30 to 50 percent slopes","Aimeliik",null,45,"abrupt textural change",11,9,35,2.6,"none",null,null,"none"]
["PB935","Palau",610,{"$f":"IF('Plant Control IR Template'!$V$2=B1808,C1808,\"\")","v":""},"1859266","Aimeliik-Ollei complex, 30 to 50 percent slopes","Ollei",null,30,"bedrock, lithic",13,44,50,1.3,"none",null,null,"none"]
["PB935","Palau",611,{"$f":"IF('Plant Control IR Template'!$V$2=B1809,C1809,\"\")","v":""},"1859267","Aimeliik-Ollei complex, 50 to 75 percent slopes","Aimeliik",null,40,"abrupt textural change",5,8,63,2.2999999999999998,"none",null,null,"none"]
["PB935","Palau",611,{"$f":"IF('Plant Control IR Template'!$V$2=B1810,C1810,\"\")","v":""},"1859267","Aimeliik-Ollei complex, 50 to 75 percent slopes","Ollei",null,35,"bedrock, lithic",15,46,70,1.5,"none",null,null,"none"]
["PB935","Palau",612,{"$f":"IF('Plant Control IR Template'!$V$2=B1811,C1811,\"\")","v":""},"1859271","Babelthuap-Ngardmau-Typic Udorthents, undifferentiated group, 2 to 6 percent slopes","Babelthuap",null,55,"abrupt textural change",3,14,4,1.6,"none",null,null,"none"]
["PB935","Palau",612,{"$f":"IF('Plant Control IR Template'!$V$2=B1812,C1812,\"\")","v":""},"1859271","Babelthuap-Ngardmau-Typic Udorthents, undifferentiated group, 2 to 6 percent slopes","Ngardmau",null,25,null,80,25,3,2.2000000000000002,"none",null,null,"none"]
["PB935","Palau",612,{"$f":"IF('Plant Control IR Template'!$V$2=B1813,C1813,\"\")","v":""},"1859271","Babelthuap-Ngardmau-Typic Udorthents, undifferentiated group, 2 to 6 percent slopes","Typic Udorthents",null,15,null,80,6,4,2.5,"none",null,null,"none"]
["PB935","Palau",613,{"$f":"IF('Plant Control IR Template'!$V$2=B1814,C1814,\"\")","v":""},"1859272","Babelthuap-Ngardmau-Typic Udorthents, undifferentiated group, 6 to 12 percent slopes","Babelthuap",null,55,"abrupt textural change",5,14,9,1.7,"none",null,null,"none"]
["PB935","Palau",613,{"$f":"IF('Plant Control IR Template'!$V$2=B1815,C1815,\"\")","v":""},"1859272","Babelthuap-Ngardmau-Typic Udorthents, undifferentiated group, 6 to 12 percent slopes","Ngardmau",null,25,null,80,14,9,2,"none",null,null,"none"]
["PB935","Palau",613,{"$f":"IF('Plant Control IR Template'!$V$2=B1816,C1816,\"\")","v":""},"1859272","Babelthuap-Ngardmau-Typic Udorthents, undifferentiated group, 6 to 12 percent slopes","Typic Udorthents",null,15,null,80,6,9,2.5,"none",null,null,"none"]
["PB935","Palau",614,{"$f":"IF('Plant Control IR Template'!$V$2=B1817,C1817,\"\")","v":""},"1859273","Babelthuap-Ngardmau-Typic Udorthents, undifferentiated group, 12 to 30 percent slopes","Babelthuap",null,45,"abrupt textural change",1,11,21,1.6,"none",null,null,"none"]
["PB935","Palau",614,{"$f":"IF('Plant Control IR Template'!$V$2=B1818,C1818,\"\")","v":""},"1859273","Babelthuap-Ngardmau-Typic Udorthents, undifferentiated group, 12 to 30 percent slopes","Ngardmau",null,30,null,80,12,21,2.2000000000000002,"none",null,null,"none"]
["PB935","Palau",614,{"$f":"IF('Plant Control IR Template'!$V$2=B1819,C1819,\"\")","v":""},"1859273","Babelthuap-Ngardmau-Typic Udorthents, undifferentiated group, 12 to 30 percent slopes","Typic Udorthents",null,20,null,80,6,21,2.5,"none",null,null,"none"]
["PB935","Palau",615,{"$f":"IF('Plant Control IR Template'!$V$2=B1820,C1820,\"\")","v":""},"1859274","Chia-Insak complex, 0 to 1 percent slopes","Chia",null,65,null,80,0,0.5,5.9,"very frequent","extremely brief","January, February, March, April, May, June, July, August, September, October, November, December","none"]
["PB935","Palau",615,{"$f":"IF('Plant Control IR Template'!$V$2=B1821,C1821,\"\")","v":""},"1859274","Chia-Insak complex, 0 to 1 percent slopes","Insak",null,30,"bedrock, lithic",29,9,0.5,1.8,"very frequent","extremely brief","January, February, March, April, May, June, July, August, September, October, November, December","none"]
["PB935","Palau",616,{"$f":"IF('Plant Control IR Template'!$V$2=B1822,C1822,\"\")","v":""},"1859275","Dechel silty clay, 0 to 2 percent slopes","Dechel",null,85,null,80,0,0,6.6,"frequent","extremely brief","January, February, March, April, May, June, July, August, September, October, November, December","frequent","long","January, February, March, April, May, June, July, August, September, October, November, December"]
["PB935","Palau",617,{"$f":"IF('Plant Control IR Template'!$V$2=B1823,C1823,\"\")","v":""},"1859277","Ilachetomel-Naniak complex, 0 to 1 slopes","Ilachetomel",null,75,null,80,0,0.5,5.9,"very frequent","extremely brief","January, February, March, April, May, June, July, August, September, October, November, December","none"]
["PB935","Palau",617,{"$f":"IF('Plant Control IR Template'!$V$2=B1824,C1824,\"\")","v":""},"1859277","Ilachetomel-Naniak complex, 0 to 1 slopes","Naniak",null,20,null,80,10,0.5,4.3,"very frequent","extremely brief","January, February, March, April, May, June, July, August, September, October, November, December","frequent","very long","January, February, March, April, May, June, July, August, September, October, November, December"]
["PB935","Palau",618,{"$f":"IF('Plant Control IR Template'!$V$2=B1825,C1825,\"\")","v":""},"1859276","Mesei-Dechel complex, 0 to 2 percent slopes","Mesei",null,55,null,80,0,0.5,5.9,"frequent","extremely brief","January, February, March, April, May, June, July, August, September, October, November, December","frequent","very long","January, February, March, April, May, June, July, August, September, October, November, December"]
["PB935","Palau",618,{"$f":"IF('Plant Control IR Template'!$V$2=B1826,C1826,\"\")","v":""},"1859276","Mesei-Dechel complex, 0 to 2 percent slopes","Dechel",null,30,null,80,0,1,6.5,"frequent","extremely brief","January, February, March, April, May, June, July, August, September, October, November, December","frequent","long","January, February, March, April, May, June, July, August, September, October, November, December"]
["PB935","Palau",619,{"$f":"IF('Plant Control IR Template'!$V$2=B1827,C1827,\"\")","v":""},"1859278","Nekken-Ollei complex, 12 to 30 percent slopes","Nekken",null,60,"bedrock, lithic",22,7,21,3.6,"none",null,null,"none"]
["PB935","Palau",619,{"$f":"IF('Plant Control IR Template'!$V$2=B1828,C1828,\"\")","v":""},"1859278","Nekken-Ollei complex, 12 to 30 percent slopes","Ollei",null,30,"bedrock, lithic",8,38,21,0.7,"none",null,null,"none"]
["PB935","Palau",620,{"$f":"IF('Plant Control IR Template'!$V$2=B1829,C1829,\"\")","v":""},"1859279","Ngardmau-Babelthuap-Typic Udorthents, undifferentiated group, 30 to 50 percent slopes","Ngardmau",null,50,null,80,3,35,2.4,"none",null,null,"none"]
["PB935","Palau",620,{"$f":"IF('Plant Control IR Template'!$V$2=B1830,C1830,\"\")","v":""},"1859279","Ngardmau-Babelthuap-Typic Udorthents, undifferentiated group, 30 to 50 percent slopes","Babelthuap",null,30,"abrupt textural change",2,7,35,2.2000000000000002,"none",null,null,"none"]
["PB935","Palau",620,{"$f":"IF('Plant Control IR Template'!$V$2=B1831,C1831,\"\")","v":""},"1859279","Ngardmau-Babelthuap-Typic Udorthents, undifferentiated group, 30 to 50 percent slopes","Typic Udorthents",null,15,null,80,6,35,2.5,"none",null,null,"none"]
["PB935","Palau",621,{"$f":"IF('Plant Control IR Template'!$V$2=B1832,C1832,\"\")","v":""},"1859280","Ngardmau-Babelthuap-Typic Udorthents, undifferentiated group, 50 to 75 percent slopes","Ngardmau",null,50,null,80,7,63,2.4,"none",null,null,"none"]
["PB935","Palau",621,{"$f":"IF('Plant Control IR Template'!$V$2=B1833,C1833,\"\")","v":""},"1859280","Ngardmau-Babelthuap-Typic Udorthents, undifferentiated group, 50 to 75 percent slopes","Babelthuap",null,30,"abrupt textural change",2,8,63,1.6,"none",null,null,"none"]
["PB935","Palau",621,{"$f":"IF('Plant Control IR Template'!$V$2=B1834,C1834,\"\")","v":""},"1859280","Ngardmau-Babelthuap-Typic Udorthents, undifferentiated group, 50 to 75 percent slopes","Typic Udorthents",null,15,null,80,6,63,2.5,"none",null,null,"none"]
["PB935","Palau",622,{"$f":"IF('Plant Control IR Template'!$V$2=B1835,C1835,\"\")","v":""},"1859281","Oxic Dystrudepts, 2 to 12 percent slopes","Oxic Dystrudepts",null,90,null,80,18,4,4.7,"none",null,null,"none"]
["PB935","Palau",623,{"$f":"IF('Plant Control IR Template'!$V$2=B1836,C1836,\"\")","v":""},"1859282","Oxic Dystrudepts, 12 to 30 percent slopes","Oxic Dystrudepts",null,90,null,80,3,31,4.9000000000000004,"none",null,null,"none"]
["PB935","Palau",624,{"$f":"IF('Plant Control IR Template'!$V$2=B1837,C1837,\"\")","v":""},"1859284","Ngatpang silty clay loam, 2 to 6 percent slopes","Ngatpang",null,80,null,80,2,4,4.3,"none",null,null,"none"]
["PB935","Palau",625,{"$f":"IF('Plant Control IR Template'!$V$2=B1838,C1838,\"\")","v":""},"1859283","Ngatpang silty clay loam, 6 to 12 percent slopes","Ngatpang",null,80,null,80,8,9,4.5,"none",null,null,"none"]
["PB935","Palau",626,{"$f":"IF('Plant Control IR Template'!$V$2=B1839,C1839,\"\")","v":""},"1859285","Ngatpang silty clay loam, 12 to 30 percent slopes","Ngatpang",null,75,null,80,3,21,4.4000000000000004,"none",null,null,"none"]
["PB935","Palau",627,{"$f":"IF('Plant Control IR Template'!$V$2=B1840,C1840,\"\")","v":""},"1859286","Ngatpang silty clay loam, well drained, 30 to 50 percent slopes","Ngatpang",null,80,null,80,4,40,4.5999999999999996,"none",null,null,"none"]
["PB935","Palau",628,{"$f":"IF('Plant Control IR Template'!$V$2=B1841,C1841,\"\")","v":""},"1859287","Ngedebus highly organic fine sandy loam, 0 to 3 percent slopes","Ngedebus",null,75,null,80,1,2,1.2,"occasional","very brief","January, February, March, April, May, June, July, August, September, October, November, December","none"]
["PB935","Palau",629,{"$f":"IF('Plant Control IR Template'!$V$2=B1842,C1842,\"\")","v":""},"1859288","Majuro extremely cobbly fine sandy loam, 2 to 6 percent slopes","Majuro",null,85,null,80,60,4,1.4,"occasional","very brief","January, February, March, April, May, June, July, August, September, October, November, December","none"]
["PB935","Palau",630,{"$f":"IF('Plant Control IR Template'!$V$2=B1843,C1843,\"\")","v":""},"1859289","Ngersuul silty clay loam, 0 to 2 percent slopes","Ngersuul",null,80,null,80,0,2,4.9000000000000004,"frequent","very brief","January, February, March, April, May, June, July, August, September, October, November, December","none"]
["PB935","Palau",631,{"$f":"IF('Plant Control IR Template'!$V$2=B1844,C1844,\"\")","v":""},"1859290","Odesangel peat, 0 to 1 percent slopes","Odesangel",null,80,null,80,0,1,5.4,"frequent","extremely brief","January, February, March, April, May, June, July, August, September, October, November, December","frequent","very long","January, February, March, April, May, June, July, August, September, October, November, December"]
["PB935","Palau",632,{"$f":"IF('Plant Control IR Template'!$V$2=B1845,C1845,\"\")","v":""},"1859268","Ollei-Nekken complex, 30 to 50 percent slopes","Ollei",null,50,"bedrock, lithic",16,44,40,1.6,"none",null,null,"none"]
["PB935","Palau",632,{"$f":"IF('Plant Control IR Template'!$V$2=B1846,C1846,\"\")","v":""},"1859268","Ollei-Nekken complex, 30 to 50 percent slopes","Nekken",null,30,"bedrock, lithic",24,30,40,3.7,"none",null,null,"none"]
["PB935","Palau",633,{"$f":"IF('Plant Control IR Template'!$V$2=B1847,C1847,\"\")","v":""},"1859269","Ollei-Nekken complex, 50 to 75 percent slopes","Ollei",null,55,"bedrock, lithic",13,45,63,1.4,"none",null,null,"none"]
["PB935","Palau",633,{"$f":"IF('Plant Control IR Template'!$V$2=B1848,C1848,\"\")","v":""},"1859269","Ollei-Nekken complex, 50 to 75 percent slopes","Nekken",null,25,"bedrock, lithic",24,15,63,3.2,"none",null,null,"none"]
["PB935","Palau",634,{"$f":"IF('Plant Control IR Template'!$V$2=B1849,C1849,\"\")","v":""},"1859270","Ollei-Rock Outcrop complex, 12 to 75 percent slopes","Ollei",null,50,"bedrock, lithic",8,38,44,0.6,"none",null,null,"none"]
["PB935","Palau",634,{"$f":"IF('Plant Control IR Template'!$V$2=B1850,C1850,\"\")","v":""},"1859270","Ollei-Rock Outcrop complex, 12 to 75 percent slopes","Rock outcrop",null,30,"bedrock, lithic",0,0,44,0,"none",null,null,"none"]
["PB935","Palau",635,{"$f":"IF('Plant Control IR Template'!$V$2=B1851,C1851,\"\")","v":""},"1859246","Palau silt loam, 2 to 6 percent slopes","Palau",null,85,null,80,3,4,1.4,"none",null,null,"none"]
["PB935","Palau",636,{"$f":"IF('Plant Control IR Template'!$V$2=B1852,C1852,\"\")","v":""},"1859245","Palau silty clay loam, 6 to 12 percent slopes","Palau",null,85,null,80,3,9,1.5,"none",null,null,"none"]
["PB935","Palau",637,{"$f":"IF('Plant Control IR Template'!$V$2=B1853,C1853,\"\")","v":""},"1859248","Palau silt loam, 12 to 30 percent slopes","Palau",null,85,null,80,3,21,1.2,"none",null,null,"none"]
["PB935","Palau",638,{"$f":"IF('Plant Control IR Template'!$V$2=B1854,C1854,\"\")","v":""},"1859247","Palau silt loam, 30 to 50 percent slopes","Palau",null,85,null,80,3,40,1.1000000000000001,"none",null,null,"none"]
["PB935","Palau",639,{"$f":"IF('Plant Control IR Template'!$V$2=B1855,C1855,\"\")","v":""},"1859249","Palau silt loam, 50 to 75 percent slopes","Palau",null,85,null,80,3,63,1.4,"none",null,null,"none"]
["PB935","Palau",640,{"$f":"IF('Plant Control IR Template'!$V$2=B1856,C1856,\"\")","v":""},"1859261","Palau silty clay loam, bedded tuff substratum, 2 to 6 percent slopes","Palau","bedded tuff substratum",75,null,80,3,4,1.7,"none",null,null,"none"]
["PB935","Palau",641,{"$f":"IF('Plant Control IR Template'!$V$2=B1857,C1857,\"\")","v":""},"1859262","Palau silt loam, bedded tuff substratum, 6 to 12 percent slopes","Palau","bedded tuff substratum",75,null,80,3,9,1.8,"none",null,null,"none"]
["PB935","Palau",642,{"$f":"IF('Plant Control IR Template'!$V$2=B1858,C1858,\"\")","v":""},"1859264","Palau silt loam, bedded tuff substratum, 12 to 30 percent slopes","Palau","bedded tuff substratum",75,null,80,3,21,1.3,"none",null,null,"none"]
["PB935","Palau",643,{"$f":"IF('Plant Control IR Template'!$V$2=B1859,C1859,\"\")","v":""},"1859265","Palau silty clay loam, bedded tuff substratum, 30 to 50 percent slopes","Palau","bedded tuff substratum",75,null,80,3,40,2,"none",null,null,"none"]
["PB935","Palau",644,{"$f":"IF('Plant Control IR Template'!$V$2=B1860,C1860,\"\")","v":""},"1859263","Palau silty clay loam, bedded tuff substratum, 50 to 75 percent slopes","Palau","bedded tuff substratum",75,null,80,3,63,1.3,"none",null,null,"none"]
["PB935","Palau",645,{"$f":"IF('Plant Control IR Template'!$V$2=B1861,C1861,\"\")","v":""},"1859291","Peleliu extremely cobbly clay loam, 0 to 4 percent slopes","Peleliu",null,70,"bedrock, lithic",12,62,2,1,"none",null,null,"none"]
["PB935","Palau",646,{"$f":"IF('Plant Control IR Template'!$V$2=B1862,C1862,\"\")","v":""},"1859293","Peleliu-Chelbacheb complex, 6 to 20 percent slopes","Peleliu",null,60,"bedrock, lithic",16,77,13,1.2,"none",null,null,"none"]
["PB935","Palau",646,{"$f":"IF('Plant Control IR Template'!$V$2=B1863,C1863,\"\")","v":""},"1859293","Peleliu-Chelbacheb complex, 6 to 20 percent slopes","Chelbacheb",null,25,"bedrock, lithic",8,60,13,2.4,"none",null,null,"none"]
["PB935","Palau",647,{"$f":"IF('Plant Control IR Template'!$V$2=B1864,C1864,\"\")","v":""},"1859292","Peleliu-Chelbacheb-Rock outcrop complex, 50 to 150 percent slopes","Peleliu",null,40,"bedrock, lithic",11,71,90,0.8,"none",null,null,"none"]
["PB935","Palau",647,{"$f":"IF('Plant Control IR Template'!$V$2=B1865,C1865,\"\")","v":""},"1859292","Peleliu-Chelbacheb-Rock outcrop complex, 50 to 150 percent slopes","Chelbacheb",null,30,"bedrock, lithic",8,60,90,2.4,"none",null,null,"none"]
["PB935","Palau",647,{"$f":"IF('Plant Control IR Template'!$V$2=B1866,C1866,\"\")","v":""},"1859292","Peleliu-Chelbacheb-Rock outcrop complex, 50 to 150 percent slopes","Rock outcrop",null,25,"bedrock, lithic",0,0,120,null,"none",null,null,"none"]
["PB935","Palau",648,{"$f":"IF('Plant Control IR Template'!$V$2=B1867,C1867,\"\")","v":""},"1859294","Tabecheding silty clay loam, 2 to 6 percent slopes","Tabecheding",null,85,"abrupt textural change",4,12,4,4.5999999999999996,"none",null,null,"occasional","very brief,brief","January, February, March, April, May, June, July, August, September, October, November, December"]
["PB935","Palau",649,{"$f":"IF('Plant Control IR Template'!$V$2=B1868,C1868,\"\")","v":""},"1859295","Tabecheding silty clay loam, 6 to 12 percent slopes","Tabecheding",null,80,"abrupt textural change",4,11,9,4.5999999999999996,"none",null,null,"occasional","very brief,brief","January, February, March, April, May, June, July, August, September, October, November, December"]
["PB935","Palau",650,{"$f":"IF('Plant Control IR Template'!$V$2=B1869,C1869,\"\")","v":""},"1859296","Aquic Dystrudepts, 2 to 12 percent slopes","Aquic Dystrudepts",null,90,null,80,13,9,3.1,"none",null,null,"occasional","very brief,brief","January, February, March, April, May, June, July, August, September, October, November, December"]
["PB935","Palau",651,{"$f":"IF('Plant Control IR Template'!$V$2=B1870,C1870,\"\")","v":""},"1859297","Tabecheding silty clay loam, 12 to 30 percent slopes","Tabecheding",null,80,"abrupt textural change",7,4,21,4.0999999999999996,"none",null,null,"occasional","very brief,brief","January, February, March, April, May, June, July, August, September, October, November, December"]
["PB935","Palau",652,{"$f":"IF('Plant Control IR Template'!$V$2=B1871,C1871,\"\")","v":""},"1859298","Aquic Dystrudepts, 12 to 30 percent slopes","Aquic Dystrudepts",null,75,null,80,15,21,4.5999999999999996,"none",null,null,"occasional","very brief,brief","January, February, March, April, May, June, July, August, September, October, November, December"]
["PB935","Palau",653,{"$f":"IF('Plant Control IR Template'!$V$2=B1872,C1872,\"\")","v":""},"1859299","Orthents, mined, 30 to 75 percent slopes","Typic Udorthents",null,45,null,80,16,40,2.4,"none",null,null,"none"]
["PB935","Palau",653,{"$f":"IF('Plant Control IR Template'!$V$2=B1873,C1873,\"\")","v":""},"1859299","Orthents, mined, 30 to 75 percent slopes","Typic Udorthents",null,40,null,80,15,4,2.5,"none",null,null,"none"]
["PB935","Palau",654,{"$f":"IF('Plant Control IR Template'!$V$2=B1874,C1874,\"\")","v":""},"1859300","Orthents-Urban Land complex, 0 to 50 percent slopes","Typic Udorthents",null,45,null,80,27,10,2.5,"none",null,null,"none"]
["PB935","Palau",654,{"$f":"IF('Plant Control IR Template'!$V$2=B1875,C1875,\"\")","v":""},"1859300","Orthents-Urban Land complex, 0 to 50 percent slopes","Urban land",null,40,"cemented horizon",0,0,5,0,"none",null,null,"none"]
["PB935","Palau",655,{"$f":"IF('Plant Control IR Template'!$V$2=B1876,C1876,\"\")","v":""},"1859301","Quarry","Quarry",null,100,null,80,0,45,null,"none",null,null,"none"]
["PB935","Palau",656,{"$f":"IF('Plant Control IR Template'!$V$2=B1877,C1877,\"\")","v":""},"1859302","Water, brackish","Water","brackish",100,null,80,0,0,null,"none",null,null,"none"]
["PB935","Palau",657,{"$f":"IF('Plant Control IR Template'!$V$2=B1878,C1878,\"\")","v":""},"1859303","Water, fresh","Water","fresh",100,null,80,0,0,null,"none",null,null,"none"]
["PB935","Palau",659,{"$f":"IF('Plant Control IR Template'!$V$2=B1879,C1879,\"\")","v":""},"1904870","Nekken-Ollei complex, lower fertility, 12 to 30 percent slopes","Nekken","lower fertility",60,"bedrock, lithic",24,40,21,3.6,"none",null,null,"none"]
["PB935","Palau",659,{"$f":"IF('Plant Control IR Template'!$V$2=B1880,C1880,\"\")","v":""},"1904870","Nekken-Ollei complex, lower fertility, 12 to 30 percent slopes","Ollei","lower fertility",30,"bedrock, lithic",8,38,21,1,"none",null,null,"none"]
["PB935","Palau",660,{"$f":"IF('Plant Control IR Template'!$V$2=B1881,C1881,\"\")","v":""},"1904871","Ollei-Rock Outcrop complex, lower fertility, 30 to 50 percent slopes","Ollei","lower fertility",50,"bedrock, lithic",17,18,40,1.8,"none",null,null,"none"]
["PB935","Palau",660,{"$f":"IF('Plant Control IR Template'!$V$2=B1882,C1882,\"\")","v":""},"1904871","Ollei-Rock Outcrop complex, lower fertility, 30 to 50 percent slopes","Rock outcrop",null,30,"bedrock, lithic",0,0,40,0,"none",null,null,"none"]
["PB935","Palau",661,{"$f":"IF('Plant Control IR Template'!$V$2=B1883,C1883,\"\")","v":""},"1904872","Ollei-Nekken complex, lower fertility, 50 to 75 percent slopes","Ollei","lower fertility",60,"bedrock, lithic",13,45,63,1.5,"none",null,null,"none"]
["PB935","Palau",661,{"$f":"IF('Plant Control IR Template'!$V$2=B1884,C1884,\"\")","v":""},"1904872","Ollei-Nekken complex, lower fertility, 50 to 75 percent slopes","Nekken","lower fertility",25,"bedrock, lithic",24,16,63,3.4,"none",null,null,"none"]
["PB936","Marshall Islands",1,{"$f":"IF('Plant Control IR Template'!$V$2=B1885,C1885,\"\")","v":""},"465580","Majuro very cobbly loamy sand","Majuro","very cobbly loamy sand",75,null,80,43,1,0.9,"occasional","very brief","January, February, March, April, May, June, July, August, September, October, November, December","none"]
["PB936","Marshall Islands",2,{"$f":"IF('Plant Control IR Template'!$V$2=B1886,C1886,\"\")","v":""},"465581","Majuro-Rubble land complex","Rubble land",null,30,null,80,95,1,1,"none",null,null,"none"]
["PB936","Marshall Islands",2,{"$f":"IF('Plant Control IR Template'!$V$2=B1887,C1887,\"\")","v":""},"465581","Majuro-Rubble land complex","Ngedebus","very gravelly loamy sand",9,null,80,50,1,1.2,"occasional","very brief","January, February, March, April, May, June, July, August, September, October, November, December","none"]
["PB936","Marshall Islands",3,{"$f":"IF('Plant Control IR Template'!$V$2=B1888,C1888,\"\")","v":""},"465582","Ngedebus loamy sand","Ngedebus","loamy sand",80,null,80,13,1,1.7,"rare",null,null,"none"]
["PB936","Marshall Islands",4,{"$f":"IF('Plant Control IR Template'!$V$2=B1889,C1889,\"\")","v":""},"465583","Ngedebus loamy sand, dark surface","Ngedebus","loamy sand",4,null,80,13,1,1.7,"rare",null,null,"none"]
["PB936","Marshall Islands",5,{"$f":"IF('Plant Control IR Template'!$V$2=B1890,C1890,\"\")","v":""},"465584","Ngedebus very gravelly loamy sand","Ngedebus","very gravelly loamy sand",80,null,80,50,1,1.2,"occasional","very brief","January, February, March, April, May, June, July, August, September, October, November, December","none"]
["PB936","Marshall Islands",6,{"$f":"IF('Plant Control IR Template'!$V$2=B1891,C1891,\"\")","v":""},"465585","Ngedebus very gravelly loamy sand, dark surface","Ngedebus","very gravelly loamy sand, dark surface",85,null,80,37,1,1.1000000000000001,"rare",null,null,"none"]
["PB936","Marshall Islands",7,{"$f":"IF('Plant Control IR Template'!$V$2=B1892,C1892,\"\")","v":""},"465586","Urban land-Ngedebus complex","Urban land",null,60,null,80,0,1,null,"none",null,null,"none"]
["PB936","Marshall Islands",7,{"$f":"IF('Plant Control IR Template'!$V$2=B1893,C1893,\"\")","v":""},"465586","Urban land-Ngedebus complex","Ngedebus","loamy sand",15,null,80,13,1,1.7,"occasional","very brief","January, February, March, April, May, June, July, August, September, October, November, December","none"]
["PB936","Marshall Islands",7,{"$f":"IF('Plant Control IR Template'!$V$2=B1894,C1894,\"\")","v":""},"465586","Urban land-Ngedebus complex","Ngedebus","very gravelly loamy sand",15,null,80,0,1,null,"none",null,null,"none"]
["PB936","Marshall Islands",8,{"$f":"IF('Plant Control IR Template'!$V$2=B1895,C1895,\"\")","v":""},"465588","Dumps","Dumps","landfill",100,null,80,0,0,null,"none",null,null,"none"]
["PB936","Marshall Islands","W",{"$f":"IF('Plant Control IR Template'!$V$2=B1896,C1896,\"\")","v":""},"465587","Water","Water",null,100,null,80,0,null,null,"none",null,null,"none"]

{"sheet":"CPPE","index":9,"n_rows":117,"n_cols":82,"rows_kept":117,"cut":false,"hidden":true,"merged":[[1,1,1,2],[0,1,0,2]]}
["Resource Concern","Planned Conservation Practice",null,"CPPE Score"]
["Soil Erosion - Classic Gully","Access Control"]
[]
[]
["PracticeName","Soil Erosion - Classic Gully","Soil Erosion Ephemeral Gully","Soil Erosion - Irrigation-induced","Soil Erosion - Mass Movement","Soil Erosion - Road, Road Sides and Construction Sites","Soil Erosion - Sheet and Rill","Soil Erosion - Shoreline","Soil Erosion - Streambank","Soil Erosion - Wind","Soil Condition - Compaction","Soil Condition - Contaminants - Residual Pesticides","Soil Condition - Contaminants - Salts and Other Chemicals","Soil Condition - Damage from Sediment Deposition","Soil Condition - Organic Matter Depletion","Soil Condition - Subsidence","Soil Condition - Contaminants-Animal Waste and Other Organics - N","Soil Condition - Contaminants-Animal Waste and Other Organics - P","Soil Condition - Contaminants-Animal Waste and Other Organics - K","Soil Condition - Contaminants-Commercial Fertilizer - N","Soil Condition - Contaminants-Commercial Fertilizer - P","Soil Condition - Contaminants-Commercial Fertilizer - K","Soil Condition - Rangeland Site Stability","Water Quantity - Aquifer Overdraft","Water Quantity - Drifted Snow","Water Quantity - Excessive Runoff, Flooding, or Ponding","Water Quantity - Excessive Seepage","Water Quantity - Excessive Subsurface Water","Water Quantity - Inadequate Outlets","Water Quantity - Inefficient Water Use on Irrigated Land","Water Quantity - Inefficient Water Use on Non-irrigated Land","Water Quantity - Insufficient Flows in Water Courses","Water Quantity - Reduced Capacity of Conveyances by Sediment Deposition","Water Quantity - Reduced Storage of Water Bodies by Sediment Accumulation","Water Quantity - Rangeland Hydrologic Cycle","Water Quality - Excessive Nutrients and Organics in Groundwater","Water Quality - Excessive Nutrients and Organics in Surface Water","Water Quality - Excessive Salinity in Groundwater","Water Quality - Excessive Salinity in Surface Water","Water Quality - Excessive Suspended Sediment and Turbidity in Surface Water","Water Quality - Harmful Levels of Heavy Metals in Groundwater","Water Quality - Harmful Levels of Heavy Metals in Surface Water","Water Quality - Harmful Levels of Pathogens in Groundwater","Water Quality - Harmful Levels of Pathogens in Surface Water","Water Quality - Harmful Levels of Pesticides in Groundwater","Water Quality - Harmful Levels of Pesticides in Surface Water","Water Quality - Harmful Levels of Petroleum in Groundwater","Water Quality - Harmful Levels of Petroleum in Surface Water","Water Quality - Harmful Temperatures of Surface Water","Air Quality - Adverse Air Temperature","Air Quality - Ammonia (NH3)","Air Quality - Chemical Drift","Excessive Greenhouse Gas - CH4 (methane)","Excessive Greenhouse Gas - CO2 (carbon dioxide)","Air Quality - Excessive Greenhouse Gas - N2O (nitrous oxide)","Air Quality - Excessive Ozone","Air Quality - Objectionable Odors","Air Quality - Particulate matter less than 10 micrometers in diameter (PM 10)","Air Quality - Particulate matter less than 2.5 micrometers in diameter (PM 2.5)","Air Quality - Reduced Visibility","Air Quality - Undesirable Air Movement","Plant Condition - Forage Quality and Palatability","Plant Condition - Noxious and Invasive Plants","Plant Condition - Plants not adapted or suited","Plant Condition - Productivity, Health and Vigor","Plant Condition - Threatened and Endangered Plant Species","Plant Condition - Wildfire Hazard","Plant Condition - T&E Plant Species: Declining Species, Species of Concern","Fish and Wildlife - Imbalance Among and Within Populations","Fish and Wildlife - Inadequate Cover/Shelter","Fish and Wildlife - Inadequate Food","Fish and Wildlife - Inadequate Space","Fish and Wildlife - Inadequate Water ","Fish and Wildlife - Threatened and Endangered Fish and Wildlife Species","Fish and Wildlife - Habitat Fragmentation","Fish and Wildlife - T&E Species: Declining Species, Species of Concern","Domestic Animals - Inadequate Stock Water","Domestic Animals - Inadequate Quantities and Quality of Feed and Forage","Domestic Animals - Inadequate Shelter ","Domestic Animals - Stress and Mortality","Energy - Inefficient Energy Use - Equipment and Facilities","Energy - Inefficient Energy Use – Farming / Ranching Practices and Field Operations"]
["Access Control",4,4,0,0,4,4,4,4,4,4,0,0,4,2,0,2,2,2,2,2,2,3,0,0,-1,1,2,1,0,3,2,4,3,3,1,2,0,0,2,1,1,1,2,0,1,1,2,0,0,0,0,0,1,0,0,0,2,2,1,0,4,4,3,4,5,3,5,5,5,5,5,2,5,5,5,0,4,0,4,0,0]
["Access Road",-1,0,0,-1,0,0,0,0,0,2,0,0,0,0,0,0,0,0,0,0,0,0,0,-2,-1,0,0,2,0,0,-1,0,0,0,0,0,0,0,1,0,0,0,0,0,0,-1,-1,0,0,0,0,0,0,0,0,0,-2,-2,4,0,0,-3,5,2,0,4,0,0,0,0,-2,0,0,-1,0,0,0,0,0,0,0]
["Agrichemical Handling Facility",0,0,0,0,0,0,0,0,0,0,5,0,0,0,0,0,0,0,5,5,5,0,0,0,0,0,0,0,0,0,0,0,0,0,5,5,0,0,0,0,0,0,0,5,5,0,0,0,0,0,0,0,0,0,0,0,0,0,0,0,0,0,0,0,0,0,0,0,0,0,0,0,0,0,0,0,0,0,0,0,0]
["Alley Cropping",3,5,0,0,0,5,0,0,5,2,3,2,3,5,0,4,4,4,4,4,4,0,-2,0,0,2,2,2,0,1,-2,1,4,0,1,2,1,1,2,1,1,0,2,2,3,0,1,0,4,0,5,0,2,0,0,0,2,2,4,4,4,4,5,5,0,0,0,2,3,3,3,0,0,3,0,0,3,0,0,0,0]
["Anaerobic Digestor",0,0,0,0,0,0,0,0,0,0,0,0,0,0,0,0,0,0,0,0,0,0,0,0,0,0,0,0,0,0,0,0,0,0,0,0,0,0,0,0,0,0,0,0,0,0,0,0,null,null,null,null,null,null,null,null,null,null,null,null,0,0,0,0,0,0,0,0,0,0,0,0,0,0,0,0,0,0,0,0,0]
["Animal Trails and Walkways",0,0,0,0,0,0,0,0,0,3,0,0,0,0,0,0,0,0,0,0,0,0,0,0,0,0,0,0,0,0,0,0,0,0,0,0,0,0,1,0,0,0,0,0,0,0,0,0,0,0,0,0,0,0,0,0,0,0,0,0,0,-1,0,0,1,0,1,0,0,0,-1,0,0,-1,0,0,0,0,1,0,0]
["Aquatic Organism Passage",0,0,0,0,0,0,3,3,0,0,0,0,0,0,0,0,0,0,0,0,0,0,0,0,-3,0,0,1,0,0,3,2,-4,0,0,0,0,0,0,0,0,0,0,0,0,0,0,3,0,0,0,0,0,0,0,0,0,0,0,0,0,0,0,0,0,0,0,4,4,4,4,4,0,4,0,0,0,0,0,0,0]
["Brush Management",3,3,0,-2,0,3,1,1,3,-1,-1,2,2,3,0,0,0,0,0,0,0,3,1,0,2,-2,-2,1,1,2,3,3,3,3,0,0,0,1,3,0,1,0,0,-1,-1,0,0,0,-2,0,-2,0,0,0,0,0,0,0,0,0,4,4,4,3,0,4,3,3,3,3,3,0,3,3,3,0,4,-2,3,0,0]
["Clearing and Snagging",0,0,0,0,0,0,0,3,0,0,0,0,0,0,0,0,0,0,0,0,0,0,0,0,2,0,0,2,0,0,0,2,2,0,0,0,0,0,0,0,0,0,0,0,0,0,0,-1,0,0,0,0,0,0,0,0,0,0,0,0,0,0,0,0,0,0,0,0,-2,-2,-2,-1,0,-2,-1,0,0,0,0,0,0]
["Composting Facility",0,0,0,0,0,0,0,0,0,0,0,0,0,0,0,2,2,2,2,2,2,0,0,0,0,0,0,0,0,0,0,0,0,0,2,2,0,0,0,0,0,2,2,0,0,0,0,0,0,0,0,-1,0,0,0,3,0,0,0,0,0,1,0,0,0,0,0,0,0,0,0,0,0,0,0,0,0,0,0,1,1]
["Conservation Cover",3,5,0,1,0,5,0,3,5,3,3,2,3,3,0,2,2,2,2,2,2,0,1,0,2,2,2,1,0,2,0,3,3,0,2,2,1,1,3,1,2,2,1,3,3,0,0,0,0,0,0,0,1,0,0,0,2,2,1,0,0,4,4,4,3,0,3,3,2,2,2,0,3,2,3,0,0,0,0,1,1]
["Conservation Crop Rotation",1,2,1,0,0,4,0,0,4,2,3,2,3,3,0,4,4,4,4,4,4,0,1,0,2,1,1,0,2,2,0,3,3,0,3,3,2,1,3,1,1,1,1,3,3,0,0,0,0,1,1,0,1,0,0,0,2,2,1,0,0,3,4,4,0,0,0,1,1,1,1,0,0,1,0,0,3,0,0,0,2]
["Contour Buffer Strips",1,2,0,0,0,4,0,1,0,0,0,0,0,0,0,0,0,0,0,0,0,0,0,0,1,-2,-1,0,0,1,0,4,2,0,-1,3,-1,1,3,0,3,-1,1,0,2,0,0,0,0,0,0,0,1,0,0,0,1,1,1,0,0,4,5,3,0,0,0,0,2,2,2,0,0,2,0,0,1,0,0,1,1]
["Contour Farming",1,2,1,0,0,3,0,1,0,0,-1,0,4,2,0,0,0,0,0,0,0,0,0,0,1,-2,-1,0,0,1,0,4,2,0,-1,3,-1,1,3,0,2,0,1,-1,1,0,0,0,0,0,0,0,0,0,0,0,0,0,0,0,0,0,0,1,0,0,0,0,0,0,0,0,0,0,1,0,0,0,0,1,1]
["Contour Orchard and Other Perennial Crops",1,2,1,0,0,3,0,1,0,0,-1,0,4,2,0,0,0,0,0,0,0,0,0,0,1,-2,-1,0,1,1,0,4,2,0,-1,3,-1,1,3,0,2,0,1,-1,1,0,0,0,0,0,0,0,0,0,0,0,0,0,1,2,0,0,0,1,0,0,0,0,0,0,0,0,0,0,1,0,0,0,0,1,1]
["Cover Crop",1,4,1,0,0,4,0,0,4,2,2,1,2,3,0,2,2,2,2,2,2,0,1,0,2,1,1,0,0,3,0,3,3,0,2,2,1,0,2,1,1,2,1,2,2,0,0,0,0,2,0,0,2,1,1,0,3,2,3,0,2,3,5,3,0,0,0,2,2,2,2,0,0,2,0,0,3,0,0,0,2]
["Critical Area Planting",4,2,0,0,5,5,4,4,5,3,1,1,3,5,0,0,0,0,0,0,0,5,0,0,0,0,0,0,0,0,0,5,4,3,1,2,0,0,4,1,2,1,1,0,0,0,0,0,0,0,0,0,1,0,0,0,3,3,2,0,0,4,5,5,1,0,1,1,2,2,2,0,0,2,0,0,1,0,0,0,0]
["Cross Wind Trap Strips",0,0,0,0,0,0,0,0,4,0,0,0,2,2,0,0,0,0,0,0,0,0,0,0,0,0,0,0,0,0,0,4,4,0,0,2,0,1,1,0,0,0,0,0,2,0,0,0,0,0,0,0,1,0,0,0,2,2,2,0,0,4,5,3,0,0,0,0,2,2,2,0,0,2,0,0,1,0,0,0,0]
["Dam",3,0,0,0,0,0,-2,1,0,0,0,0,2,0,0,0,0,0,0,0,0,0,1,0,2,-2,-1,0,3,0,-1,3,0,0,-1,0,0,0,3,0,0,0,-2,0,0,0,0,0,0,0,0,0,0,0,0,0,0,0,0,0,0,0,0,0,0,0,0,2,3,2,2,1,0,-4,0,4,0,0,4,0,0]
["Deep Tillage",1,1,1,-1,0,2,0,1,0,5,2,2,2,0,0,2,2,2,2,2,2,0,1,0,2,-2,-2,1,2,2,0,2,2,0,-2,3,-2,2,2,-1,3,-1,3,-2,3,0,3,0,0,1,0,0,0,0,0,0,0,0,0,0,1,-1,0,3,0,0,0,0,0,0,0,0,0,0,0,0,2,0,0,0,0]
["Dike",1,0,0,0,3,0,0,-2,0,0,0,0,0,0,0,0,0,0,0,0,0,0,0,0,3,-1,-1,-2,0,0,0,1,-1,0,0,0,0,0,0,0,0,0,0,2,2,0,0,0,0,0,0,0,0,0,0,0,0,0,0,0,0,0,0,0,0,0,0,0,-3,-3,1,1,0,-1,0,0,0,0,0,0,0]
["Diversion",3,3,0,2,2,1,0,1,0,0,0,0,2,0,0,0,0,0,0,0,0,0,0,0,3,-1,2,-2,2,2,1,2,2,0,-1,0,0,0,2,0,1,0,1,1,-1,0,-1,0,0,0,0,0,0,0,0,0,0,0,0,0,0,0,0,2,0,0,0,0,0,0,0,0,0,0,0,0,0,0,0,0,0]
["Dust Control from Animal Activity on Open Lot Surfaces",0,0,0,0,0,0,0,0,0,0,0,0,0,0,0,0,0,0,0,0,0,0,-1,0,0,0,0,0,0,0,0,0,0,0,0,0,0,0,0,0,0,0,0,0,0,0,0,0,0,0,0,0,0,0,0,0,4,4,3,0,0,0,0,0,0,0,0,0,0,0,0,0,0,0,0,0,0,0,3,0,0]
["Fence",1,0,0,0,0,0,0,3,0,0,0,0,0,0,0,0,0,0,0,0,0,0,0,0,0,0,0,0,0,0,0,0,0,0,0,0,0,0,0,0,0,0,0,0,0,0,0,0,0,0,0,0,0,0,0,0,0,0,0,0,0,3,0,0,0,0,0,0,0,0,-2,0,0,-2,0,0,1,4,4,0,0]
["Field Border",1,1,0,0,0,1,1,1,4,3,2,1,2,4,0,2,2,2,2,2,2,0,0,0,2,-2,-1,0,0,0,-1,2,2,0,2,2,1,0,3,1,1,0,1,2,2,0,1,0,2,2,0,0,1,0,0,0,1,1,1,1,0,3,5,5,1,0,1,2,2,3,3,0,3,2,3,0,0,0,0,0,0]
["Filter Strip",0,0,0,0,0,0,0,0,0,5,2,1,1,1,0,2,2,2,2,2,2,0,0,0,0,0,0,0,0,0,-1,5,5,0,3,5,1,1,5,1,4,1,1,1,3,0,1,0,0,0,0,0,1,0,0,0,1,1,0,0,0,4,5,5,1,0,1,1,3,3,3,0,0,1,0,0,1,0,0,0,0]
["Firebreak",-1,-1,0,0,0,-1,0,0,-1,-2,-1,0,0,-4,0,0,0,0,0,0,0,0,0,0,0,0,0,0,0,0,0,-1,-1,0,0,0,0,0,-1,0,0,0,0,0,0,0,0,0,0,0,0,0,4,0,1,0,0,0,2,0,0,-2,5,3,3,5,3,0,0,0,-1,0,0,0,0,0,0,0,0,0,0]
["Fish Raceway or Tank",0,0,0,0,0,0,0,0,0,0,0,0,0,0,0,0,0,0,0,0,0,0,-2,0,0,0,0,0,0,0,-2,0,0,0,-1,-1,0,-1,0,0,0,-1,-1,0,0,0,0,-1,0,0,0,0,0,0,0,0,0,0,0,0,0,0,0,0,0,0,0,0,0,0,0,0,0,0,0,0,0,0,4,0,0]
["Fishpond Management",0,0,0,0,0,0,0,0,0,0,0,0,0,0,0,0,0,0,0,0,0,0,0,0,0,0,0,0,0,0,2,0,0,0,-2,0,0,0,0,0,0,0,0,0,0,0,0,0,0,0,0,0,0,0,1,0,-1,-1,0,0,0,4,4,4,1,0,1,3,4,4,4,2,0,0,0,0,0,0,0,0,0]
["Forage and Biomass Planting",1,4,3,0,0,4,0,0,4,4,2,3,2,4,0,4,4,4,4,4,4,0,0,0,2,0,1,1,0,2,1,1,2,0,2,2,1,1,2,1,1,1,1,2,2,0,0,0,0,-1,0,0,1,0,0,0,2,2,0,0,5,4,5,5,0,0,0,1,3,3,1,0,3,0,3,0,5,0,3,0,0]
["Forest Stand Improvement",1,1,0,-2,0,1,0,0,0,-2,0,0,0,-2,0,2,2,2,2,2,2,0,1,0,3,-2,-2,-1,0,3,3,1,1,0,3,3,0,1,0,1,1,1,3,2,2,0,1,-1,-2,0,-1,0,4,0,0,0,0,0,-1,-1,4,4,4,5,3,5,3,3,3,3,3,3,3,3,3,0,4,0,3,1,1]
["Forest Trails and Landings",1,-1,0,0,0,-1,0,0,0,-4,0,0,1,0,0,0,0,0,0,0,0,0,0,0,0,0,0,0,0,0,0,0,0,0,0,1,0,0,0,0,0,0,0,0,0,-1,0,0,0,0,0,0,0,0,0,0,0,0,0,0,0,4,4,2,-3,2,-3,-1,-1,-1,-1,-1,-3,-1,-3,0,2,0,0,0,0]
["Fuel Break",-2,-2,0,0,0,-2,0,0,-2,-2,-1,0,0,-1,0,0,0,0,0,0,0,0,0,0,0,0,0,0,0,0,0,-1,-1,0,0,0,0,0,-1,0,0,0,-1,-1,0,0,0,0,0,0,0,0,4,0,1,0,0,0,2,0,0,-2,5,3,3,5,3,0,0,0,-1,0,3,0,3,0,0,0,0,0,0]
["Grade Stabilization Structure",3,0,0,0,0,0,0,3,0,0,0,0,0,0,0,0,0,0,0,0,0,0,0,0,0,0,0,0,0,0,0,1,1,0,0,0,0,0,2,0,0,0,0,0,0,0,0,0,0,0,0,0,0,0,0,0,0,0,0,0,0,0,0,0,1,0,3,0,2,2,0,1,0,0,0,0,0,0,0,0,0]
["Grassed Waterway",4,5,0,0,2,0,1,1,0,0,-1,-1,1,2,0,-1,-1,-1,-1,-1,-1,0,0,0,3,0,2,4,0,0,0,2,2,0,0,2,0,0,2,0,1,0,1,0,2,0,1,0,0,0,0,0,1,0,0,0,0,0,0,0,0,4,4,5,0,0,0,0,1,1,1,1,0,1,0,0,1,0,0,1,1]
["Grazing Land Mechanical Treatment",1,3,1,-1,0,3,1,1,2,4,0,1,2,2,0,0,-1,0,0,0,0,4,0,0,2,-1,-1,2,2,2,0,1,1,5,-1,2,0,2,2,-1,1,-1,2,-2,2,0,0,0,0,0,0,0,1,0,0,0,-2,-1,0,0,4,-1,3,4,0,0,0,0,2,2,0,1,0,0,0,0,4,0,1,0,0]
["Heavy Use Area Protection",0,3,0,0,3,3,3,3,3,-1,0,0,2,0,0,0,0,0,0,0,0,3,0,0,0,0,0,0,0,0,0,2,2,3,0,1,0,0,2,0,0,0,2,0,0,1,2,0,0,0,0,0,0,0,0,0,2,2,1,0,0,4,0,3,0,0,0,0,0,0,0,0,0,0,0,0,0,0,3,0,0]
["Hedgerow Planting",0,0,0,0,0,0,0,0,1,1,0,0,-1,2,0,0,0,0,0,0,0,0,0,2,0,0,0,0,0,0,0,0,0,0,0,2,0,0,0,0,0,0,0,0,1,0,0,1,4,2,2,0,1,0,0,2,2,2,2,5,0,4,5,3,3,0,3,1,4,4,4,0,0,2,0,0,0,1,0,0,0]
["Herbaceous Weed Control",3,3,1,0,0,3,1,1,3,0,0,0,0,0,0,0,0,0,0,0,0,0,1,0,2,-2,-2,1,0,2,3,3,3,3,0,0,-1,1,3,0,1,0,0,-1,-1,0,0,0,0,0,0,0,0,0,0,0,0,0,0,0,4,4,4,3,0,0,0,3,3,0,3,0,0,3,0,0,4,0,3,0,0]
["Herbaceous Wind Barriers",0,-1,0,0,0,-1,0,0,4,0,0,0,2,2,0,0,0,0,0,0,0,0,0,2,0,0,0,0,0,3,0,2,1,0,0,1,0,1,1,0,1,0,0,0,1,0,0,0,0,0,2,0,1,0,0,0,3,2,2,5,2,3,5,3,0,0,0,0,2,2,2,0,0,2,0,0,1,0,0,0,0]
["Hillside Ditch",3,3,0,0,1,3,0,0,0,0,0,0,1,0,0,0,0,0,0,0,0,0,0,0,4,0,0,-1,0,1,1,-1,-1,0,-1,-1,0,0,2,0,-1,0,-2,0,1,0,-2,0,0,0,0,0,0,0,0,0,0,0,0,0,0,0,0,1,0,0,0,0,0,0,0,1,0,0,0,0,0,0,0,0,0]
["Integrated Pest Management",3,3,3,0,0,3,0,0,3,2,3,0,2,2,2,0,0,0,0,0,0,0,0,0,0,0,0,0,1,1,0,1,1,0,0,0,0,0,3,0,0,0,0,5,5,0,0,0,0,0,5,0,2,0,0,4,2,2,0,0,4,5,4,5,5,3,5,0,3,3,3,0,5,3,5,0,4,0,4,0,0]
["Irrigation Land Leveling",0,1,3,0,0,1,0,0,0,-2,0,-1,3,-2,0,0,0,0,0,0,0,0,1,0,1,0,2,0,4,0,0,1,1,0,2,2,2,0,1,1,1,2,2,2,2,0,1,0,0,0,0,0,0,0,0,0,-1,-1,-1,0,0,1,0,2,0,0,0,0,0,0,0,0,0,0,0,0,0,0,0,0,0]
["Irrigation Pipeline",0,0,0,0,0,0,0,0,0,0,0,0,0,0,0,0,0,0,0,0,0,0,0,0,0,1,1,2,3,0,1,0,0,0,0,1,2,1,1,1,-1,1,-1,0,0,0,0,0,0,0,0,0,0,0,0,0,0,0,0,0,0,0,0,3,0,0,0,0,0,0,0,0,0,0,0,0,0,0,0,0,0]
["Irrigation Reservoir",0,0,0,0,0,0,0,0,0,0,0,0,0,0,0,0,0,0,0,0,0,0,1,0,2,-1,-1,1,3,0,-1,3,0,0,0,0,0,0,0,0,0,0,0,0,0,0,0,0,0,0,0,0,0,0,0,0,0,0,0,0,0,0,0,0,0,0,0,0,0,0,0,0,0,0,0,4,0,0,4,0,0]
["Irrigation System, Microirrigation",0,0,3,0,0,0,0,0,1,0,2,1,0,0,0,0,0,0,0,0,0,0,3,0,3,3,3,5,3,0,3,3,3,0,3,3,3,0,0,1,1,1,3,3,3,1,3,0,0,0,0,0,0,0,0,0,2,2,0,0,0,1,0,3,0,0,0,0,0,0,0,1,0,0,0,0,4,0,0,3,3]
["Irrigation System, Sprinkler",0,0,3,0,0,0,0,0,3,-1,0,3,0,0,0,0,0,0,0,0,0,0,3,0,2,0,1,3,3,0,1,3,3,0,1,2,2,2,0,1,1,1,2,2,2,1,2,0,2,0,0,0,0,0,0,0,2,2,0,0,0,1,0,3,0,0,0,0,0,0,0,1,0,0,0,0,4,0,0,2,2]
["Irrigation Water Management",0,0,3,0,0,0,0,0,3,0,0,3,0,1,0,0,0,0,0,0,0,0,2,0,0,0,1,0,3,0,2,3,3,0,3,3,3,2,3,2,3,2,3,3,3,1,3,0,2,0,0,0,0,0,0,0,3,3,0,0,3,1,0,3,0,0,0,0,0,0,0,0,0,0,0,0,4,0,0,0,0]
["Land Clearing",0,0,0,-1,-2,0,0,0,0,-1,0,0,0,-3,0,0,0,0,0,0,0,0,0,0,-1,0,0,0,0,0,1,-1,-1,0,0,-1,0,0,-1,0,-1,0,-1,0,-1,0,-1,-2,-2,0,0,0,-1,0,0,0,-1,-1,-1,-1,0,-3,0,3,-3,4,0,0,-2,-2,-3,0,-3,-3,-3,0,0,-2,0,0,0]
["Land Reconstruction, Abandoned Mined Land",1,4,0,5,5,4,0,0,4,0,0,0,0,0,0,0,0,0,0,0,0,0,0,0,3,0,0,3,0,0,0,5,5,0,0,0,1,1,4,1,0,0,3,0,0,0,3,0,0,0,0,0,0,0,0,0,0,0,0,0,5,4,5,4,0,0,0,0,2,2,1,0,0,2,0,0,4,0,0,0,0]
["Land Reconstruction, Currently Mined Land",1,4,0,5,5,4,0,0,4,0,0,0,0,0,0,0,0,0,0,0,0,0,0,0,3,0,0,3,0,0,0,5,5,0,0,0,1,1,4,1,0,0,3,0,0,0,3,0,0,0,0,0,0,0,0,0,0,0,0,0,5,4,5,4,0,0,0,0,2,2,1,0,0,2,0,0,4,0,0,0,0]
["Land Smoothing",0,1,1,0,0,0,0,0,0,-2,0,-1,3,-2,0,0,0,0,0,0,0,0,0,0,3,3,3,0,3,3,0,0,0,0,2,1,0,0,1,0,1,0,0,1,1,0,0,0,0,0,0,0,-1,0,0,0,-2,-2,-2,0,0,3,0,3,0,0,0,-1,0,0,-1,0,-1,-1,-1,0,0,0,0,0,0]
["Lined Waterway or Outlet",3,5,0,0,2,0,0,0,0,0,0,0,1,0,0,0,0,0,0,0,0,0,0,0,2,2,2,-1,0,0,1,2,2,0,2,0,0,0,2,0,0,0,0,0,0,0,0,0,0,0,0,0,0,0,0,0,0,0,0,0,0,0,0,0,0,0,0,-1,-2,-2,0,0,-1,0,-1,0,0,0,0,0,0]
["Mulching",1,4,3,-1,4,4,1,2,4,2,1,2,1,3,0,1,0,1,1,0,1,0,1,0,2,-1,-1,1,3,3,0,3,3,0,-1,2,-1,1,2,0,1,0,1,1,2,0,0,0,2,0,0,-1,1,0,0,0,2,2,2,0,0,3,0,3,1,0,1,0,1,1,0,0,0,0,0,0,2,0,0,0,0]
["Multi-Story Cropping",3,3,0,3,0,4,0,0,4,3,3,2,3,5,1,4,4,4,4,4,4,0,0,2,-2,2,2,0,0,2,0,1,4,0,0,2,0,1,4,1,0,1,2,1,3,0,1,0,4,0,5,0,2,0,0,2,2,2,0,1,4,4,5,5,0,2,0,0,3,3,3,0,0,3,0,0,4,3,0,0,0]
["Nutrient Management",0,0,-1,0,0,0,0,0,0,0,0,2,1,2,0,2,2,2,2,2,2,0,0,0,0,0,0,0,0,0,0,0,0,0,5,5,1,1,0,2,3,1,1,0,0,0,0,0,0,2,0,2,1,1,3,4,2,3,2,0,4,0,1,3,0,0,0,0,1,1,0,0,0,3,0,2,4,0,3,0,0]
["Open Channel",0,0,0,0,0,0,0,3,0,0,0,0,1,0,0,0,0,0,0,0,0,0,0,0,5,1,3,5,0,0,3,2,-2,0,0,-1,0,0,0,0,-1,0,0,0,0,0,0,0,0,0,0,0,0,0,0,0,0,0,0,0,0,0,0,0,0,0,0,1,1,1,1,0,1,-2,1,0,0,0,0,0,0]
["Pipeline",0,0,0,0,0,0,0,0,0,0,0,0,0,0,0,0,0,0,0,0,0,0,0,0,0,0,0,0,0,0,0,0,0,0,0,0,0,0,0,0,0,0,0,0,0,0,0,0,0,0,0,0,0,0,0,0,0,0,0,0,0,0,0,2,0,0,0,0,0,0,0,0,0,0,0,5,0,0,4,0,0]
["Pond",3,0,0,0,0,0,0,0,0,0,0,0,2,0,0,0,0,0,0,0,0,0,1,0,2,-2,-1,0,0,0,-1,3,0,0,-1,2,0,0,3,0,0,0,-2,0,0,0,0,0,0,0,0,0,0,0,0,0,0,0,0,0,0,0,0,2,0,0,0,2,3,3,2,4,5,2,5,5,0,0,4,0,0]
["Pond Sealing or Lining, Compacted Clay Treatment",0,0,0,0,0,0,1,0,0,0,0,1,0,0,0,1,1,1,1,1,0,0,-1,0,0,1,2,0,3,3,0,0,0,0,2,2,3,0,0,1,0,3,0,0,0,0,0,0,0,0,0,0,0,0,0,0,0,0,0,0,0,0,0,1,0,0,0,1,1,1,1,1,1,1,1,4,0,0,3,0,0]
["Pond Sealing or Lining, Flexible Membrane",0,0,0,0,0,0,1,0,0,0,0,1,0,0,0,1,1,1,1,1,0,0,-1,0,0,1,2,0,3,3,0,0,0,0,3,2,3,0,0,1,0,3,0,0,0,0,0,0,0,0,0,0,0,0,0,0,0,0,0,0,0,0,0,1,0,0,0,1,1,1,1,1,1,1,1,4,0,0,3,0,0]
["Precision Land Forming",4,2,0,0,2,0,0,0,0,-1,0,1,2,-2,0,1,1,1,1,1,1,0,0,0,3,3,3,0,0,3,0,0,0,0,2,1,1,0,1,1,1,1,0,1,1,0,0,0,0,0,0,0,-1,0,0,0,0,0,0,0,0,0,0,4,0,0,0,0,0,0,0,0,0,0,0,0,0,0,0,0,0]
["Prescribed Grazing",2,4,2,0,0,4,1,3,4,3,2,2,3,4,0,2,2,2,2,2,2,5,0,0,2,0,1,1,-1,2,0,1,1,4,1,1,1,2,3,1,1,1,1,2,2,0,0,0,0,0,0,0,2,0,0,0,2,2,2,0,4,4,4,5,1,3,1,3,3,3,4,0,3,4,3,0,5,3,4,0,0]
["Pumping Plant",0,0,0,0,0,0,0,0,0,0,0,0,0,0,3,0,0,0,0,0,0,0,1,0,2,2,2,2,3,3,0,0,0,0,0,0,0,0,0,0,0,0,0,0,0,-1,0,0,0,0,0,0,3,0,2,0,0,0,1,0,0,0,0,3,0,0,0,0,0,0,0,0,0,0,0,5,0,0,4,4,4]
["Range Planting",3,4,0,0,0,4,2,2,4,4,3,1,3,4,1,2,2,2,2,2,2,4,0,0,2,0,0,1,0,3,2,4,2,4,2,1,1,1,3,1,2,1,1,2,2,0,0,0,0,0,0,0,2,0,0,0,2,2,2,0,5,4,5,5,3,0,3,2,3,3,4,0,3,4,3,0,5,0,3,0,0]
["Recreation Area Improvement",1,4,0,0,0,4,1,1,4,2,0,2,3,3,0,0,0,0,0,0,0,0,0,0,2,0,0,0,0,0,0,5,2,0,0,0,0,0,4,0,0,0,0,2,2,0,0,0,4,0,0,0,2,0,0,0,1,1,1,0,0,4,5,5,-1,3,-1,0,2,2,-2,2,-3,-1,-3,0,0,0,0,0,0]
["Recreation Land Grading and Shaping",4,0,0,0,0,0,3,2,0,0,0,0,2,1,0,0,0,0,0,0,0,0,0,0,2,0,0,2,0,0,0,0,0,0,0,0,0,0,2,0,0,0,0,0,0,0,0,0,0,0,0,0,-1,0,0,0,0,0,1,0,0,4,0,3,-1,0,-1,0,-2,-2,-2,0,-3,-1,-3,0,0,0,0,0,0]
["Recreation Trail and Walkway",4,0,0,1,3,0,3,3,0,2,0,0,0,0,0,0,0,0,0,0,0,0,0,0,2,0,0,0,0,1,0,2,2,0,0,0,0,0,2,0,0,0,-2,0,0,0,0,0,0,0,0,0,0,0,0,0,0,0,1,0,0,-1,5,4,-1,2,-1,0,-2,-2,-2,0,-3,-1,-3,0,0,0,0,0,0]
["Residue and Tillage Management, No-Till/Strip Till/Direct Seed",1,4,3,-1,0,4,0,0,4,2,0,1,3,3,0,0,0,0,0,0,0,0,1,0,2,-1,0,0,2,3,0,3,3,0,-1,1,-1,1,3,1,1,0,1,1,4,0,0,0,0,0,-2,0,2,0,2,1,3,3,3,0,0,0,0,2,0,0,0,2,2,2,1,0,1,0,1,0,1,0,0,4,4]
["Residue Management, Seasonal",1,1,2,0,0,2,0,0,3,0,0,1,2,1,0,0,0,0,0,0,0,0,1,0,1,-1,0,0,1,1,0,1,2,0,-1,1,-1,1,1,1,1,0,1,-1,1,0,0,0,0,0,0,0,1,0,0,0,2,2,2,0,0,0,0,2,0,0,0,2,2,2,1,0,1,0,1,0,1,0,0,0,0]
["Restoration and Management of Declining Habitats",0,2,0,0,0,2,0,0,2,0,0,-1,0,0,0,0,0,0,0,0,0,3,0,0,0,0,0,0,0,0,0,0,0,0,0,0,0,0,2,0,0,0,0,0,0,0,0,2,0,0,0,0,1,0,0,0,0,0,0,2,4,4,4,4,5,0,5,5,5,5,5,5,5,5,5,0,2,0,0,0,0]
["Riparian Forest Buffer",3,1,0,3,0,2,3,3,2,4,2,1,2,4,0,3,3,3,3,3,3,0,0,0,-1,2,2,0,0,0,4,5,5,3,5,5,1,1,4,1,2,2,3,2,3,0,1,3,4,0,2,0,4,0,0,1,1,1,2,3,4,4,4,5,5,0,5,4,5,5,5,3,5,5,5,0,4,4,4,0,0]
["Riparian Herbaceous Cover",1,1,0,1,0,2,4,4,2,4,2,2,2,4,0,3,3,3,3,3,3,3,0,0,0,2,2,0,0,0,4,4,5,3,5,5,1,1,4,1,2,2,3,2,3,0,1,2,0,0,0,0,2,0,0,0,1,1,0,0,4,4,4,5,3,0,3,5,5,5,5,3,5,5,5,0,4,0,4,0,0]
["Rock Barrier",0,5,0,1,0,5,0,0,0,0,0,0,-2,0,0,0,0,0,0,0,0,0,1,2,0,1,1,1,0,0,0,1,1,0,0,0,-1,1,2,0,0,0,1,0,0,0,0,0,0,0,0,0,0,0,0,0,0,0,1,1,0,0,0,1,0,0,0,0,0,0,0,0,0,0,0,0,0,0,0,0,0]
["Roof Runoff Structure",1,3,0,0,0,1,1,1,0,0,0,0,1,0,0,0,0,0,0,0,0,0,1,0,-1,1,1,0,0,3,2,1,1,0,2,2,0,2,1,0,0,0,3,0,0,2,0,0,0,0,0,0,0,0,0,0,0,0,0,0,0,0,0,0,0,0,0,0,0,0,0,0,0,0,0,3,0,0,0,0,0]
["Roofs and Covers",0,0,0,0,0,0,0,0,0,0,0,0,0,0,0,0,0,0,0,0,0,0,0,0,-1,0,0,0,0,0,0,0,0,0,0,0,0,0,0,1,1,1,0,0,0,0,0,0,0,2,0,2,0,0,0,2,0,0,0,0,0,0,0,0,0,0,0,0,0,0,0,0,0,0,0,0,0,0,0,1,1]
["Row Arrangement",0,3,3,0,0,3,0,0,1,0,0,1,2,1,0,1,1,1,1,1,1,0,1,0,2,-1,-1,0,4,4,1,1,1,0,2,-2,0,0,2,0,0,0,1,-1,1,0,0,0,0,0,0,0,0,0,0,0,0,0,0,0,0,0,0,1,0,0,0,0,0,0,0,0,0,0,0,0,0,0,0,0,0]
["Seasonal High Tunnel System for Crops",0,0,2,0,0,2,0,0,2,1,0,0,0,1,0,0,0,0,0,0,0,0,-1,0,-3,2,0,0,1,1,0,0,0,0,1,2,1,0,1,0,0,0,0,1,1,0,0,0,3,0,1,0,0,1,0,0,1,1,0,1,0,0,2,3,0,0,0,0,0,0,0,0,0,0,0,0,0,0,0,0,0]
["Sediment Basin",2,0,0,-1,0,0,0,0,0,0,0,0,5,0,0,0,0,0,0,0,0,0,1,0,2,-2,-2,3,0,0,-1,4,4,0,-1,5,-1,2,4,-1,2,-1,2,-1,2,0,2,0,0,0,0,0,0,0,0,0,0,0,0,0,0,0,0,0,0,0,0,1,-1,-1,0,1,0,0,0,1,0,0,0,0,0]
["Shallow Water Development and Management",0,0,0,0,0,0,3,0,0,0,0,0,0,1,0,0,0,0,0,0,0,0,0,0,3,0,0,0,0,0,0,0,3,0,1,1,-1,0,2,1,2,-1,2,1,1,0,0,0,0,0,0,-1,0,0,0,0,0,0,0,0,0,1,4,3,1,0,1,5,3,4,4,2,3,2,3,0,1,0,0,0,0]
["Silvopasture Establishment",2,5,2,1,0,5,3,3,5,0,0,0,0,4,0,1,1,1,1,1,1,0,0,2,2,1,1,1,-1,2,0,2,1,0,2,5,1,1,3,1,1,0,2,2,3,1,1,2,4,0,2,0,5,0,0,1,2,2,3,2,5,4,4,5,0,3,0,4,5,4,2,0,0,0,0,0,5,4,4,0,0]
["Solid/Liquid Waste Separation Facility",0,0,0,0,0,0,0,0,0,0,0,0,0,1,0,2,2,2,0,0,0,0,0,0,0,0,0,0,1,0,0,0,0,0,3,3,2,2,0,2,2,2,2,0,0,0,0,0,0,3,0,2,1,1,0,4,0,2,0,0,2,0,0,0,0,0,0,0,0,0,0,0,0,0,0,1,0,0,2,0,0]
["Spring Development",1,0,0,1,0,0,0,1,0,-1,0,0,0,0,0,2,2,2,2,2,2,0,0,0,1,2,2,0,2,2,-1,0,0,0,0,0,0,1,1,0,2,0,1,0,0,0,1,0,0,0,0,0,0,0,0,0,0,0,0,0,0,0,0,2,3,0,3,3,3,3,3,5,3,3,3,5,3,0,4,0,0]
["Stream Crossing",0,0,0,0,0,0,0,3,0,0,0,0,1,0,0,0,0,0,0,0,0,0,0,0,0,0,0,0,0,0,0,0,1,0,0,-1,0,0,2,0,0,0,-3,0,0,0,0,0,0,0,0,0,0,0,0,0,0,0,0,0,0,0,0,0,0,0,0,1,0,0,0,0,0,0,1,3,3,0,4,0,0]
["Stream Habitat Improvement and Management",0,0,0,0,0,0,0,5,0,0,0,0,0,0,0,0,0,0,0,0,0,0,0,0,0,0,0,0,0,0,0,0,0,0,0,1,0,0,3,0,0,0,0,0,0,0,0,3,4,0,0,0,1,0,0,0,0,0,0,0,0,4,4,4,3,0,3,3,3,3,4,3,3,4,3,0,2,4,4,0,0]
["Streambank and Shoreline Protection",0,0,0,4,0,0,4,4,0,0,0,0,2,0,0,0,0,0,0,0,0,0,0,0,0,0,0,0,0,0,0,3,3,0,0,1,0,0,3,0,0,0,1,0,0,0,0,1,4,0,0,0,1,0,0,0,0,0,0,0,0,4,4,4,3,0,3,1,2,2,2,0,3,2,3,0,1,0,0,0,0]
["Stripcropping",1,4,0,0,0,4,0,0,4,0,0,0,4,2,0,0,0,0,0,0,0,0,0,0,1,-2,-1,0,0,1,0,4,2,0,-1,3,-1,1,3,-1,3,-1,1,0,2,0,0,0,0,0,0,0,0,0,0,0,3,3,1,0,0,0,0,3,0,0,0,0,1,1,1,0,1,1,1,0,0,0,0,0,0]
["Structure for Water Control",0,0,0,0,1,0,0,0,0,0,0,0,2,0,0,0,0,0,0,0,0,0,0,0,2,0,0,0,3,3,2,2,2,0,0,0,0,0,1,0,0,0,0,0,0,0,0,1,0,0,0,0,0,0,0,0,0,0,0,0,0,0,0,0,1,0,1,1,1,1,1,2,1,1,1,1,0,0,0,0,0]
["Surface Drainage, Field Ditch",-1,2,0,0,0,0,0,0,-1,1,1,2,0,-2,-1,1,1,1,1,1,1,0,-1,0,3,0,3,-3,3,3,2,-2,-2,0,1,-2,1,-2,-2,1,-2,1,-2,1,0,0,-2,0,0,0,0,0,0,0,0,0,0,0,0,0,3,0,0,2,0,0,0,0,0,0,0,0,0,0,0,0,4,0,0,0,0]
["Surface Drainage, Main or Lateral",-1,2,0,0,0,0,0,0,-1,0,0,0,0,0,0,0,0,0,0,0,0,0,-1,0,3,0,3,-3,3,3,2,-2,-2,0,1,-2,2,-2,-2,2,-2,2,-2,0,0,0,-2,0,0,0,0,0,0,0,0,0,0,0,0,0,3,0,0,2,0,0,0,-1,0,0,0,0,0,0,0,0,4,0,0,0,0]
["Terrace",2,4,1,-1,0,5,0,1,1,-1,0,0,2,1,0,0,0,0,0,0,0,0,1,0,4,-2,-2,2,0,3,-1,2,2,0,-2,2,-2,2,3,-1,2,-1,2,-2,3,0,2,0,0,0,0,0,0,0,0,0,0,0,0,0,0,0,0,2,0,0,0,0,0,0,0,0,0,0,0,0,0,0,0,1,1]
["Tree/Shrub Establishment",2,4,0,3,2,5,0,0,5,2,2,2,0,4,0,2,2,2,2,2,2,0,-2,2,-1,2,2,2,0,2,2,4,4,0,2,2,1,1,4,1,1,4,3,4,4,0,1,2,5,0,2,0,5,0,0,2,2,2,3,4,5,4,5,5,5,0,5,5,5,3,5,0,5,4,5,0,2,4,4,1,1]
["Tree/Shrub Pruning",0,0,0,0,0,1,0,0,0,0,0,0,0,-1,0,1,1,1,1,1,1,0,0,0,0,0,0,0,0,0,0,0,0,0,1,1,0,0,0,0,0,0,0,1,1,0,0,0,0,0,0,0,0,0,0,0,0,0,0,0,0,0,0,5,0,2,0,0,1,1,0,0,0,0,0,0,2,-3,0,0,0]
["Tree/Shrub Site Preparation",-2,-2,0,0,0,-1,0,0,-1,-1,0,0,0,-2,0,0,0,0,0,0,0,0,0,0,0,0,0,0,0,4,0,0,0,0,0,0,0,0,-1,0,0,0,0,0,0,0,0,0,0,0,0,0,1,0,0,0,-2,-1,1,0,0,4,4,5,0,4,0,0,0,0,0,0,0,0,0,0,0,-1,0,0,0]
["Underground Outlet",4,5,0,1,2,0,0,-1,0,0,0,0,2,0,0,0,0,0,0,0,0,0,0,0,4,0,0,3,0,0,0,2,2,0,0,0,0,0,0,0,1,0,1,0,0,0,1,0,0,0,0,0,0,0,0,0,0,0,0,0,0,0,0,0,0,0,0,0,0,0,0,0,0,0,0,0,0,0,0,1,1]
["Upland Wildlife Habitat Management",2,3,0,1,0,3,1,1,3,0,0,0,0,0,0,0,0,0,0,0,0,3,0,0,-3,0,2,0,0,0,1,1,1,2,0,0,0,0,2,0,0,0,0,0,0,0,0,0,3,0,0,0,1,0,0,0,2,2,1,2,4,4,4,4,5,3,5,5,5,5,5,0,5,5,5,0,2,0,0,0,0]
["Vegetative Barrier",2,5,0,0,2,4,1,1,1,-1,0,0,2,0,0,-2,-2,-2,-2,-2,-2,0,1,0,0,0,2,2,3,3,2,5,5,0,-1,2,-1,1,2,-1,2,0,2,-1,2,0,1,0,0,2,0,0,1,0,0,0,0,0,1,1,0,0,2,3,0,0,0,1,1,1,1,1,1,1,1,0,1,1,0,0,0]
["Waste Storage Facility",0,0,0,0,0,0,0,0,0,1,0,0,0,1,0,2,2,2,2,2,2,0,0,0,0,0,0,0,1,0,-1,0,0,0,2,4,1,2,0,1,0,2,2,0,0,0,0,0,0,2,0,-2,0,0,0,-2,0,0,0,0,0,0,0,2,0,0,0,0,0,0,0,0,0,0,0,0,0,0,0,0,0]
["Waste Transfer",0,-1,0,0,0,-1,0,0,-1,-1,0,0,0,0,0,0,0,0,0,0,0,0,0,0,0,0,0,0,0,1,0,0,0,0,2,3,2,2,0,0,0,2,3,0,0,0,0,0,0,-2,0,-2,0,0,0,-1,-1,-1,-1,0,0,-1,0,0,0,0,0,0,0,0,0,0,0,0,0,0,0,0,0,0,0]
["Waste Treatment",0,0,0,0,0,0,0,0,0,1,0,0,0,1,0,2,2,2,0,0,0,0,0,0,0,0,0,0,1,0,0,0,0,0,3,3,2,2,0,2,2,2,2,0,0,0,0,0,0,4,0,3,1,1,0,4,1,4,0,0,2,0,0,2,0,0,0,0,0,0,0,0,0,0,0,1,0,0,3,0,0]
["Waste Treatment Lagoon",0,0,0,0,0,0,0,0,0,1,0,0,0,1,0,3,3,3,3,3,3,0,0,0,0,0,0,0,1,0,0,0,0,0,2,4,1,2,0,1,0,2,4,0,0,0,0,0,0,2,0,-1,2,2,0,-1,0,0,0,0,0,0,0,2,0,0,0,1,0,1,1,1,1,0,0,0,0,0,0,1,1]
["Waste Utilization",0,1,2,0,1,1,0,0,1,0,1,0,1,3,0,0,0,0,0,0,0,0,0,0,0,0,0,0,2,2,0,0,0,0,2,2,2,2,0,0,0,2,0,2,0,0,0,0,0,2,0,0,2,1,2,4,-1,-1,1,0,4,0,3,3,0,0,0,0,0,0,0,0,0,0,0,0,4,0,3,0,0]
["Water and Sediment Control Basin",3,2,0,0,3,0,0,0,0,0,0,0,3,0,0,0,0,0,0,0,0,0,0,0,2,-2,-2,1,0,0,1,4,4,0,-1,2,-1,1,4,-1,2,-1,2,-1,2,0,2,-2,0,0,0,0,0,0,0,0,0,0,0,0,0,0,0,0,0,0,0,0,-1,-1,0,2,0,0,0,1,0,0,0,0,0]
["Water Harvesting Catchment",0,0,0,0,0,0,0,0,0,0,0,0,0,0,0,0,0,0,0,0,0,0,1,0,0,1,0,0,3,0,0,0,0,0,0,0,0,0,0,0,0,0,0,0,0,0,0,0,0,0,0,0,0,0,0,0,0,0,0,0,0,0,0,3,0,0,0,0,0,0,2,0,1,2,1,5,0,0,4,0,0]
["Watering Facility",1,2,0,0,0,2,4,4,2,0,0,0,0,0,0,0,0,0,0,0,0,0,0,0,0,0,0,0,0,0,0,1,1,0,0,0,0,1,2,0,1,-1,1,0,0,0,0,1,0,0,0,0,0,0,0,0,0,0,0,0,0,0,0,2,0,0,0,0,0,0,2,2,0,2,0,5,3,0,4,0,0]
["Wetland Creation",0,0,0,0,0,0,3,0,0,0,0,0,0,2,0,1,1,1,1,1,1,0,1,0,3,0,-1,3,0,0,-1,0,3,0,1,3,0,1,2,0,2,0,1,1,1,0,0,0,3,0,0,-1,2,0,0,-1,0,0,1,0,0,4,4,4,3,0,3,5,5,5,5,5,5,5,5,0,2,0,0,0,0]
["Wetland Enhancement",0,0,0,0,0,0,3,0,0,0,0,0,0,1,0,1,1,1,1,1,1,0,0,0,3,0,0,3,0,0,0,0,3,0,1,3,0,1,2,0,2,0,1,1,1,0,0,0,3,0,0,-1,2,0,0,-1,0,0,0,0,0,4,4,4,5,0,5,5,5,5,5,5,5,5,5,0,2,0,0,0,0]
["Wetland Restoration",0,0,0,0,0,0,3,0,0,0,0,0,0,1,0,1,1,1,1,1,1,0,0,0,3,0,0,3,0,0,0,0,3,0,1,3,0,1,2,0,2,0,1,1,1,0,0,0,3,0,0,-1,2,0,0,-1,0,0,1,0,0,4,4,4,5,0,5,5,5,5,5,5,5,5,5,0,2,0,0,0,0]
["Wetland Wildlife Habitat Management",0,0,0,0,0,0,3,0,0,0,0,0,0,0,0,0,0,0,0,0,0,0,0,0,3,0,0,0,0,0,0,0,0,0,0,0,0,0,3,0,0,0,1,0,0,0,0,0,3,0,0,-1,2,0,0,-1,0,0,0,2,0,4,4,4,5,0,5,5,5,5,5,5,5,5,5,0,2,0,0,0,0]
["Windbreak/Shelterbelt Establishment",0,1,0,1,0,1,0,0,5,2,1,1,-2,1,0,2,2,2,2,2,2,0,-2,5,-1,2,2,0,5,2,-2,1,1,0,5,1,0,0,2,0,1,0,0,0,2,0,1,0,4,2,3,0,2,0,0,2,2,2,2,5,4,4,5,5,1,0,1,3,3,3,3,0,3,3,3,0,1,5,5,1,1]
["Windbreak/Shelterbelt Renovation",0,1,0,1,0,1,0,0,5,2,1,1,-2,1,0,2,2,2,2,2,2,0,-2,5,-1,2,2,0,5,2,-2,1,1,0,5,5,0,0,1,0,1,0,0,0,2,0,1,0,4,2,3,0,1,0,0,2,2,2,2,5,4,4,5,5,1,0,1,3,3,3,3,0,3,3,3,0,1,5,5,1,1]
["Woody Residue Treatment",1,2,0,0,0,2,0,0,2,-2,0,0,2,3,0,0,0,0,0,0,0,0,0,0,0,0,0,0,0,1,0,1,1,0,0,0,0,0,1,0,0,0,0,0,0,-1,0,0,0,0,0,0,3,0,1,0,-1,-1,0,0,4,4,4,5,0,4,0,0,0,0,0,0,0,0,0,0,0,-1,0,0,0]

{"sheet":"Version Notes","index":10,"n_rows":17,"n_cols":3,"rows_kept":17,"cut":false,"hidden":true,"merged":[]}
["Version Date","Item No.","Notes"]
["2014-02-01",1,"Original version released"]
["2014-06-01",2,"Percentage formatting in cells J21:k32 & N21:P32 modified."]
[null,3,"Certification page modified to accommodate units in \"feet\" for Windbreak/Shelterbelt Renovation (650)."]
[null,4,"Macros for selecting number of plant species to control or retain streamlined."]
["2016-10-01",5,"Land Clearing (460) removed - no longer used for plant control in PIA"]
[null,6,"Planned acres and planned units changed to allow manual/custom input."]
[null,7,"Resource Problem and Primary Practice Purpose selections moved to Planner's side of Jobsheet"]
[null,8,"Common name now also shows for each plant species on Planner's side of Jobsheet"]
[null,9,"Required treatment and control rates for each species removed - changed to Planner-specified initial & final densities"]
[null,10,"Follow-up treatment option replaced with option to apply 314 or 315 multiple times."]
[null,11,"PIA Pervasive Weed List added on new sheet"]
[null,12,"Added required screening question for WinPST results if chemical methods are prescribed"]
[null,13,"\"Plant Species to Retain\" section now limited to Forest land use designation"]
["2017-12-01",14,"\"Clear Template\" button now also clears fuelbreak cells K38 and K41"]
[null,15,"RPTN 6 Intensity Matrix for 314 now added to support planning for programs on Range and Pasture lands"]
["2021-10-13",16,"Updated entire form, new RCs, CPS Purposes, added JAA section with functionality, new T&E worksheet, RC worksheet and CPS Purposes worksheet"]