{"text_format":"1","workbook":"xlsx","n_sheets":10,"sheets":["Mix_1","Mix_2","Mix_3","Mix_4","Jobsheet","Bulk_PLS_Documentation","Guide-Grasses_Grasslikes","Guide-Forbs","Guide-Shrubs","DATA_TABLE"],"not_rendered":{"charts":0,"images":1,"macros":1,"external_links":0,"defined_names":15,"comments":0,"pivot_tables":0},"unopened":[],"bounds":{"document_bytes":16777216,"sheet_cells":100000,"rows_first":2000,"rows_last":500,"rows_between":2000,"halvings":0,"cell_chars":16384,"cell_head_chars":4096},"cells_cut":0,"cells_raw":0,"read":"whole","date_system":"1900"}

{"sheet":"Mix_1","index":0,"n_rows":86,"n_cols":13,"rows_kept":86,"cut":false,"hidden":false,"merged":[[84,3,84,7],[85,3,85,7],[74,3,74,7],[73,3,73,7],[72,3,72,7],[9,12,11,12],[71,3,71,7],[83,3,83,7],[79,3,79,7],[78,3,78,7],[77,3,77,7],[76,3,76,7],[75,3,75,7],[82,3,82,7],[81,3,81,7],[80,3,80,7],[0,3,0,6],[0,1,0,2],[1,2,3,2],[13,12,15,12],[69,0,69,10],[1,3,3,3],[1,4,3,4],[1,5,3,5],[1,9,3,9],[1,10,3,10],[1,7,3,7],[1,8,3,8],[1,0,3,0],[1,6,3,6],[19,12,23,12],[7,12,8,12]]}
["CPA8 MIX 1 - NAME:  ","550 - Range Seeding - Sandy Site",null,"MLRA:",null,null,null,"67A"]
["Species List ",null,"Variety names listed in bold are the preferred varieties","PLS LBS per acre","PLS per ft² @ 1lb/ac","PLS per ft² ","% of Grasses","Est. Cost Per Pound (PLS)","Estimated Cost Per Acre","Bloom Period","COC"]
[]
[]
["GRASSES","SCIENTIFIC NAME","Acceptable Varieties",null,null,null,null,null,null,null,null,null,"Enable Content when opening the worksheet."]
["Blue Grama ",{"$f":"IF(A72=\"\",\"\",VLOOKUP(A72, DATA_TABLE!$C$3:$I$64, 7, FALSE))","v":""},"Hachita, Bad River, Lovington",0.12,{"$f":"IF(A6=\"\",\"\",VLOOKUP(A6, DATA_TABLE!$C$3:$I$64, 2, FALSE))","v":16.629935720844813},{"$f":"IF(A6=\"\",\"\",(D6*E6))","v":1.9955922865013775},{"$f":"IF(A6>0,F6/$F$21,0)","v":9.8767272456238273E-2},{"$f":"IF(E6=\"\",\"\",VLOOKUP(A6, DATA_TABLE!$C$3:$I$64, 4, FALSE))","v":0},{"$f":"IF(A6=\"\",\"\",(H6*D6))","v":0},null,{"$f":"IF(A6=\"\",\"\",VLOOKUP(A6, DATA_TABLE!$C$3:$I$64, 6, FALSE))","v":4}]
["Canada Wildrye",{"$f":"IF(A7=\"\",\"\",VLOOKUP(A7, DATA_TABLE!$C$3:$I$64, 7, FALSE))","v":"Elymus canadensis"},"Mandan",0.3,{"$f":"IF(A7=\"\",\"\",VLOOKUP(A7, DATA_TABLE!$C$3:$I$64, 2, FALSE))","v":2.6170798898071626},{"$f":"IF(A7=\"\",\"\",(D7*E7))","v":0.7851239669421487},{"$f":"IF(A7>0,F7/$F$21,0)","v":3.8857913652716597E-2},{"$f":"IF(E7=\"\",\"\",VLOOKUP(A7, DATA_TABLE!$C$3:$I$64, 4, FALSE))","v":0},0,null,{"$f":"IF(A7=\"\",\"\",VLOOKUP(A7, DATA_TABLE!$C$3:$I$64, 6, FALSE))","v":5}]
["Green Needlegrass",{"$f":"IF(A8=\"\",\"\",VLOOKUP(A8, DATA_TABLE!$C$3:$I$64, 7, FALSE))","v":"Nassella viridula"},"Lodorm",0.25,{"$f":"IF(A8=\"\",\"\",VLOOKUP(A8, DATA_TABLE!$C$3:$I$64, 2, FALSE))","v":3.8530762167125805},0.96326905417814512,4.7674796984444115E-2,{"$f":"IF(E8=\"\",\"\",VLOOKUP(A8, DATA_TABLE!$C$3:$I$64, 4, FALSE))","v":0},0,null,{"$f":"IF(A8=\"\",\"\",VLOOKUP(A8, DATA_TABLE!$C$3:$I$64, 6, FALSE))","v":4},null,"Clear this example mix and enter your grass, forb and legume species, grass varieties, and PLS LBS per acre"]
{"$rows_left_out":79}
{"sheet":"Mix_2","index":1,"n_rows":86,"n_cols":13,"rows_kept":86,"cut":false,"hidden":false,"merged":[[83,3,83,7],[84,3,84,7],[85,3,85,7],[77,3,77,7],[78,3,78,7],[79,3,79,7],[80,3,80,7],[81,3,81,7],[82,3,82,7],[76,3,76,7],[1,7,3,7],[1,8,3,8],[1,9,3,9],[1,10,3,10],[71,3,71,7],[72,3,72,7],[73,3,73,7],[74,3,74,7],[75,3,75,7],[13,12,15,12],[69,0,69,10],[0,1,0,2],[0,3,0,6],[1,0,3,0],[1,2,3,2],[1,3,3,3],[1,4,3,4],[1,5,3,5],[1,6,3,6],[8,12,11,12],[5,12,7,12],[16,12,21,12]]}
["CPA8 MIX 2 - NAME:  ",null,null,"MLRA:"]
["Species List ",null,"Variety names listed in bold are the preferred varieties","PLS LBS per acre","PLS per ft² @ 1lb/ac","PLS per ft² ","% of Grasses","Est. Cost Per Pound (PLS)","Estimated Cost Per Acre","Bloom Period","COC"]
[]
[]
["GRASSES","SCIENTIFIC NAME","Acceptable Varieties"]
[null,{"$f":"IF(A6=\"\",\"\",VLOOKUP(A6, DATA_TABLE!$C$3:$I$64, 7, FALSE))","v":""},null,null,{"$f":"IF(A6=\"\",\"\",VLOOKUP(A6, DATA_TABLE!$C$3:$I$64, 2, FALSE))","v":""},{"$f":"IF(A6=\"\",\"\",(D6*E6))","v":""},{"$f":"IF(A6>0,F6/$F$21,0)","v":0},null,{"$f":"IF(A6=\"\",\"\",(H6*D6))","v":""},null,{"$f":"IF(A6=\"\",\"\",VLOOKUP(A6, DATA_TABLE!$C$3:$I$64, 6, FALSE))","v":""},null,"Enter the grass, the appropriate varieties, and pls lbs per acre for grasses and forbs (varieties will rarely be entered for forbs)."]
[null,{"$f":"IF(A7=\"\",\"\",VLOOKUP(A7, DATA_TABLE!$C$3:$I$64, 7, FALSE))","v":""},null,null,{"$f":"IF(A7=\"\",\"\",VLOOKUP(A7, DATA_TABLE!$C$3:$I$64, 2, FALSE))","v":""},{"$f":"IF(A7=\"\",\"\",(D7*E7))","v":""},{"$f":"IF(A7>0,F7/$F$21,0)","v":0},{"$f":"IF(E7=\"\",\"\",VLOOKUP(A7, DATA_TABLE!$C$3:$I$64, 4, FALSE))","v":""},"",null,{"$f":"IF(A7=\"\",\"\",VLOOKUP(A7, DATA_TABLE!$C$3:$I$64, 6, FALSE))","v":""}]
[null,{"$f":"IF(A8=\"\",\"\",VLOOKUP(A8, DATA_TABLE!$C$3:$I$64, 7, FALSE))","v":""},null,null,{"$f":"IF(A8=\"\",\"\",VLOOKUP(A8, DATA_TABLE!$C$3:$I$64, 2, FALSE))","v":""},"",0,{"$f":"IF(E8=\"\",\"\",VLOOKUP(A8, DATA_TABLE!$C$3:$I$64, 4, FALSE))","v":""},"",null,{"$f":"IF(A8=\"\",\"\",VLOOKUP(A8, DATA_TABLE!$C$3:$I$64, 6, FALSE))","v":""}]
{"$rows_left_out":79}
{"sheet":"Mix_3","index":2,"n_rows":86,"n_cols":13,"rows_kept":86,"cut":false,"hidden":false,"merged":[[83,3,83,7],[84,3,84,7],[85,3,85,7],[77,3,77,7],[78,3,78,7],[79,3,79,7],[80,3,80,7],[81,3,81,7],[82,3,82,7],[76,3,76,7],[1,7,3,7],[1,8,3,8],[1,9,3,9],[1,10,3,10],[71,3,71,7],[72,3,72,7],[73,3,73,7],[74,3,74,7],[75,3,75,7],[13,12,15,12],[69,0,69,10],[0,1,0,2],[0,3,0,6],[1,0,3,0],[1,2,3,2],[1,3,3,3],[1,4,3,4],[1,5,3,5],[1,6,3,6],[5,12,7,12],[8,12,11,12],[17,12,21,12]]}
["CPA8 MIX 3 - NAME:  ",null,null,"MLRA:"]
["Species List ",null,"Variety names listed in bold are the preferred varieties","PLS LBS per acre","PLS per ft² @ 1lb/ac","PLS per ft² ","% of Grasses","Est. Cost Per Pound (PLS)","Estimated Cost Per Acre","Bloom Period","COC"]
[]
[]
["GRASSES","SCIENTIFIC NAME","Acceptable Varieties"]
[null,{"$f":"IF(A6=\"\",\"\",VLOOKUP(A6, DATA_TABLE!$C$3:$I$64, 7, FALSE))","v":""},null,null,{"$f":"IF(A6=\"\",\"\",VLOOKUP(A6, DATA_TABLE!$C$3:$I$64, 2, FALSE))","v":""},{"$f":"IF(A6=\"\",\"\",(D6*E6))","v":""},{"$f":"IF(A6>0,F6/$F$21,0)","v":0},{"$f":"IF(E6=\"\",\"\",VLOOKUP(A6, DATA_TABLE!$C$3:$I$64, 4, FALSE))","v":""},{"$f":"IF(A6=\"\",\"\",(H6*D6))","v":""},null,{"$f":"IF(A6=\"\",\"\",VLOOKUP(A6, DATA_TABLE!$C$3:$I$64, 6, FALSE))","v":""},null,"Enter the grass, the appropriate varieties, and pls lbs per acre for grasses and forbs (varieties will rarely be entered for forbs)."]
[null,{"$f":"IF(A7=\"\",\"\",VLOOKUP(A7, DATA_TABLE!$C$3:$I$64, 7, FALSE))","v":""},null,null,{"$f":"IF(A7=\"\",\"\",VLOOKUP(A7, DATA_TABLE!$C$3:$I$64, 2, FALSE))","v":""},{"$f":"IF(A7=\"\",\"\",(D7*E7))","v":""},{"$f":"IF(A7>0,F7/$F$21,0)","v":0},{"$f":"IF(E7=\"\",\"\",VLOOKUP(A7, DATA_TABLE!$C$3:$I$64, 4, FALSE))","v":""},"",null,{"$f":"IF(A7=\"\",\"\",VLOOKUP(A7, DATA_TABLE!$C$3:$I$64, 6, FALSE))","v":""}]
[null,{"$f":"IF(A8=\"\",\"\",VLOOKUP(A8, DATA_TABLE!$C$3:$I$64, 7, FALSE))","v":""},null,null,{"$f":"IF(A8=\"\",\"\",VLOOKUP(A8, DATA_TABLE!$C$3:$I$64, 2, FALSE))","v":""},"",0,{"$f":"IF(E8=\"\",\"\",VLOOKUP(A8, DATA_TABLE!$C$3:$I$64, 4, FALSE))","v":""},"",null,{"$f":"IF(A8=\"\",\"\",VLOOKUP(A8, DATA_TABLE!$C$3:$I$64, 6, FALSE))","v":""}]
{"$rows_left_out":79}
{"sheet":"Mix_4","index":3,"n_rows":86,"n_cols":13,"rows_kept":86,"cut":false,"hidden":false,"merged":[[13,12,15,12],[69,0,69,10],[0,1,0,2],[0,3,0,6],[1,0,3,0],[1,2,3,2],[1,3,3,3],[1,4,3,4],[1,5,3,5],[1,6,3,6],[17,12,21,12],[76,3,76,7],[1,7,3,7],[1,8,3,8],[1,9,3,9],[1,10,3,10],[83,3,83,7],[84,3,84,7],[85,3,85,7],[5,12,7,12],[8,12,11,12],[77,3,77,7],[78,3,78,7],[79,3,79,7],[80,3,80,7],[81,3,81,7],[82,3,82,7],[71,3,71,7],[72,3,72,7],[73,3,73,7],[74,3,74,7],[75,3,75,7]]}
["CPA8 MIX 4 - NAME:  ",null,null,"MLRA:"]
["Species List ",null,"Variety names listed in bold are the preferred varieties","PLS LBS per acre","PLS per ft² @ 1lb/ac","PLS per ft² ","% of Grasses","Est. Cost Per Pound (PLS)","Estimated Cost Per Acre","Bloom Period","COC"]
[]
[]
["GRASSES","SCIENTIFIC NAME","Acceptable Varieties"]
[null,{"$f":"IF(A6=\"\",\"\",VLOOKUP(A6, DATA_TABLE!$C$3:$I$64, 7, FALSE))","v":""},null,null,{"$f":"IF(A6=\"\",\"\",VLOOKUP(A6, DATA_TABLE!$C$3:$I$64, 2, FALSE))","v":""},{"$f":"IF(A6=\"\",\"\",(D6*E6))","v":""},{"$f":"IF(A6>0,F6/$F$21,0)","v":0},{"$f":"IF(E6=\"\",\"\",VLOOKUP(A6, DATA_TABLE!$C$3:$I$64, 4, FALSE))","v":""},{"$f":"IF(A6=\"\",\"\",(H6*D6))","v":""},null,{"$f":"IF(A6=\"\",\"\",VLOOKUP(A6, DATA_TABLE!$C$3:$I$64, 6, FALSE))","v":""},null,"Enter the grass, the appropriate varieties ,and pls lbs per acre for grasses and forbs (varieties will rarely be entered for forbs)."]
[null,{"$f":"IF(A7=\"\",\"\",VLOOKUP(A7, DATA_TABLE!$C$3:$I$64, 7, FALSE))","v":""},null,null,{"$f":"IF(A7=\"\",\"\",VLOOKUP(A7, DATA_TABLE!$C$3:$I$64, 2, FALSE))","v":""},{"$f":"IF(A7=\"\",\"\",(D7*E7))","v":""},{"$f":"IF(A7>0,F7/$F$21,0)","v":0},{"$f":"IF(E7=\"\",\"\",VLOOKUP(A7, DATA_TABLE!$C$3:$I$64, 4, FALSE))","v":""},"",null,{"$f":"IF(A7=\"\",\"\",VLOOKUP(A7, DATA_TABLE!$C$3:$I$64, 6, FALSE))","v":""}]
[null,{"$f":"IF(A8=\"\",\"\",VLOOKUP(A8, DATA_TABLE!$C$3:$I$64, 7, FALSE))","v":""},null,null,{"$f":"IF(A8=\"\",\"\",VLOOKUP(A8, DATA_TABLE!$C$3:$I$64, 2, FALSE))","v":""},"",0,{"$f":"IF(E8=\"\",\"\",VLOOKUP(A8, DATA_TABLE!$C$3:$I$64, 4, FALSE))","v":""},"",null,{"$f":"IF(A8=\"\",\"\",VLOOKUP(A8, DATA_TABLE!$C$3:$I$64, 6, FALSE))","v":""}]
{"$rows_left_out":79}
{"sheet":"Jobsheet","index":4,"n_rows":139,"n_cols":14,"rows_kept":139,"cut":false,"hidden":false,"merged":[[68,11,69,16],[0,3,0,9],[1,3,1,9],[71,11,75,15],[136,1,136,5],[136,7,136,10],[4,3,4,6],[70,0,70,2],[4,0,4,2],[6,0,6,10],[7,0,13,10],[15,0,15,10],[4,7,4,8],[4,9,4,10],[14,0,14,10],[34,3,34,8],[48,7,48,8],[48,6,49,6],[45,0,45,1],[45,2,45,3],[47,0,48,5],[44,5,46,10],[30,0,30,2],[33,0,33,2],[47,6,47,7],[47,8,47,10],[48,9,49,9],[48,10,49,10],[43,2,43,7],[49,0,49,5],[16,0,16,2],[17,0,17,2],[16,6,16,7],[16,8,16,10],[17,6,17,7],[24,0,24,10],[17,8,17,10],[30,3,30,8],[31,0,31,2],[31,3,31,8],[29,3,29,8],[22,7,22,10],[23,0,23,1],[29,0,29,2],[20,0,20,10],[25,2,25,7],[25,9,25,10],[27,0,27,10],[21,0,21,10],[22,0,22,1],[22,2,22,5],[18,6,18,7],[18,8,18,10],[19,6,19,7],[0,0,1,2],[2,1,2,4],[3,2,3,3],[3,4,3,6],[3,7,3,8],[3,9,3,10],[2,7,2,10],[2,5,2,6],[5,0,5,10],[19,8,19,10],[18,0,18,2],[19,0,19,2],[23,7,23,10],[26,0,26,10],[23,2,23,5],[28,0,28,10],[39,2,39,6],[39,8,39,10],[40,2,40,6],[41,0,41,10],[42,2,42,6],[42,8,42,10],[35,0,35,2],[35,3,35,8],[36,0,36,2],[36,3,36,8],[37,0,37,10],[38,0,38,10],[32,0,32,2],[32,3,32,8],[33,3,33,8],[34,0,34,2],[50,0,50,2],[50,3,50,5],[138,0,138,10],[66,0,66,2],[66,3,66,4],[66,6,66,10],[117,0,117,2],[117,3,117,4],[117,6,117,10],[68,0,68,5],[69,0,69,5],[135,1,135,5],[70,3,70,5],[128,0,128,10],[130,0,130,10],[133,0,133,10],[129,0,129,2],[120,0,120,10],[122,0,122,10],[123,0,123,10],[125,0,125,10],[126,0,126,10],[134,0,134,10]]}
[null,null,null,"HERBACEOUS SEEDING IMPLEMENTATION REQUIREMENTS",null,null,null,null,null,null,"NE-CPA-8    "]
[null,null,null,"SEEEDING PLAN",null,null,null,null,null,null,"July, 2020"]
["NAME:","Joe Farmer",null,null,null,"Tract No. / Legal",null,"T-1786, NW4 34 T-1-N R-40-W"]
["MLRA:",72,"ECOLOGICAL SITE:",null,"Rolling Sands",null,null,"Contract Number:",null,1234]
["Practice Code and Name:   ",null,null,"550- Range Seeding",null,null,null,"PROGRAM/CIN No.",null,"CRP - 5"]
[]
["DESCRIBE SEEDBED PREPARATION AND SEEDING SPECIFICATIONS:"]
["Current cover is dryland wheat stubble.  No-till drill a cover crop sudan grass at a rate of  15 pounds per acre.  Drill the cover crop between June 1 and June 15th.  Monitor cover crop growth; if the growth is excessive (>4' in height), mow or shred the cover crop leaving a stubble height of approximately 18\".  Plant the grass using the mixture on page 2 of this plan between 11/1/2020 and 5/15/2021 ensuring that the top 1/2\" of soil is thawed when drilling.  Monitor weed population and mow or chemically control weeds if the weeds become thick enough to block sunlight to the seedlings or if they are depleting soil moisture."]
{"$rows_left_out":132}
{"sheet":"Bulk_PLS_Documentation","index":5,"n_rows":40,"n_cols":8,"rows_kept":40,"cut":false,"hidden":false,"merged":[[69,7,69,8],[66,7,66,8],[67,7,67,8],[68,7,68,8],[63,7,63,8],[64,7,64,8],[65,7,65,8],[60,7,60,8],[61,7,61,8],[62,7,62,8],[57,7,57,8],[58,7,58,8],[59,7,59,8],[54,7,54,8],[55,7,55,8],[56,7,56,8],[51,7,51,8],[52,7,52,8],[53,7,53,8],[48,7,48,8],[49,7,49,8],[50,7,50,8],[45,7,45,8],[46,7,46,8],[47,7,47,8],[42,7,42,8],[43,7,43,8],[44,7,44,8],[39,7,39,8],[40,7,40,8],[41,7,41,8],[36,7,36,8],[37,7,37,8],[38,7,38,8],[33,7,33,8],[34,7,34,8],[35,7,35,8],[30,7,30,8],[31,7,31,8],[32,7,32,8],[27,7,27,8],[28,7,28,8],[29,7,29,8],[24,7,24,8],[25,7,25,8],[26,7,26,8],[21,1,21,2],[21,7,21,8],[22,0,22,8],[23,0,23,2],[23,7,23,8],[19,1,19,2],[19,7,19,8],[20,1,20,2],[20,7,20,8],[17,1,17,2],[17,7,17,8],[18,1,18,2],[18,7,18,8],[15,1,15,2],[15,7,15,8],[16,1,16,2],[16,7,16,8],[13,1,13,2],[13,7,13,8],[14,1,14,2],[14,7,14,8],[11,1,11,2],[11,7,11,8],[12,1,12,2],[12,7,12,8],[9,1,9,2],[9,7,9,8],[10,1,10,2],[10,7,10,8],[7,1,7,2],[7,7,7,8],[8,1,8,2],[8,7,8,8],[3,0,4,8],[5,1,5,2],[5,7,5,8],[6,1,6,2],[6,7,6,8],[2,0,2,8],[0,0,1,0],[0,1,1,6],[0,7,0,8],[1,7,1,8]]}
[null,"SEEDING PLAN: BULK TO PLS DOCUMENTATION SHEET",null,null,null,null,null,"NE-CPA-8    "]
[null,null,null,null,null,null,null,"June, 2020"]
["Seed Dealer: If printout with seedlot number, purity, germination, bulk pounds and pls pounds for each seedlot that that was purchased by the producer is not available, please complete this documentation sheet."]
["Seed Purchased "]
[]
["Grass Species List","Variety",null,"Purity","Germ","Bulk Lbs","PLS Lbs","Seedlot Number"]
["Blue Grama "]
["Canada Wildrye"]
{"$rows_left_out":33}
{"sheet":"Guide-Grasses_Grasslikes","index":6,"n_rows":61,"n_cols":35,"rows_kept":61,"cut":false,"hidden":false,"merged":[[0,0,0,30],[0,31,0,33]]}
["GRASSES & GRASS-LIKES (Hide rows that are not applicable to your seedings i.e. MLRAs outside your work area)   If cells are blank, then no information is available for that characteristic."]
["PLANT Common Name","Species - USDA PLANTS","Family","Sands","Sandy","Loamy","Calcareous","Clayey","Shallow","Alkline / Saline Dry","Overflow / Lowland","Subirrigated","Wet Land","Saline Subirrigated","60A","63B","64","65","66","67A","71","72","73","75","102C","106","107B","B= Bunch,            S= Sod-forming,       A= Annual","N= Native US, NN= Native Nebraska, I=Introduced","Season of Growth  C= Cool, W=Warm","Suitable for Irrigated Forage Mixes","Fertility Requirements / Nitrogen Scavenging / (per National Plants Database)","Livestock Forage Value (per National Plants Database)","Wildlife Values","General Comments"]
["alkali sacaton ","Sporobolus airoides","Poaceae","N","N","N","N","N","N","Y","N","N","N","Y","Y","Y","Y","Y","N","Y","N","Y","N","N","N","Y","N","B ","NN","W","N","Medium","Medium",null,"In Lancaster County is only found in Saline Wetlands - rest of MLRAs listed, is found on Saline or Alkaline sites."]
["Bicknell's sedge","Carex bicknellii","Cyperaceae","N","N","Y","N","Y","N","N","Y","Y","Y","N","N","N","N","Y","N","N","Y","N","N","Y","Y","Y","Y","B ","NN","C","N","Low","Low","upland and songbirds will eat seeds","Upland prairies of SE and mesic meadows of eastern Sandhills"]
["big bluestem","Andropogon gerardii","Poaceae","N","N","Y","Y","Y","Y","N","Y","Y","N","N","Y","Y","Y","Y","Y","Y","Y","Y","Y","Y","Y","Y","Y","S ","NN","W","Y","Low","High","ideal for nesting and winter cover for birds/fawning cover"]
["blowout grass","Redfieldia flexuosa","Poaceae","Y","N","N","N","N","N","N","N","N","N","N","Y","Y","Y","Y","Y","Y","N","Y","N","N","N","N","N","S ","NN","W","N","Low","Low",null,"range plantings on loose sands sites only"]
["blue grama ","Bouteloua gracilis","Poaceae","Y","Y","Y","Y","Y","Y","Y","Y","Y","N","Y","Y","Y","Y","Y","Y","Y","Y","Y","Y","Y","Y","Y","Y","B ","NN","W","N","Low","Medium","creates ideal nesting cover","High forage quality, but medium for forage use as production is lower than other forage grasses."]
["bluebunch wheatgrass ","Pseudoroegneria spicata","Poaceae","N","Y","Y","N","N","Y","N","Y","N","N","N","Y","N","Y","N","N","N","N","N","N","N","N","N","N","B ","NN","C","N","Low","High",null,"Native to Sioux and Dawes County"]
{"$rows_left_out":54}
{"sheet":"Guide-Forbs","index":7,"n_rows":239,"n_cols":38,"rows_kept":239,"cut":false,"hidden":false,"merged":[[0,4,0,13],[0,14,0,26],[0,0,0,2]]}
["FORBS",null,null,null,"SOIL TYPES",null,null,null,null,null,null,null,null,null,"MLRA ADAPTABILITY (MLRAS where plant has been found in native situations; adaptability may extend into adjacent MLRAs)",null,null,null,null,null,null,null,null,null,null,null,null,"LIFESPAN","ORIGIN"]
["Plant  Name                                  (As listed in Flora of NE)","Species - USDA PLANTS","Family","Sands","Sandy","Loams","Calcareous","Clays","Shallow / Gravelly","Alkaline / Saline","Lowland","Subirrigated","Wet Land","Alk. / Saline Subirrigated","60A","63B","64","65","66","67A","71","72","73","75","102C","106","107B","A=Annual,   B=Biennial,  P=Perennial ","N= Native US, NN= Native Nebraska, I=Introduced","Bloom Period","TOXICITY","Livestock Forage Value","Pollinator Value","Monarch Value","Appropriate for Beneficial Insect Plantings","Monarch Value2","Wildlife Values","General Comments"]
["Allegheny monkey-flower ","Mimulus ringens","Scrophulariaceae","N","N","N","N","N","N","N","Y","Y","N","N","N","Y","N","Y","Y","Y","Y","N","Y","Y","Y","Y","Y","P","NN",2,null,null,null,null,null,null,null,"Found along mosist streambanks and other wet places, usually in woods."]
["Alsike clover ","Trifolium hybridum","Fabaceae","N","Y","Y",null,null,"N",null,"Y","Y",null,null,"N","N","N","N","Y","Y","Y","N","N","Y","Y","Y","Y","P","I",null,"Potentially Toxic","High",null,null,null,null,"creates  brood-rearing cover through structure","Locally common where seeded in hay meadows and tame pasture."]
["American germander ","Teucrium canadense","Lamiaceae","N","N","N","N","N","N","N","Y","Y","Y",null,"Y","Y","Y","Y","Y","Y","Y","Y","Y","Y","Y","Y","Y","P","NN",2,"None","Low",null,null,null,null,null,"Meadows, low prairies, moist woodlands and wetlands."]
["American senna","Senna hebecarpa","Fabaceae","N","Y","Y","N",null,null,null,"Y","Y",null,null,null,null,null,null,null,null,null,null,null,null,null,null,null,"P","N",2,null,null,null,null,null,null,null,"This is a large, long-lived legume.  It prefers moist soils of floodplains, but will grow on dry sites."]
["American vetch ","Vicia americana","Fabaceae","N","Y","Y","Y",null,null,"N",null,null,"N","N","Y","Y","Y","Y","Y","Y","Y","Y","Y","Y","Y","Y","Y","P","NN",1,"None","High",null,null,null,null,"provides forage for game birds and big game animals","Found in moist to dry prairies, open woodlands and badlands throughout the state."]
["aromatic aster","Symphyotrichum oblongifolium ","Asteraceae","Y","Y","Y",null,null,null,null,null,null,null,null,"N","Y","Y","Y","Y","N","Y","N","Y","Y","Y","Y","Y","P","NN",3,null,null,null,null,"Y","High",null,"Dry prairies except for the Southern Panhandle and SW.  "]
{"$rows_left_out":232}
{"sheet":"Guide-Shrubs","index":8,"n_rows":13,"n_cols":37,"rows_kept":13,"cut":false,"hidden":false,"merged":[[0,0,0,2],[0,4,0,13],[0,14,0,26]]}
["SHRUBS",null,null,null,"SOIL TYPES",null,null,null,null,null,null,null,null,null,"MLRA ADAPTABILITY (MLRAS where plant has been found in native situations; adaptability may extend into adjacent MLRAs)",null,null,null,null,null,null,null,null,null,null,null,null,"ORIGIN"]
["Plant","Species - USDA PLANTS","Family","Sands","Sandy","Loams","Calcareous","Clays","Shallow / Gravelly","Alkaline / Saline","Lowland","Subirrigated","Wet Land"," Saline Subirrigated","60A","63B","64","65","66","67A","71","72","73","75","102C","106","107B","N= Native US, NN= Native Nebraska, I=Introduced","Bloom Period","TOXICITY","Livestock Forage Value","Pollinator Value","Monarch Value","Appropriate for Beneficial Insect Plantings","Monarch Value2","Comments Regarding Wildlife ","General Comments"]
["Arkansas rose ","Rosa arkansana","Rosaceae","Y","Y","Y","Y","Y","Y",null,"Y",null,null,null,"Y","Y","Y","Y","Y","Y","Y","Y","Y","Y","Y","Y","Y","NN",1,"None","Low",null,null,"may create shrub-like strucuture important for wildlife cover",null,null,"Wide range of habitats including prairies and open woodlands. "]
["four-wing saltbush ","Atriplex canescens","Chenopodiaceae","N","N","N","Y","Y","N","N","N","N","N","N","Y","N","Y","N","N","Y","N","N","N","N","N","N","N","NN",null,"None","Medium",null,null,null,null,null,"Found in Ogallala National Grasslands, at Courthouse Rock and Scottsbluff National Monument."]
["fringed sage ","Artemisia frigida","Asteraceae","Y","Y","N","N","N","Y",null,"N","N","N","N","Y","Y","Y","Y","Y","Y","N","Y","N","N","Y","N","N","NN",null,"None","High",null,null,"provides nesting source and winter browse forage"]
["leadplant ","Amorpha canescens","Fabaceae","Y","Y","Y","Y","Y","Y",null,"Y","N","N","N",null,"Y","Y","Y","Y","Y","Y","Y","Y","Y","Y","Y","Y","NN",2,"None",null,null,null,"sought after by browse-eating species (large game)",null,null,"Found in woodlands in the East part of state and rarely in Pine Ridge"]
["New Jersey tea ","Ceanothus americanus","Rhamnaceae","N","Y","Y","Y","Y",null,null,null,"N","N","N","N","N","N","N","N","N","N","N","N","N","N","Y","Y","NN",1,"None","Low",null,null,"provides wildlife food sources",null,null,"Uncommon in the Eastern most counties of the State on non-sandy soils."]
["prairie redroot (Jersey tea)","Ceanothus herbaceus","Rhamnaceae","Y","Y","Y","Y","N","N","N","N","N","N","N","N","N","N","Y","Y","N","Y","N","N","Y","Y","Y","Y","NN",1,"None","Low",null,null,null,null,null,"Locally common on sandy soils in the E 1/2 of the State and into western sandhills."]
{"$rows_left_out":6}
{"sheet":"DATA_TABLE","index":9,"n_rows":331,"n_cols":9,"rows_kept":331,"cut":false,"hidden":false,"merged":[[0,1,0,8],[65,0,65,8],[322,0,322,2]]}
[null,"GRASSES"]
["Family","Species - USDA PLANTS","Common name  - Flora Of Nebraska","Seeds / ft2 @ 1 LB.","seeds/lb","Est. Cost per PLS pound","Bloom Period","COC","Species - USDA PLANTS2"]
["Poaceae","Sporobolus airoides","Alkali Sacaton ",{"$f":"E3/43560","v":40.174471992653814},1750000,null,null,5,"Sporobolus airoides"]
["Cyperaceae","Carex bicknellii","Bicknell's Sedge",{"$f":"E4/43560","v":6.2442607897153355},272000,null,null,6,"Carex bicknellii"]
["Poaceae","Andropogon gerardii","Big Bluestem ",{"$f":"E5/43560","v":3.3112947658402203},144240,null,null,5,"Andropogon gerardii"]
["Poaceae","Redfieldia flexuosa","Blowout Grass",null,null,null,null,6,"Redfieldia flexuosa"]
["Poaceae","Bouteloua gracilis","Blue Grama ",{"$f":"E7/43560","v":16.629935720844813},724400,null,null,4,"Bouteloua gracilis"]
["Poaceae","Pseudoroegneria spicata","bluebunch Wheatgrass ",2.8852157943067036,125680,null,null,7,"Pseudoroegneria spicata"]
{"$rows_left_out":323}