{"text_format":"1","workbook":"xlsx","n_sheets":17,"sheets":["NEW_528_Forage_Balance","OPTIONAL Monthly Production","ECS-63-Questionaire-Optional","NE-CPA-17A","NE-CPA-17B","Grazing Schedule Option 1-Auto","Grazing Schedule Option 1Manual","528 JS - Schedule Option #2","528 JS - Schedule Option #3","Contingency Plan","NE-ECS-414A-% use","NE-ECS-414B-min height","NE-ECS-12_App_Trend_Range","NE-ECS-13_Past Score","NE-ECS-64_Actual Use Report","NEW_DATA","DATA"],"not_rendered":{"charts":2,"images":2,"macros":1,"external_links":0,"defined_names":277,"comments":0,"pivot_tables":0},"unopened":[],"bounds":{"document_bytes":16777216,"sheet_cells":100000,"rows_first":2000,"rows_last":500,"rows_between":2000,"halvings":0,"cell_chars":16384,"cell_head_chars":4096},"cells_cut":0,"cells_raw":0,"read":"whole","date_system":"1900"}

{"sheet":"NEW_528_Forage_Balance","index":0,"n_rows":142,"n_cols":20,"rows_kept":142,"cut":false,"hidden":false,"merged":[[63,0,63,18],[55,13,55,14],[42,5,43,8],[42,11,43,12],[43,14,43,15],[45,19,46,22],[31,0,31,8],[31,17,31,18],[31,11,31,15],[56,13,56,14],[54,8,54,10],[54,11,54,14],[53,6,53,14],[55,6,55,7],[56,6,56,7],[55,8,55,9],[55,11,55,12],[34,11,34,15],[33,5,33,15],[35,5,35,15],[37,14,37,15],[38,14,38,15],[39,14,39,15],[36,14,36,15],[40,14,40,15],[60,13,60,14],[61,11,61,12],[61,13,61,14],[56,8,56,9],[57,8,57,9],[58,8,58,9],[59,8,59,9],[60,8,60,9],[61,8,61,9],[60,11,60,12],[56,11,56,12],[17,19,24,24],[124,19,129,23],[127,3,127,8],[127,0,127,2],[124,0,124,18],[130,0,130,18],[126,3,126,8],[126,0,126,2],[128,3,128,8],[128,0,128,2],[17,0,17,2],[18,0,18,2],[19,0,19,2],[20,0,20,2],[21,0,21,2],[29,0,29,2],[30,0,30,2],[51,13,51,15],[39,5,39,6],[40,5,40,6],[41,5,41,6],[51,9,51,10],[51,11,51,12],[46,5,46,6],[140,0,141,1],[11,16,12,16],[11,18,12,18],[11,17,12,17],[11,13,12,14],[11,15,12,15],[47,5,47,6],[48,5,48,6],[49,5,49,6],[50,5,50,6],[51,5,51,8],[41,14,41,15],[42,14,42,15],[45,5,45,15],[44,5,44,15],[46,14,46,15],[47,14,47,15],[48,14,48,15],[49,14,49,15],[50,14,50,15],[57,13,57,14],[137,0,137,1],[58,13,58,14],[59,13,59,14],[1,17,1,18],[3,0,3,2],[3,3,3,18],[5,0,7,3],[5,4,7,18],[8,0,8,18],[4,0,4,18],[2,0,2,18],[11,0,12,2],[15,9,16,9],[15,10,16,10],[15,11,16,11],[15,12,16,12],[15,13,16,14],[15,15,16,15],[15,0,16,2],[137,2,137,9],[141,2,141,8],[141,9,141,10],[141,11,141,12],[135,0,135,9],[136,0,136,1],[136,2,136,8],[136,9,136,10],[132,0,132,2],[131,2,131,9],[131,11,131,12],[126,9,126,10],[25,13,25,14],[67,14,67,15],[22,0,22,2],[134,0,134,18],[139,0,139,18],[142,2,142,11],[136,11,136,12],[126,11,126,12],[15,4,16,4],[11,3,12,6],[132,9,132,10],[132,11,132,12],[127,9,127,10],[127,11,127,12],[128,9,128,10],[128,11,128,12],[15,5,16,5],[132,3,132,8],[34,5,34,6],[34,7,34,10],[36,5,36,6],[37,5,37,6],[38,5,38,6],[57,6,57,7],[58,6,58,7],[59,6,59,7],[60,6,60,7],[61,6,61,7],[57,11,57,12],[131,19,136,22],[11,7,12,9],[9,0,10,3],[9,4,10,18],[24,17,24,18],[25,17,25,18],[26,17,26,18],[27,17,27,18],[28,17,28,18],[29,17,29,18],[30,17,30,18],[17,13,17,14],[18,13,18,14],[58,11,58,12],[59,11,59,12],[23,13,23,14],[24,13,24,14],[67,8,67,9],[67,11,67,12],[68,11,68,12],[68,8,68,9],[66,6,66,13],[15,3,16,3],[15,6,16,6],[25,0,25,2],[26,0,26,2],[27,0,27,2],[28,0,28,2],[11,10,12,12],[0,17,0,18],[0,15,0,16],[0,10,0,14],[10,19,10,21],[11,19,13,21],[0,0,0,2],[0,3,0,6],[0,8,0,9],[1,0,1,1],[1,2,1,7],[1,8,1,9],[1,10,1,14],[1,15,1,16],[15,7,16,7],[13,0,13,2],[15,16,16,16],[13,3,13,18],[14,0,14,10],[15,8,16,8],[0,19,7,23],[65,0,65,18],[26,13,26,14],[27,13,27,14],[28,13,28,14],[29,13,29,14],[30,13,30,14],[14,11,14,18],[15,17,16,18],[17,17,17,18],[18,17,18,18],[19,17,19,18],[20,17,20,18],[21,17,21,18],[22,17,22,18],[23,17,23,18],[19,13,19,14],[20,13,20,14],[21,13,21,14],[22,13,22,14],[33,19,41,23],[14,19,16,23],[23,0,23,2],[24,0,24,2],[69,11,69,12],[70,11,70,12],[71,11,71,12],[72,11,72,12],[73,11,73,12],[74,11,74,12],[75,11,75,12],[76,11,76,12],[77,11,77,12],[78,11,78,12],[79,11,79,12],[80,11,80,12],[81,11,81,12],[82,11,82,12],[83,11,83,12],[84,11,84,12],[85,11,85,12],[86,11,86,12],[87,11,87,12],[88,11,88,12],[89,11,89,12],[90,11,90,12],[91,11,91,12],[92,11,92,12],[93,11,93,12],[94,11,94,12],[95,11,95,12],[96,11,96,12],[97,11,97,12],[98,11,98,12],[99,11,99,12],[100,11,100,12],[101,11,101,12],[102,11,102,12],[103,11,103,12],[104,11,104,12],[69,8,69,9],[70,8,70,9],[71,8,71,9],[72,8,72,9],[73,8,73,9],[74,8,74,9],[75,8,75,9],[76,8,76,9],[77,8,77,9],[78,8,78,9],[79,8,79,9],[80,8,80,9],[81,8,81,9],[82,8,82,9],[83,8,83,9],[84,8,84,9],[85,8,85,9],[86,8,86,9],[87,8,87,9],[88,8,88,9],[89,8,89,9],[90,8,90,9],[91,8,91,9],[92,8,92,9],[93,8,93,9],[94,8,94,9],[95,8,95,9],[96,8,96,9],[97,8,97,9],[98,8,98,9],[99,8,99,9],[100,8,100,9],[101,8,101,9],[102,8,102,9],[103,8,103,9],[104,8,104,9],[114,11,114,12],[115,11,115,12],[116,11,116,12],[117,11,117,12],[118,11,118,12],[105,8,105,9],[106,8,106,9],[107,8,107,9],[105,11,105,12],[106,11,106,12],[107,11,107,12],[108,11,108,12],[109,11,109,12],[110,11,110,12],[111,11,111,12],[112,11,112,12],[113,11,113,12],[67,19,70,23],[138,19,148,23],[55,19,60,24],[25,19,26,23],[28,19,32,24],[121,6,121,7],[121,10,121,12],[122,6,122,12],[108,8,108,9],[109,8,109,9],[110,8,110,9],[111,8,111,9],[112,8,112,9],[113,8,113,9],[114,8,114,9],[115,8,115,9],[116,8,116,9],[117,8,117,9],[118,8,118,9],[119,8,119,9],[120,8,120,9],[121,8,121,9],[119,11,119,12],[120,11,120,12]]}
["FIELD OFFICE:",null,null,"Anytown Field Office",null,null,null,null,"COUNTY:",null,"Any County",null,null,null,null,"DATE:  ",null,"2020-11-12",null,"Complete one forage balance for the pastures being planned.  If planning for entire operations complete a forage balance for each enterprise.  For example:  Client A has a pure-bred angus herd that grazes one set of pastures and a composite herd that grazes another set of pastures: complete two prescribed grazing job sheets (you can use the same CPA-17A or two which ever you prefer)."]
["CLIENT:",null,"Mary Rancher - Sunnyvale Ranch",null,null,null,null,null,"FARM/TRACT NO:",null,"Farm 12785:  Tracts 1236, 1987 Farm 12965:  Tracts 876, 951",null,null,null,null,"CONTRACT NO:",null,"12345K"]
[]
["LEGAL DESCRIPTION:",null,null,"S2 Section 4, All Section 5, SE4, E2SW4 Section 7, All Section 8, NW4 SECTION 9 T-X-N, R-36W"]
[]
["Describe Management Objectives and Goals for Operation/Enterprise: ",null,null,null,"Improve forage production by 10% over the next 5 years by increasing the percentage of warm season, tall and mid grasses and increase carrying capacity to allow a longer grazing season to reduce feeding of supplemental forages to reduce overhead production costs."]
[]
[]
[]
["Describe Grazing System and General  Herd information:",null,null,null,"Current management is a 4-pasture deferred rotation system, twice through.   Flash graze of ~ 5 days in spring to graze cheatgrass growth and then slower graze through each pasture.  Graze corn stalks in fall; feed hay on crop aftermath in winter; calve and spring graze in a different set of pastures.  Large pastures will be split to result in a 9-pasture deferred rotation system to allow longer recovery time for the individual pastures and which will facilitate adaptive management."]
[]
["Average Date Into Unit: ",null,null,"Existing:  May 15; Planned:  May 1",null,null,null,"Average Date Removed From Unit:",null,null,"Existing:  October 31; Planned November 15.",null,null,"Forage Needs Expressed As:",null,"X","AUM",null,"AUD","Indicate whether forage is listed as AUM or AUD"]
[]
["Notes:  "]
["Existing Livestock Numbers and Forage Needs",null,null,null,null,null,null,null,null,null,null,"Planned Livestock Numbers and Forage Needs",null,null,null,null,null,null,null,"Hide rows for the livestock types that are not included in the operation to clean up the printout."]
["Livestock Type",null,null,"AU Equivalent","Average Weight","Number","AUM / Month Needed","AUD / Month Needed","Months on Unit","AUM Needed","AUD Needed","Number","AUM/ Month Needed","AUD/ Month Needed",null,"Months on Unit","AUM Needed","AUD Needed"]
[]
["Cow/calf pair",null,null,{"$f":"IF(A18=0,\"\",(VLOOKUP(A18,NEW_DATA!$V$2:$W$15,2,FALSE)))","v":1},1350,85,{"$f":"IF(F18=0,\"\",D18*(E18/1000)*F18)","v":114.75000000000001},{"$f":"IF(F18=0,\"\",(G18*30))","v":3442.5000000000005},4.5,{"$f":"IF(F18=0,\"\",(G18*I18))","v":516.37500000000011},{"$f":"IF(I18=0,\"\",(J18*30))","v":15491.250000000004},85,{"$f":"IF(L18=0,\"\",(D18*(E18/1000)*L18))","v":114.75000000000001},{"$f":"IF(L18=0,\"\",(M18*30))","v":3442.5000000000005},null,5,{"$f":"IF(L18=0,\"\",(P18*M18))","v":573.75000000000011},{"$f":"IF(P18=0,\"\",(N18*P18))","v":17212.500000000004},null,"In this example, the cow herd is on pasture from May 15th through October 31  most years.  Then moved to corn stalks, and we aren't including the winter grazing in the plan.  The calves are weaned on approximately September 30th, so the animals are moved from pairs to dry cows for the month of October."]
["Dry cows",null,null,{"$f":"IF(A19=0,\"\",(VLOOKUP(A19,NEW_DATA!$V$2:$W$15,2,FALSE)))","v":0.92},1350,85,{"$f":"IF(F19=0,\"\",D19*(E19/1000)*F19)","v":105.57000000000002},{"$f":"IF(F19=0,\"\",(G19*30))","v":3167.1000000000008},1,{"$f":"IF(F19=0,\"\",(G19*I19))","v":105.57000000000002},{"$f":"IF(I19=0,\"\",(J19*30))","v":3167.1000000000008},85,{"$f":"IF(L19=0,\"\",(D19*(E19/1000)*L19))","v":105.57000000000002},{"$f":"IF(L19=0,\"\",(M19*30))","v":3167.1000000000008},null,1.5,{"$f":"IF(L19=0,\"\",(P19*M19))","v":158.35500000000002},{"$f":"IF(P19=0,\"\",(N19*P19))","v":4750.6500000000015}]
["Bull",null,null,{"$f":"IF(A20=0,\"\",(VLOOKUP(A20,NEW_DATA!$V$2:$W$15,2,FALSE)))","v":1.35},2200,5,14.850000000000003,445.50000000000011,2,29.700000000000006,891.00000000000023,5,14.850000000000003,445.50000000000011,null,2,29.700000000000006,891.00000000000023]
["Yearling",null,null,{"$f":"IF(A21=0,\"\",(VLOOKUP(A21,NEW_DATA!$V$2:$W$15,2,FALSE)))","v":0},null,null,"","",null,"","",null,"","",null,null,"",""]
["1st calf heifer",null,null,{"$f":"IF(A22=0,\"\",(VLOOKUP(A22,NEW_DATA!$V$2:$W$15,2,FALSE)))","v":0.8},null,null,"","",null,"","",null,"","",null,null,"",""]
["Horse, mature",null,null,{"$f":"IF(A23=0,\"\",(VLOOKUP(A23,NEW_DATA!$V$2:$W$15,2,FALSE)))","v":1.25},1500,3,5.625,168.75,12,67.5,2025,3,5.625,168.75,null,12,67.5,2025]
["Sheep, mature",null,null,{"$f":"IF(A24=0,\"\",(VLOOKUP(A24,NEW_DATA!$V$2:$W$15,2,FALSE)))","v":0.2},null,null,"","",null,"","",null,"","",null,null,"",""]
["Lamb, 1 year old",null,null,{"$f":"IF(A25=0,\"\",(VLOOKUP(A25,NEW_DATA!$V$2:$W$15,2,FALSE)))","v":0.15},null,null,"","",null,"","",null,"","",null,null,"",""]
["Goat, mature",null,null,{"$f":"IF(A26=0,\"\",(VLOOKUP(A26,NEW_DATA!$V$2:$W$15,2,FALSE)))","v":0.15},null,null,"","",null,"","",null,"","",null,null,"","",null,"If you do not want both AUM and AUD to display, highlight the unwanted cells with black."]
["Kid, 1 year old",null,null,{"$f":"IF(A27=0,\"\",(VLOOKUP(A27,NEW_DATA!$V$2:$W$15,2,FALSE)))","v":0.1},null,null,"","",null,"","",null,"","",null,null,"",""]
["Deer, white tail",null,null,{"$f":"IF(A28=0,\"\",(VLOOKUP(A28,NEW_DATA!$V$2:$W$15,2,FALSE)))","v":0.15},null,null,"","",null,"","",null,"","",null,null,"",""]
["Bison",null,null,{"$f":"IF(A29=0,\"\",(VLOOKUP(A29,NEW_DATA!$V$2:$W$15,2,FALSE)))","v":1},null,null,"","",null,"","",null,"","",null,null,"","",null,"If the expected forage production is expected to improve and increase, long-term, or forage harvest expected to increase long-term, then increase the AUM available accordingly.  In some cases (removal of invasive woody or weedy species, the increase in forage production may be quite rapid."]
["Deer, mule",null,null,{"$f":"IF(A30=0,\"\",(VLOOKUP(A30,NEW_DATA!$V$2:$W$15,2,FALSE)))","v":0.2},null,null,"","",null,"","",null,"","",null,null,"",""]
["Elk",null,null,{"$f":"IF(A31=0,\"\",(VLOOKUP(A31,NEW_DATA!$V$2:$W$15,2,FALSE)))","v":0.6},null,null,"",{"$f":"IF(F31=0,\"\",(G31*30))","v":""},null,{"$f":"IF(F31=0,\"\",(G31*I31))","v":""},"",null,"","",null,null,"",{"$f":"IF(P31=0,\"\",(N31*P31))","v":""}]
["TOTAL EXISTING FORAGE DEMAND:  ",null,null,null,null,null,null,null,null,{"$f":"SUM(J18:J31)","v":719.14500000000021},{"$f":"SUM(K18:K31)","v":21574.350000000006},"TOTAL PLANNED FORAGE DEMAND:  ",null,null,null,null,{"$f":"SUM(Q18:Q31)","v":829.30500000000018},{"$f":"SUM(R18:R31)","v":24879.150000000005}]
[]
[null,null,null,null,null,"FORAGE INVENTORY - AVAILABLE FORAGE RESOURCES",null,null,null,null,null,null,null,null,null,null,null,null,null,"Note:  IF plans are to increase numbers due to the impact of improved grazing management the increase in stocking rate should not be immediate - it should only increase as the forage production increases.  It may take several years (or more) to realize the increases that will allow a higher harvest efficiency or that result in a plant community with increased production."]
[null,null,null,null,null,null,null,"Existing",null,null,null,"Planned"]
[null,null,null,null,null,"GRAZED FORAGES"]
[null,null,null,null,null,"Type of Forage",null,"Acres","AUMs","AUDs","Season of Use","Acres","AUMs","AUDs","Season of Use"]
[null,null,null,null,null,"Rangeland",null,2000,712.5,21376.9,"Spring/Summer/Fall",2000,712.5,21376.9,"Spring/Summer/Fall"]
[null,null,null,null,null,"Pastureland"]
[null,null,null,null,null,"Annual Forage"]
[null,null,null,null,null,"Crop Residue"]
[null,null,null,null,null,"Other Grazed"]
[null,null,null,null,null,"TOTAL AVAILABLE FORAGE:",null,null,null,"AUM","AUD","Total Ac. Forage",null,"AUM","AUD"]
[null,null,null,null,null,null,null,null,null,{"$f":"SUM(I38:I42)","v":712.5},{"$f":"SUM(J38:J42)","v":21376.9},null,null,{"$f":"SUM(M38:M42)","v":712.5},{"$f":"SUM(N38:N42)","v":21376.9}]
[]
[null,null,null,null,null,"HARVESTED FORAGES (HAY & GRAIN) - OPTIONAL",null,null,null,null,null,null,null,null,null,null,null,null,null,"If you are not working with supplemental feed, you can hide the rows with the feed table (44 - 50, and 55)"]
[null,null,null,null,null,"Type of Feed",null,"Source","Total Tons Available","Conversion  Factor","AUM's ","Source","Total Tons Available","Conversion Factor","AUM's"]
[null,null,null,null,null,null,null,null,null,{"$f":"IF(F48=0,\" \",VLOOKUP(F48,DATA!$A$1:$B$6,2,FALSE))","v":" "},{"$f":"IF(F48=0,\"\", SUM(I48*J48))","v":""},null,null,{"$f":"IF(F48=0,\" \",VLOOKUP(F48,DATA!$A$1:$B$6,2,FALSE))","v":" "},{"$f":"IF(F48=0,\"\", SUM(M48*N48))","v":""}]
[null,null,null,null,null,null,null,null,null,{"$f":"IF(F49=0,\" \",VLOOKUP(F49,DATA!$A$1:$B$6,2,FALSE))","v":" "},{"$f":"IF(F49=0,\"\", SUM(I49*J49))","v":""},null,null,{"$f":"IF(F49=0,\" \",VLOOKUP(F49,DATA!$A$1:$B$6,2,FALSE))","v":" "},{"$f":"IF(F49=0,\"\", SUM(M49*N49))","v":""}]
[null,null,null,null,null,null,null,null,null,{"$f":"IF(F50=0,\" \",VLOOKUP(F50,DATA!$A$1:$B$6,2,FALSE))","v":" "},{"$f":"IF(F50=0,\"\", SUM(I50*J50))","v":""},null,null,{"$f":"IF(F50=0,\" \",VLOOKUP(F50,DATA!$A$1:$B$6,2,FALSE))","v":" "},{"$f":"IF(F50=0,\"\", SUM(M50*N50))","v":""}]
[null,null,null,null,null,null,null,null,null,{"$f":"IF(F51=0,\" \",VLOOKUP(F51,DATA!$A$1:$B$6,2,FALSE))","v":" "},{"$f":"IF(F51=0,\"\", SUM(I51*J51))","v":""},null,null,{"$f":"IF(F51=0,\" \",VLOOKUP(F51,DATA!$A$1:$B$6,2,FALSE))","v":" "},{"$f":"IF(F51=0,\"\", SUM(M51*N51))","v":""}]
[null,null,null,null,null,"Total AUM's Available",null,null,null,{"$f":"SUM(K48:K51)","v":0},null,"Total AUM's Available",null,{"$f":"SUM(O48:O51)","v":0}]
[]
[null,null,null,null,null,null," FORAGE BALANCE FOR UNIT"]
[null,null,null,null,null,null,null,null,"Existing",null,null,"Planned"]
[null,null,null,null,null,null,null,null,"AUMs",null,"AUDs","AUMs",null,"AUDs",null,null,null,null,null,"If the feed/forage supply and demand are balanced (or more forage than needed in average years)the \"% Forage Needed Compared to Available will appear in black font.  If the font is red, more forage is needed than is available in a typical year; if font is red and cell is shaded light red, then the balance does not meet the standard."]
[null,null,null,null,null,null,"Forage Available",null,{"$f":"J44","v":712.5},null,{"$f":"K44","v":21376.9},{"$f":"N44","v":712.5},null,{"$f":"O44","v":21376.9}]
[null,null,null,null,null,null,"Feed Available",null,{"$f":"IF(I48=0,\"\",(J52))","v":""},null,{"$f":"IF(J52=0,\"\",(I58*30))","v":""},{"$f":"IF(N52=0,\"\",(N52))","v":""},null,{"$f":"IF(N52=0,\"\",(L58*30))","v":""}]
[null,null,null,null,null,null,"Total Available",null,{"$f":"SUM(I57:I58)","v":712.5},null,{"$f":"SUM(K57:K58)","v":21376.9},{"$f":"SUM(L57:L58)","v":712.5},null,{"$f":"SUM(N57:N58)","v":21376.9}]
[null,null,null,null,null,null,"Forage Needed",null,{"$f":"J32","v":719.14500000000021},null,{"$f":"K32","v":21574.350000000006},{"$f":"Q32","v":829.30500000000018},null,{"$f":"R32","v":24879.150000000005}]
[null,null,null,null,null,null,"Forage Balance",null,{"$f":"I59-I60","v":-6.6450000000002092},null,{"$f":"K59-K60","v":-197.45000000000437},{"$f":"L59-L60","v":-116.80500000000018},null,{"$f":"N59-N60","v":-3502.2500000000036}]
[null,null,null,null,null,null,"% Forage Needed Compared to Available",null,{"$f":"100-((I61/I60)*100)","v":100.92401393321238},null,{"$f":"100-((K61/K60)*100)","v":100.91520717889533},{"$f":"100-((L61/L59)*100)","v":116.39368421052635},null,{"$f":"100-((N61/N59)*100)","v":116.38333902483524}]
[]
[]
[]
[]
[null,null,null,null,null,null,"FORAGE AVAILABILITY PER PASTURE"]
[null,null,null,null,null,null,"Field Number","Acres","Forage Type",null,"Planned Harvest Efficiency","Estimated Available Forage AUM or AUD",null,"Estimated Days per Pasture","Length Grazing Season (days):",null,195,null,null,"Make sure to enter the length of the grazing season , or the estimated days per pasture will not auto calculate.  In this example, the grazing season is May 1 - Nov 15 or 6.5 months (195 days)."]
[null,null,null,null,null,null,"R1A",305,"Range",null,0.3,115,null,{"$f":"IF(G69=0,\"\",((L69/$N$122)*$Q$68))","v":31.451612903225804}]
[null,null,null,null,null,null,"R1B",335,"Range",null,0.3,92,null,{"$f":"IF(G70=0,\"\",((L70/$N$122)*$Q$68))","v":25.161290322580644}]
[null,null,null,null,null,null,"R2",320,"Range",null,0.3,122,null,33.366058906030858]
[null,null,null,null,null,null,"R3",80,"Range",null,0.3,35,null,9.5722300140252443]
[null,null,null,null,null,null,"R4",160,"Range",null,0.3,58,null,15.862552594670406]
[null,null,null,null,null,null,"R5A",240,"Range",null,0.3,66,null,18.050490883590463]
[null,null,null,null,null,null,"R5B",263,"Range",null,0.3,106,null,28.990182328190741]
[null,null,null,null,null,null,"R5C",137,"Range",null,0.3,29,null,7.9312762973352031]
[null,null,null,null,null,null,"R6",160,"Range",null,0.3,90,null,24.614305750350631]
[null,null,null,null,null,null,null,null,null,null,null,null,null,""]
[null,null,null,null,null,null,null,null,null,null,null,null,null,""]
[null,null,null,null,null,null,null,null,null,null,null,null,null,""]
[null,null,null,null,null,null,null,null,null,null,null,null,null,""]
[null,null,null,null,null,null,null,null,null,null,null,null,null,""]
[null,null,null,null,null,null,null,null,null,null,null,null,null,""]
[null,null,null,null,null,null,null,null,null,null,null,null,null,""]
[null,null,null,null,null,null,null,null,null,null,null,null,null,""]
[null,null,null,null,null,null,null,null,null,null,null,null,null,""]
[null,null,null,null,null,null,null,null,null,null,null,null,null,""]
[null,null,null,null,null,null,null,null,null,null,null,null,null,""]
[null,null,null,null,null,null,null,null,null,null,null,null,null,""]
[null,null,null,null,null,null,null,null,null,null,null,null,null,""]
[null,null,null,null,null,null,null,null,null,null,null,null,null,""]
[null,null,null,null,null,null,null,null,null,null,null,null,null,""]
[null,null,null,null,null,null,null,null,null,null,null,null,null,""]
[null,null,null,null,null,null,null,null,null,null,null,null,null,""]
[null,null,null,null,null,null,null,null,null,null,null,null,null,""]
[null,null,null,null,null,null,null,null,null,null,null,null,null,""]
[null,null,null,null,null,null,null,null,null,null,null,null,null,""]
[null,null,null,null,null,null,null,null,null,null,null,null,null,""]
[null,null,null,null,null,null,null,null,null,null,null,null,null,""]
[null,null,null,null,null,null,null,null,null,null,null,null,null,""]
[null,null,null,null,null,null,null,null,null,null,null,null,null,""]
[null,null,null,null,null,null,null,null,null,null,null,null,null,""]
[null,null,null,null,null,null,null,null,null,null,null,null,null,""]
[null,null,null,null,null,null,null,null,null,null,null,null,null,""]
[null,null,null,null,null,null,null,null,null,null,null,null,null,""]
[null,null,null,null,null,null,null,null,null,null,null,null,null,""]
[null,null,null,null,null,null,null,null,null,null,null,null,null,""]
[null,null,null,null,null,null,null,null,null,null,null,null,null,""]
[null,null,null,null,null,null,null,null,null,null,null,null,null,""]
[null,null,null,null,null,null,null,null,null,null,null,null,null,""]
[null,null,null,null,null,null,null,null,null,null,null,null,null,""]
[null,null,null,null,null,null,null,null,null,null,null,null,null,""]
[null,null,null,null,null,null,null,null,null,null,null,null,null,""]
[null,null,null,null,null,null,null,null,null,null,null,null,null,""]
[null,null,null,null,null,null,null,null,null,null,null,null,null,""]
[null,null,null,null,null,null,null,null,null,null,null,null,null,""]
[null,null,null,null,null,null,null,null,null,null,null,null,null,""]
[null,null,null,null,null,null,null,null,null,null,null,null,null,""]
[null,null,null,null,null,null,null,null,null,null,null,null,null,""]
[null,null,null,null,null,null,null,null,null,null,null,null,null,""]
[null,null,null,null,null,null,null,null,null,null,null,null,null,""]
[null,null,null,null,null,null,"TOTAL ACRES:",null,{"$f":"SUM(H69:H121)","v":2000},null,"TOTAL FORAGE AVAILABLE:",null,null,{"$f":"SUM(L69:L121)","v":713}]
[null,null,null,null,null,null,"Total Days:",null,null,null,null,null,null,{"$f":"SUM(N69:N121)","v":195.00000000000003}]
[]
["Design Information:   Natural Resources Conservation Service (NRCS) Representative or Technical Service Provider (TSP):"]
[]
["Inventory by:  ",null,null,null,null,null,null,null,null,"Date:  "]
["Designed by:  ",null,null,null,null,null,null,null,null,"Date:  "]
["Approved by:  ",null,null,null,null,null,null,null,null,"Date:  "]
[]
["Producer Acknowledgement:  I have received a copy of the specifications for prescribed grazing and understand the contents and requirements."]
[null,null,null,null,null,null,null,null,null,null,null,null,null,null,null,null,null,null,null,"Before printing, hide unneeded rows and set the page breaks as needed to break the document where desired, such as keeping the signature blocks together.  Under the View menu, chose page break preview and drag or insert page breaks to desired page breaks."]
["Producer Signature:",null,null,null,null,null,null,null,null,"Date:  "]
[]
["Practice Certification:  This applied practice meets Nebraska NRCS standards and specifications:"]
[]
["Signature:  ",null,null,null,null,null,null,null,null,"Date:  "]
["Representing:"]
[null,null,null,null,null,null,null,null,null,null,null,null,null,null,null,null,null,null,null,"Attach Forage Inventory (NE-CPA-17A or NE-CPA-17B, or other forage inventory documentation form), Grazing Schedule (one of the 4 provided, or a map with grazing dates, or other format which describes the grazing sequence, estimated days and dates per pasture), either NE-CPA-414A or NE-CPA-414B, contingency plan, and either Range Trend or Pasture Condition Score worksheets as appropriate."]
["Producer verification required if financial assistance is being received for prescribed grazing:  This practice has been applied as designed:"]
["Producer Signature:"]
[null,null,null,null,null,null,null,null,null,"Date:  "]

{"sheet":"OPTIONAL Monthly Production","index":1,"n_rows":157,"n_cols":22,"rows_kept":157,"cut":false,"hidden":false,"merged":[[13,0,13,2],[14,0,14,2],[15,0,15,2],[4,20,5,25],[2,20,3,25],[0,20,1,23],[0,0,0,1],[0,2,0,7],[0,8,0,9],[0,10,0,14],[0,15,0,16],[0,17,0,19],[1,0,1,19],[9,0,9,2],[10,0,10,2],[11,0,11,2],[12,0,12,2],[2,0,3,19],[4,0,5,2],[4,3,5,3],[4,4,5,4],[4,5,5,5],[4,6,5,6],[4,7,5,7],[4,8,4,19],[6,0,6,2],[26,20,39,23],[27,0,27,2],[28,0,28,2],[29,0,29,2],[30,0,30,2],[31,0,31,2],[32,0,32,2],[19,0,19,2],[20,0,20,7],[21,0,21,16],[21,17,21,19],[22,0,23,19],[24,0,25,2],[24,3,25,3],[24,4,25,4],[24,5,25,5],[24,6,25,6],[33,0,33,2],[6,20,15,25],[7,0,7,2],[8,0,8,2],[24,7,25,7],[24,8,24,19],[26,0,26,2],[44,0,45,1],[44,2,45,6],[44,7,45,7],[44,8,44,19],[16,0,16,2],[17,0,17,2],[18,0,18,2],[39,0,39,2],[40,0,40,19],[41,0,41,7],[42,0,42,16],[42,17,42,19],[43,0,43,6],[43,7,43,19],[34,0,34,2],[35,0,35,2],[36,0,36,2],[37,0,37,2],[38,0,38,2],[51,2,51,6],[52,0,52,1],[52,2,52,6],[53,0,53,19],[54,0,69,19],[54,20,58,23],[46,21,51,23],[47,0,47,1],[47,2,47,6],[48,0,48,1],[48,2,48,6],[49,0,49,1],[49,2,49,6],[50,0,50,1],[50,2,50,6],[51,0,51,1],[60,20,63,23],[46,0,46,1],[46,2,46,6],[70,0,70,19],[71,0,71,19],[72,0,73,1],[72,2,73,3],[72,5,73,5],[72,8,72,19],[78,2,78,3],[79,0,79,1],[79,2,79,3],[74,0,74,1],[74,2,74,3],[82,0,82,1],[82,2,82,3],[83,0,83,1],[83,2,83,3],[84,0,84,1],[84,2,84,3],[74,20,81,22],[75,0,75,1],[75,2,75,3],[76,0,76,1],[76,2,76,3],[77,0,77,1],[77,2,77,3],[78,0,78,1],[80,0,80,1],[80,2,80,3],[81,0,81,1],[81,2,81,3],[88,0,88,1],[88,2,88,3],[89,0,89,1],[89,2,89,3],[90,0,90,1],[90,2,90,3],[85,0,85,1],[85,2,85,3],[86,0,86,1],[86,2,86,3],[87,0,87,1],[87,2,87,3],[94,0,94,1],[94,2,94,3],[95,0,95,1],[95,2,95,3],[96,0,96,1],[96,2,96,3],[91,0,91,1],[91,2,91,3],[92,0,92,1],[92,2,92,3],[93,0,93,1],[93,2,93,3],[100,0,100,1],[100,2,100,3],[101,0,101,1],[101,2,101,3],[102,0,102,1],[102,2,102,3],[97,0,97,1],[97,2,97,3],[98,0,98,1],[98,2,98,3],[99,0,99,1],[99,2,99,3],[106,0,106,1],[106,2,106,3],[107,0,107,1],[107,2,107,3],[108,0,108,1],[108,2,108,3],[103,0,103,1],[103,2,103,3],[104,0,104,1],[104,2,104,3],[105,0,105,1],[105,2,105,3],[112,0,112,1],[112,2,112,3],[113,0,113,1],[113,2,113,3],[114,0,114,1],[114,2,114,3],[109,0,109,1],[109,2,109,3],[110,0,110,1],[110,2,110,3],[111,0,111,1],[111,2,111,3],[118,0,118,1],[118,2,118,3],[119,0,119,1],[119,2,119,3],[120,0,120,1],[120,2,120,3],[115,0,115,1],[115,2,115,3],[116,0,116,1],[116,2,116,3],[117,0,117,1],[117,2,117,3],[127,0,127,6],[128,0,128,6],[124,0,124,1],[124,2,124,3],[125,0,125,1],[125,2,125,3],[126,0,126,1],[126,2,126,3],[121,0,121,1],[121,2,121,3],[122,0,122,1],[122,2,122,3],[123,0,123,1],[123,2,123,3],[137,1,138,2],[137,3,138,3],[137,4,138,4],[137,5,138,5],[137,6,138,7],[137,9,138,10],[128,20,136,23],[129,0,129,6],[130,0,130,6],[131,0,131,6],[132,0,132,6],[133,1,133,17],[134,0,134,17],[136,1,136,7],[136,9,136,17],[137,11,138,11],[137,12,138,13],[137,14,138,15],[137,16,138,17],[137,18,138,19],[138,20,142,22],[139,18,139,19],[140,18,140,19],[141,18,141,19],[142,6,142,7],[142,9,142,10],[142,12,142,13],[142,14,142,15],[142,16,142,17],[141,1,141,2],[141,6,141,7],[141,9,141,10],[141,12,141,13],[141,14,141,15],[141,16,141,17],[140,1,140,2],[140,6,140,7],[140,9,140,10],[140,12,140,13],[140,14,140,15],[140,16,140,17],[139,1,139,2],[139,6,139,7],[139,9,139,10],[139,12,139,13],[139,14,139,15],[139,16,139,17],[150,5,150,7],[150,9,150,12],[150,13,150,14],[150,15,150,17],[143,18,143,19],[144,1,144,2],[144,6,144,7],[144,14,145,15],[144,16,145,17],[144,18,145,19],[145,1,145,5],[145,6,145,7],[143,1,143,2],[143,6,143,7],[143,9,143,10],[143,12,143,13],[143,14,143,15],[143,16,143,17],[16,20,25,25],[142,18,142,19],[142,1,142,2],[157,20,160,23],[154,9,154,13],[154,15,154,17],[155,0,155,19],[156,0,156,3],[156,5,156,7],[156,9,156,13],[156,15,156,17],[150,20,156,24],[151,0,151,19],[152,0,152,3],[152,5,152,7],[152,9,152,12],[152,13,152,14],[152,15,152,17],[153,0,153,19],[154,0,154,3],[154,5,154,7],[148,0,148,19],[149,0,149,19],[150,0,150,3]]}
["CLIENT:",null,null,null,null,null,null,null,"FARM/TRACT NO:",null,null,null,null,null,null,"CONTRACT NO:"]
[]
["Existing Livestock Numbers and Forage Needs",null,null,null,null,null,null,null,null,null,null,null,null,null,null,null,null,null,null,null,"This can be used in addition to the NEW 528 Forage Balance Sheet if you wish to show the monthly balance."]
[]
["Livestock Type",null,null,"AU Equivalent","Average Weight","Number","AUM / Month Needed","AUD / Month Needed","AUM OR AUD NEEDED BY MONTH",null,null,null,null,null,null,null,null,null,null,null,"Hide rows for the livestock types that are not included in the operation to clean up the printout."]
[null,null,null,null,null,null,null,null,"Jan","Feb","Mar","Apr","May","Jun","Jul","Aug","Sep","Oct","Nov","Dec"]
["Cow/calf pair",null,null,{"$f":"IF(A7=0,\"\",(VLOOKUP(A7,NEW_DATA!$V$2:$W$15,2,FALSE)))","v":1},{"$f":"NEW_528_Forage_Balance!E18","v":1350},{"$f":"NEW_528_Forage_Balance!F18","v":85},{"$f":"IF(A7=0,\"\",D7*(E7/1000)*F7)","v":114.75000000000001},{"$f":"G7*30","v":3442.5000000000005},null,null,null,null,57,115,115,115,115,null,null,null,"You will need to manually populate the AUM / AUD per month.   In this example, the cow herd is on pasture from May 15th through October 31  most years.  Then moved to corn stalks, and we aren't including the winter in the plan.  The calves are weaned on approximately October 1st, so the animals are moved from pairs to dry cows for all of October.  The planned situation will be on pasture from May 1st through November 15"]
["Dry cows",null,null,{"$f":"IF(A8=0,\"\",(VLOOKUP(A8,NEW_DATA!$V$2:$W$15,2,FALSE)))","v":0.92},{"$f":"NEW_528_Forage_Balance!E19","v":1350},{"$f":"NEW_528_Forage_Balance!F19","v":85},{"$f":"IF(A8=0,\"\",D8*(E8/1000)*F8)","v":105.57000000000002},{"$f":"G8*30","v":3167.1000000000008},null,null,null,null,null,null,null,null,null,106]
["Bull",null,null,{"$f":"IF(A9=0,\"\",(VLOOKUP(A9,NEW_DATA!$V$2:$W$15,2,FALSE)))","v":1.35},{"$f":"NEW_528_Forage_Balance!E20","v":2200},{"$f":"NEW_528_Forage_Balance!F20","v":5},14.850000000000003,445.50000000000011,null,null,null,null,null,15,15]
["Yearling",null,null,{"$f":"IF(A10=0,\"\",(VLOOKUP(A10,NEW_DATA!$V$2:$W$15,2,FALSE)))","v":0},{"$f":"NEW_528_Forage_Balance!E21","v":0},{"$f":"NEW_528_Forage_Balance!F21","v":0},{"$f":"IF(A10=0,\"\",1*(E10/1000)*F10)","v":0},0]
["1st calf heifer",null,null,{"$f":"IF(A11=0,\"\",(VLOOKUP(A11,NEW_DATA!$V$2:$W$15,2,FALSE)))","v":0.8},{"$f":"NEW_528_Forage_Balance!E22","v":0},{"$f":"NEW_528_Forage_Balance!F22","v":0},{"$f":"IF(A11=0,\"\",1*(E11/1000)*F11)","v":0},0]
["Horse, mature",null,null,{"$f":"IF(A12=0,\"\",(VLOOKUP(A12,NEW_DATA!$V$2:$W$15,2,FALSE)))","v":1.25},{"$f":"NEW_528_Forage_Balance!E23","v":1500},{"$f":"NEW_528_Forage_Balance!F23","v":3},{"$f":"IF(A12=0,\"\",D12*(E12/1000)*F12)","v":5.625},168.75,6,6,6,6,6,6,6,6,6,6,6,6]
["Sheep, mature",null,null,{"$f":"IF(A13=0,\"\",(VLOOKUP(A13,NEW_DATA!$V$2:$W$15,2,FALSE)))","v":0.2},null,{"$f":"NEW_528_Forage_Balance!F24","v":0},{"$f":"IF(A13=0,\"\",D13*F13)","v":0},0]
["Lamb, 1 year old",null,null,{"$f":"IF(A14=0,\"\",(VLOOKUP(A14,NEW_DATA!$V$2:$W$15,2,FALSE)))","v":0.15},null,{"$f":"NEW_528_Forage_Balance!F25","v":0},{"$f":"IF(A14=0,\"\",D14*F14)","v":0},0]
["Goat, mature",null,null,{"$f":"IF(A15=0,\"\",(VLOOKUP(A15,NEW_DATA!$V$2:$W$15,2,FALSE)))","v":0.15},null,{"$f":"NEW_528_Forage_Balance!F26","v":0},0,0]
["Kid, 1 year old",null,null,{"$f":"IF(A16=0,\"\",(VLOOKUP(A16,NEW_DATA!$V$2:$W$15,2,FALSE)))","v":0.1},null,{"$f":"NEW_528_Forage_Balance!F27","v":0},0,0]
["Deer, white tail",null,null,{"$f":"IF(A17=0,\"\",(VLOOKUP(A17,NEW_DATA!$V$2:$W$15,2,FALSE)))","v":0.15},null,{"$f":"NEW_528_Forage_Balance!F28","v":0},0,0,null,null,null,null,null,null,null,null,null,null,null,null,"Manually complete the monthly table for the months that you are developing the plan.  If range is grazed year-round, complete for January - December.  If you are only developing a plan on grazing units that are grazed a portion of the year, including the months that those units are not grazed is optional.  If planning year-round, remember to reduce AUM's needed when animals are sold and increase AUM's needed when animals are purchased."]
["Bison",null,null,{"$f":"IF(A18=0,\"\",(VLOOKUP(A18,NEW_DATA!$V$2:$W$15,2,FALSE)))","v":1},null,{"$f":"NEW_528_Forage_Balance!F29","v":0},0,0]
["Deer, mule",null,null,{"$f":"IF(A19=0,\"\",(VLOOKUP(A19,NEW_DATA!$V$2:$W$15,2,FALSE)))","v":0.2},null,{"$f":"NEW_528_Forage_Balance!F30","v":0},0,0]
["Elk",null,null,{"$f":"IF(A20=0,\"\",(VLOOKUP(A20,NEW_DATA!$V$2:$W$15,2,FALSE)))","v":0.6},null,{"$f":"NEW_528_Forage_Balance!F31","v":0},0,0]
["TOTAL FORAGE REQUIRED BY MONTH:",null,null,null,null,null,null,null,{"$f":"SUM(I6:I19)","v":6},6,6,6,63,136,136,121,121,112,6,6]
["TOTAL ANNUAL FORAGE REQUIRED FOR THE GRAZING  YEAR:",null,null,null,null,null,null,null,null,null,null,null,null,null,null,null,null,{"$f":"SUM(I21:T21)","v":725}]
["Planned Livestock Numbers and Forage Needs"]
[]
["Livestock Type",null,null,"AU Equivalent","Average Weight","Number","AUM / Month Needed","AUD / Month Needed","AUM OR AUD NEEDED BY MONTH"]
[null,null,null,null,null,null,null,null,"Jan","Feb","Mar","Apr","May","Jun","Jul","Aug","Sep","Oct","Nov","Dec"]
["Cow/calf pair",null,null,{"$f":"IF(A27=0,\"\",(VLOOKUP(A27,NEW_DATA!$V$2:$W$15,2,FALSE)))","v":1},{"$f":"NEW_528_Forage_Balance!E18","v":1350},{"$f":"NEW_528_Forage_Balance!L18","v":85},{"$f":"IF(A27=0,\"\",D27*(E27/1000)*F27)","v":114.75000000000001},{"$f":"G27*30","v":3442.5000000000005},null,null,null,null,115,115,115,115,115]
["Dry cows",null,null,{"$f":"IF(A28=0,\"\",(VLOOKUP(A28,NEW_DATA!$V$2:$W$15,2,FALSE)))","v":0.92},{"$f":"NEW_528_Forage_Balance!E19","v":1350},{"$f":"NEW_528_Forage_Balance!L19","v":85},{"$f":"IF(A28=0,\"\",D28*(E28/1000)*F28)","v":105.57000000000002},{"$f":"G28*30","v":3167.1000000000008},null,null,null,null,null,null,null,null,null,106,53]
["Bull",null,null,{"$f":"IF(A29=0,\"\",(VLOOKUP(A29,NEW_DATA!$V$2:$W$15,2,FALSE)))","v":1.35},{"$f":"NEW_528_Forage_Balance!E20","v":2200},{"$f":"NEW_528_Forage_Balance!L20","v":5},14.850000000000003,445.50000000000011,null,null,null,null,null,15,15]
["Yearling",null,null,{"$f":"IF(A30=0,\"\",(VLOOKUP(A30,NEW_DATA!$V$2:$W$15,2,FALSE)))","v":0},{"$f":"NEW_528_Forage_Balance!E21","v":0},{"$f":"NEW_528_Forage_Balance!L21","v":0},{"$f":"IF(A30=0,\"\",1*(E30/1000)*F30)","v":0},0]
["1st calf heifer",null,null,{"$f":"IF(A31=0,\"\",(VLOOKUP(A31,NEW_DATA!$V$2:$W$15,2,FALSE)))","v":0.8},{"$f":"NEW_528_Forage_Balance!E22","v":0},{"$f":"NEW_528_Forage_Balance!L22","v":0},{"$f":"IF(A31=0,\"\",1*(E31/1000)*F31)","v":0},0]
["Horse, mature",null,null,{"$f":"IF(A32=0,\"\",(VLOOKUP(A32,NEW_DATA!$V$2:$W$15,2,FALSE)))","v":1.25},{"$f":"NEW_528_Forage_Balance!E23","v":1500},{"$f":"NEW_528_Forage_Balance!L23","v":3},5.625,168.75,6,6,6,6,6,6,6,6,6,6,6,6]
["Sheep, mature",null,null,{"$f":"IF(A33=0,\"\",(VLOOKUP(A33,NEW_DATA!$V$2:$W$15,2,FALSE)))","v":0.2},null,{"$f":"NEW_528_Forage_Balance!L24","v":0},{"$f":"IF(A33=0,\"\",D33*F33)","v":0},0]
["Lamb, 1 year old",null,null,{"$f":"IF(A34=0,\"\",(VLOOKUP(A34,NEW_DATA!$V$2:$W$15,2,FALSE)))","v":0.15},null,{"$f":"NEW_528_Forage_Balance!L25","v":0},{"$f":"IF(A34=0,\"\",D34*F34)","v":0},0]
["Goat, mature",null,null,{"$f":"IF(A35=0,\"\",(VLOOKUP(A35,NEW_DATA!$V$2:$W$15,2,FALSE)))","v":0.15},null,{"$f":"NEW_528_Forage_Balance!L26","v":0},0,0]
["Kid, 1 year old",null,null,{"$f":"IF(A36=0,\"\",(VLOOKUP(A36,NEW_DATA!$V$2:$W$15,2,FALSE)))","v":0.1},null,{"$f":"NEW_528_Forage_Balance!L27","v":0},0,0]
["Deer, white tail",null,null,{"$f":"IF(A37=0,\"\",(VLOOKUP(A37,NEW_DATA!$V$2:$W$15,2,FALSE)))","v":0.15},null,{"$f":"NEW_528_Forage_Balance!L28","v":0},0,0]
["Bison",null,null,{"$f":"IF(A38=0,\"\",(VLOOKUP(A38,NEW_DATA!$V$2:$W$15,2,FALSE)))","v":1},null,{"$f":"NEW_528_Forage_Balance!L29","v":0},0,0]
["Deer, mule",null,null,{"$f":"IF(A39=0,\"\",(VLOOKUP(A39,NEW_DATA!$V$2:$W$15,2,FALSE)))","v":0.2},null,{"$f":"NEW_528_Forage_Balance!L30","v":0},0,0]
["Elk",null,null,{"$f":"IF(A40=0,\"\",(VLOOKUP(A40,NEW_DATA!$V$2:$W$15,2,FALSE)))","v":0.6},null,{"$f":"NEW_528_Forage_Balance!L31","v":0},0,0]
[]
["TOTAL FORAGE REQUIRED BY MONTH:",null,null,null,null,null,null,null,{"$f":"SUM(I27:I40)","v":6},{"$f":"SUM(J27:J40)","v":6},6,6,121,136,136,121,121,112,59,6]
["TOTAL ANNUAL FORAGE REQUIRED FOR THE GRAZING  YEAR:",null,null,null,null,null,null,null,null,null,null,null,null,null,null,null,null,{"$f":"SUM(I42:T42)","v":836}]
[null,null,null,null,null,null,null,"Predominant Growth Curve"]
["MLRA",null,"Predominant Growth Curve Description",null,null,null,null,"Curve Number","% Forage Produced by Month"]
[null,null,null,null,null,null,null,null,"Jan","Feb","Mar","Apr","May","Jun","Jul","Aug","Sep","Oct","Nov","Dec"]
["M_67A",null,"67A-Upland - Western Wheat dom.",null,null,null,null,1,{"$f":"IF($A47=0,\" \",VLOOKUP($C47,NEW_DATA!$G$2:$S$147,2,FALSE))","v":0},{"$f":"IF($A47=0,\" \",VLOOKUP($C47,NEW_DATA!$G$2:$S$147,3,FALSE))","v":0},{"$f":"IF($A47=0,\" \",VLOOKUP($C47,NEW_DATA!$G$2:$S$147,4,FALSE))","v":0},{"$f":"IF($A47=0,\" \",VLOOKUP($C47,NEW_DATA!$G$2:$S$147,5,FALSE))","v":5},{"$f":"IF($A47=0,\" \",VLOOKUP($C47,NEW_DATA!$G$2:$S$147,6,FALSE))","v":25},{"$f":"IF($A47=0,\" \",VLOOKUP($C47,NEW_DATA!$G$2:$S$147,7,FALSE))","v":40},{"$f":"IF($A47=0,\" \",VLOOKUP($C47,NEW_DATA!$G$2:$S$147,8,FALSE))","v":15},{"$f":"IF($A47=0,\" \",VLOOKUP($C47,NEW_DATA!$G$2:$S$147,9,FALSE))","v":5},{"$f":"IF($A47=0,\" \",VLOOKUP($C47,NEW_DATA!$G$2:$S$147,10,FALSE))","v":10},{"$f":"IF($A47=0,\" \",VLOOKUP($C47,NEW_DATA!$G$2:$S$147,11,FALSE))","v":0},{"$f":"IF($A47=0,\" \",VLOOKUP($C47,NEW_DATA!$G$2:$S$147,12,FALSE))","v":0},{"$f":"IF($A47=0,\" \",VLOOKUP($C47,NEW_DATA!$G$2:$S$147,13,FALSE))","v":0},{"$f":"SUM(I47:T47)","v":100},"Include growth curves for the dominant sites in the operation.  Minor growth curves do not need to be included."]
["M_67A",null,"67A-Upland-higher SI",null,null,null,null,2,{"$f":"IF($A48=0,\" \",VLOOKUP($C48,NEW_DATA!$G$2:$S$143,2,FALSE))","v":0},{"$f":"IF($A48=0,\" \",VLOOKUP($C48,NEW_DATA!$G$2:$S$143,3,FALSE))","v":0},{"$f":"IF($A48=0,\" \",VLOOKUP($C48,NEW_DATA!$G$2:$S$143,4,FALSE))","v":0},{"$f":"IF($A48=0,\" \",VLOOKUP($C48,NEW_DATA!$G$2:$S$143,5,FALSE))","v":5},{"$f":"IF($A48=0,\" \",VLOOKUP($C48,NEW_DATA!$G$2:$S$143,6,FALSE))","v":15},{"$f":"IF($A48=0,\" \",VLOOKUP($C48,NEW_DATA!$G$2:$S$143,7,FALSE))","v":25},{"$f":"IF($A48=0,\" \",VLOOKUP($C48,NEW_DATA!$G$2:$S$143,8,FALSE))","v":30},{"$f":"IF($A48=0,\" \",VLOOKUP($C48,NEW_DATA!$G$2:$S$143,9,FALSE))","v":20},{"$f":"IF($A48=0,\" \",VLOOKUP($C48,NEW_DATA!$G$2:$S$143,10,FALSE))","v":5},{"$f":"IF($A48=0,\" \",VLOOKUP($C48,NEW_DATA!$G$2:$S$143,11,FALSE))","v":0},{"$f":"IF($A48=0,\" \",VLOOKUP($C48,NEW_DATA!$G$2:$S$143,12,FALSE))","v":0},{"$f":"IF($A48=0,\" \",VLOOKUP($C48,NEW_DATA!$G$2:$S$143,13,FALSE))","v":0},{"$f":"SUM(I48:T48)","v":100}]
["M_67A",null,"67A-Lowland/Overflow sites Western co-dom.",null,null,null,null,3,{"$f":"IF($A49=0,\" \",VLOOKUP($C49,NEW_DATA!$G$2:$S$143,2,FALSE))","v":0},{"$f":"IF($A49=0,\" \",VLOOKUP($C49,NEW_DATA!$G$2:$S$143,3,FALSE))","v":0},{"$f":"IF($A49=0,\" \",VLOOKUP($C49,NEW_DATA!$G$2:$S$143,4,FALSE))","v":0},{"$f":"IF($A49=0,\" \",VLOOKUP($C49,NEW_DATA!$G$2:$S$143,5,FALSE))","v":5},{"$f":"IF($A49=0,\" \",VLOOKUP($C49,NEW_DATA!$G$2:$S$143,6,FALSE))","v":25},{"$f":"IF($A49=0,\" \",VLOOKUP($C49,NEW_DATA!$G$2:$S$143,7,FALSE))","v":30},{"$f":"IF($A49=0,\" \",VLOOKUP($C49,NEW_DATA!$G$2:$S$143,8,FALSE))","v":20},{"$f":"IF($A49=0,\" \",VLOOKUP($C49,NEW_DATA!$G$2:$S$143,9,FALSE))","v":15},{"$f":"IF($A49=0,\" \",VLOOKUP($C49,NEW_DATA!$G$2:$S$143,10,FALSE))","v":5},{"$f":"IF($A49=0,\" \",VLOOKUP($C49,NEW_DATA!$G$2:$S$143,11,FALSE))","v":0},{"$f":"IF($A49=0,\" \",VLOOKUP($C49,NEW_DATA!$G$2:$S$143,12,FALSE))","v":0},{"$f":"IF($A49=0,\" \",VLOOKUP($C49,NEW_DATA!$G$2:$S$143,13,FALSE))","v":0},100]
[null,null,null,null,null,null,null,4,{"$f":"IF($A50=0,\" \",VLOOKUP($C50,NEW_DATA!$G$2:$S$143,2,FALSE))","v":" "},{"$f":"IF($A50=0,\" \",VLOOKUP($C50,NEW_DATA!$G$2:$S$143,3,FALSE))","v":" "},{"$f":"IF($A50=0,\" \",VLOOKUP($C50,NEW_DATA!$G$2:$S$143,4,FALSE))","v":" "},{"$f":"IF($A50=0,\" \",VLOOKUP($C50,NEW_DATA!$G$2:$S$143,5,FALSE))","v":" "},{"$f":"IF($A50=0,\" \",VLOOKUP($C50,NEW_DATA!$G$2:$S$143,6,FALSE))","v":" "},{"$f":"IF($A50=0,\" \",VLOOKUP($C50,NEW_DATA!$G$2:$S$143,7,FALSE))","v":" "},{"$f":"IF($A50=0,\" \",VLOOKUP($C50,NEW_DATA!$G$2:$S$143,8,FALSE))","v":" "},{"$f":"IF($A50=0,\" \",VLOOKUP($C50,NEW_DATA!$G$2:$S$143,9,FALSE))","v":" "},{"$f":"IF($A50=0,\" \",VLOOKUP($C50,NEW_DATA!$G$2:$S$143,10,FALSE))","v":" "},{"$f":"IF($A50=0,\" \",VLOOKUP($C50,NEW_DATA!$G$2:$S$143,11,FALSE))","v":" "},{"$f":"IF($A50=0,\" \",VLOOKUP($C50,NEW_DATA!$G$2:$S$143,12,FALSE))","v":" "},{"$f":"IF($A50=0,\" \",VLOOKUP($C50,NEW_DATA!$G$2:$S$143,13,FALSE))","v":" "},0]
[null,null,null,null,null,null,null,5,{"$f":"IF($A51=0,\" \",VLOOKUP($C51,NEW_DATA!$G$2:$S$143,2,FALSE))","v":" "},{"$f":"IF($A51=0,\" \",VLOOKUP($C51,NEW_DATA!$G$2:$S$143,3,FALSE))","v":" "},{"$f":"IF($A51=0,\" \",VLOOKUP($C51,NEW_DATA!$G$2:$S$143,4,FALSE))","v":" "},{"$f":"IF($A51=0,\" \",VLOOKUP($C51,NEW_DATA!$G$2:$S$143,5,FALSE))","v":" "},{"$f":"IF($A51=0,\" \",VLOOKUP($C51,NEW_DATA!$G$2:$S$143,6,FALSE))","v":" "},{"$f":"IF($A51=0,\" \",VLOOKUP($C51,NEW_DATA!$G$2:$S$143,7,FALSE))","v":" "},{"$f":"IF($A51=0,\" \",VLOOKUP($C51,NEW_DATA!$G$2:$S$143,8,FALSE))","v":" "},{"$f":"IF($A51=0,\" \",VLOOKUP($C51,NEW_DATA!$G$2:$S$143,9,FALSE))","v":" "},{"$f":"IF($A51=0,\" \",VLOOKUP($C51,NEW_DATA!$G$2:$S$143,10,FALSE))","v":" "},{"$f":"IF($A51=0,\" \",VLOOKUP($C51,NEW_DATA!$G$2:$S$143,11,FALSE))","v":" "},{"$f":"IF($A51=0,\" \",VLOOKUP($C51,NEW_DATA!$G$2:$S$143,12,FALSE))","v":" "},{"$f":"IF($A51=0,\" \",VLOOKUP($C51,NEW_DATA!$G$2:$S$143,13,FALSE))","v":" "},0]
[null,null,null,null,null,null,null,6,{"$f":"IF($A52=0,\" \",VLOOKUP($C52,NEW_DATA!$G$2:$S$143,2,FALSE))","v":" "},{"$f":"IF($A52=0,\" \",VLOOKUP($C52,NEW_DATA!$G$2:$S$143,3,FALSE))","v":" "},{"$f":"IF($A52=0,\" \",VLOOKUP($C52,NEW_DATA!$G$2:$S$143,4,FALSE))","v":" "},{"$f":"IF($A52=0,\" \",VLOOKUP($C52,NEW_DATA!$G$2:$S$143,5,FALSE))","v":" "},{"$f":"IF($A52=0,\" \",VLOOKUP($C52,NEW_DATA!$G$2:$S$143,6,FALSE))","v":" "},{"$f":"IF($A52=0,\" \",VLOOKUP($C52,NEW_DATA!$G$2:$S$143,7,FALSE))","v":" "},{"$f":"IF($A52=0,\" \",VLOOKUP($C52,NEW_DATA!$G$2:$S$143,8,FALSE))","v":" "},{"$f":"IF($A52=0,\" \",VLOOKUP($C52,NEW_DATA!$G$2:$S$143,9,FALSE))","v":" "},{"$f":"IF($A52=0,\" \",VLOOKUP($C52,NEW_DATA!$G$2:$S$143,10,FALSE))","v":" "},{"$f":"IF($A52=0,\" \",VLOOKUP($C52,NEW_DATA!$G$2:$S$143,11,FALSE))","v":" "},{"$f":"IF($A52=0,\" \",VLOOKUP($C52,NEW_DATA!$G$2:$S$143,12,FALSE))","v":" "},{"$f":"IF($A52=0,\" \",VLOOKUP($C52,NEW_DATA!$G$2:$S$143,13,FALSE))","v":" "},0]
[null,null,null,null,null,null,null,7,{"$f":"IF($A53=0,\" \",VLOOKUP($C53,NEW_DATA!$G$2:$S$143,2,FALSE))","v":" "},{"$f":"IF($A53=0,\" \",VLOOKUP($C53,NEW_DATA!$G$2:$S$143,3,FALSE))","v":" "},{"$f":"IF($A53=0,\" \",VLOOKUP($C53,NEW_DATA!$G$2:$S$143,4,FALSE))","v":" "},{"$f":"IF($A53=0,\" \",VLOOKUP($C53,NEW_DATA!$G$2:$S$143,5,FALSE))","v":" "},{"$f":"IF($A53=0,\" \",VLOOKUP($C53,NEW_DATA!$G$2:$S$143,6,FALSE))","v":" "},{"$f":"IF($A53=0,\" \",VLOOKUP($C53,NEW_DATA!$G$2:$S$143,7,FALSE))","v":" "},{"$f":"IF($A53=0,\" \",VLOOKUP($C53,NEW_DATA!$G$2:$S$143,8,FALSE))","v":" "},{"$f":"IF($A53=0,\" \",VLOOKUP($C53,NEW_DATA!$G$2:$S$143,9,FALSE))","v":" "},{"$f":"IF($A53=0,\" \",VLOOKUP($C53,NEW_DATA!$G$2:$S$143,10,FALSE))","v":" "},{"$f":"IF($A53=0,\" \",VLOOKUP($C53,NEW_DATA!$G$2:$S$143,11,FALSE))","v":" "},{"$f":"IF($A53=0,\" \",VLOOKUP($C53,NEW_DATA!$G$2:$S$143,12,FALSE))","v":" "},{"$f":"IF($A53=0,\" \",VLOOKUP($C53,NEW_DATA!$G$2:$S$143,13,FALSE))","v":" "},0]
[]
[null,null,null,null,null,null,null,null,null,null,null,null,null,null,null,null,null,null,null,null,"If you hide rows, in the livestock inventory portion of the form, you may need to reposition the growth curve.   Click on the curve and drag to the desired location."]
[]
[]
[]
[]
[]
[null,null,null,null,null,null,null,null,null,null,null,null,null,null,null,null,null,null,null,null,"The growth curve graphic may need to be re-sized.  Click on the graph and drag circle(s) in corner to re-size it."]
[]
[]
[]
[]
[]
[]
[]
[]
[]
[]
["Monthly Forage Production"]
["Field no. ",null,"Forage Type (Range, pasture, cover crop,  cornstalks, etc.)",null,null,"Estimated AUM or AUDs  / Field ",null,null,"Grazed Forage Production in AUMs or AUDs by Month"]
[null,null,null,null,"Acres",null,"Growth Curve No.","Jan","Feb","Mar","Apr","May","Jun","Jul","Aug","Sep","Oct","Nov","Dec","TOTAL"]
[{"$f":"NEW_528_Forage_Balance!G69","v":"R1A"},null,{"$f":"IF(A75=0,\"\",(NEW_528_Forage_Balance!I69))","v":"Range"},null,{"$f":"IF(A75=0,\"\",(NEW_528_Forage_Balance!H69))","v":305},{"$f":"IF(A75=0,\"\",(NEW_528_Forage_Balance!L69))","v":115},2,{"$f":"IF($A75=0,\" \",VLOOKUP($G75,$H$47:$T$53,2,FALSE)*(F75/100))","v":0},{"$f":"IF($A75=0,\" \",VLOOKUP($G75,$H$47:$T$53,3,FALSE)*(F75/100))","v":0},{"$f":"IF($A75=0,\" \",VLOOKUP($G75,$H$47:$T$53,4,FALSE)*(F75/100))","v":0},{"$f":"IF($A75=0,\" \",VLOOKUP($G75,$H$47:$T$53,5,FALSE)*(F75/100))","v":5.75},{"$f":"IF($A75=0,\" \",VLOOKUP($G75,$H$47:$T$53,6,FALSE)*(F75/100))","v":17.25},{"$f":"IF($A75=0,\" \",VLOOKUP($G75,$H$47:$T$53,7,FALSE)*(F75/100))","v":28.749999999999996},{"$f":"IF($A75=0,\" \",VLOOKUP($G75,$H$47:$T$53,8,FALSE)*(F75/100))","v":34.5},{"$f":"IF($A75=0,\" \",VLOOKUP($G75,$H$47:$T$53,9,FALSE)*(F75/100))","v":23},{"$f":"IF($A75=0,\" \",VLOOKUP($G75,$H$47:$T$53,10,FALSE)*(F75/100))","v":5.75},{"$f":"IF($A75=0,\" \",VLOOKUP($G75,$H$47:$T$53,11,FALSE)*(F75/100))","v":0},{"$f":"IF($A75=0,\" \",VLOOKUP($G75,$H$47:$T$53,12,FALSE)*(F75/100))","v":0},{"$f":"IF($A75=0,\" \",VLOOKUP($G75,$H$47:$T$53,12,FALSE)*(F75/100))","v":0},{"$f":"IF(A75=0,\"\",(SUM(H75:S75)))","v":115}]
[{"$f":"NEW_528_Forage_Balance!G70","v":"R1B"},null,{"$f":"IF(A76=0,\"\",(NEW_528_Forage_Balance!I70))","v":"Range"},null,{"$f":"IF(A76=0,\"\",(NEW_528_Forage_Balance!H70))","v":335},{"$f":"IF(A76=0,\"\",(NEW_528_Forage_Balance!L70))","v":92},1,{"$f":"IF($A76=0,\" \",VLOOKUP($G76,$H$47:$T$53,2,FALSE)*(F76/100))","v":0},{"$f":"IF($A76=0,\" \",VLOOKUP($G76,$H$47:$T$53,3,FALSE)*(F76/100))","v":0},{"$f":"IF($A76=0,\" \",VLOOKUP($G76,$H$47:$T$53,4,FALSE)*(F76/100))","v":0},{"$f":"IF($A76=0,\" \",VLOOKUP($G76,$H$47:$T$53,5,FALSE)*(F76/100))","v":4.6000000000000005},{"$f":"IF($A76=0,\" \",VLOOKUP($G76,$H$47:$T$53,6,FALSE)*(F76/100))","v":23},{"$f":"IF($A76=0,\" \",VLOOKUP($G76,$H$47:$T$53,7,FALSE)*(F76/100))","v":36.800000000000004},{"$f":"IF($A76=0,\" \",VLOOKUP($G76,$H$47:$T$53,8,FALSE)*(F76/100))","v":13.8},{"$f":"IF($A76=0,\" \",VLOOKUP($G76,$H$47:$T$53,9,FALSE)*(F76/100))","v":4.6000000000000005},{"$f":"IF($A76=0,\" \",VLOOKUP($G76,$H$47:$T$53,10,FALSE)*(F76/100))","v":9.2000000000000011},{"$f":"IF($A76=0,\" \",VLOOKUP($G76,$H$47:$T$53,11,FALSE)*(F76/100))","v":0},{"$f":"IF($A76=0,\" \",VLOOKUP($G76,$H$47:$T$53,12,FALSE)*(F76/100))","v":0},{"$f":"IF($A76=0,\" \",VLOOKUP($G76,$H$47:$T$53,12,FALSE)*(F76/100))","v":0},{"$f":"IF(A76=0,\"\",(SUM(H76:S76)))","v":92}]
[{"$f":"NEW_528_Forage_Balance!G71","v":"R2"},null,{"$f":"IF(A77=0,\"\",(NEW_528_Forage_Balance!I71))","v":"Range"},null,{"$f":"IF(A77=0,\"\",(NEW_528_Forage_Balance!H71))","v":320},{"$f":"IF(A77=0,\"\",(NEW_528_Forage_Balance!L71))","v":122},1,{"$f":"IF($A77=0,\" \",VLOOKUP($G77,$H$47:$T$53,2,FALSE)*(F77/100))","v":0},{"$f":"IF($A77=0,\" \",VLOOKUP($G77,$H$47:$T$53,3,FALSE)*(F77/100))","v":0},{"$f":"IF($A77=0,\" \",VLOOKUP($G77,$H$47:$T$53,4,FALSE)*(F77/100))","v":0},{"$f":"IF($A77=0,\" \",VLOOKUP($G77,$H$47:$T$53,5,FALSE)*(F77/100))","v":6.1},{"$f":"IF($A77=0,\" \",VLOOKUP($G77,$H$47:$T$53,6,FALSE)*(F77/100))","v":30.5},{"$f":"IF($A77=0,\" \",VLOOKUP($G77,$H$47:$T$53,7,FALSE)*(F77/100))","v":48.8},{"$f":"IF($A77=0,\" \",VLOOKUP($G77,$H$47:$T$53,8,FALSE)*(F77/100))","v":18.3},{"$f":"IF($A77=0,\" \",VLOOKUP($G77,$H$47:$T$53,9,FALSE)*(F77/100))","v":6.1},{"$f":"IF($A77=0,\" \",VLOOKUP($G77,$H$47:$T$53,10,FALSE)*(F77/100))","v":12.2},{"$f":"IF($A77=0,\" \",VLOOKUP($G77,$H$47:$T$53,11,FALSE)*(F77/100))","v":0},{"$f":"IF($A77=0,\" \",VLOOKUP($G77,$H$47:$T$53,12,FALSE)*(F77/100))","v":0},{"$f":"IF($A77=0,\" \",VLOOKUP($G77,$H$47:$T$53,12,FALSE)*(F77/100))","v":0},122]
[{"$f":"NEW_528_Forage_Balance!G72","v":"R3"},null,{"$f":"IF(A78=0,\"\",(NEW_528_Forage_Balance!I72))","v":"Range"},null,{"$f":"IF(A78=0,\"\",(NEW_528_Forage_Balance!H72))","v":80},{"$f":"IF(A78=0,\"\",(NEW_528_Forage_Balance!L72))","v":35},3,0,0,0,1.75,8.75,10.5,7,5.25,1.75,0,0,0,35]
[{"$f":"NEW_528_Forage_Balance!G73","v":"R4"},null,{"$f":"IF(A79=0,\"\",(NEW_528_Forage_Balance!I73))","v":"Range"},null,{"$f":"IF(A79=0,\"\",(NEW_528_Forage_Balance!H73))","v":160},{"$f":"IF(A79=0,\"\",(NEW_528_Forage_Balance!L73))","v":58},1,0,0,0,2.9,14.499999999999998,23.2,8.6999999999999993,2.9,5.8,0,0,0,57.999999999999993]
[{"$f":"NEW_528_Forage_Balance!G74","v":"R5A"},null,{"$f":"IF(A80=0,\"\",(NEW_528_Forage_Balance!I74))","v":"Range"},null,{"$f":"IF(A80=0,\"\",(NEW_528_Forage_Balance!H74))","v":240},{"$f":"IF(A80=0,\"\",(NEW_528_Forage_Balance!L74))","v":66},2,0,0,0,3.3000000000000003,9.9,16.5,19.8,13.200000000000001,3.3000000000000003,0,0,0,66]
[{"$f":"NEW_528_Forage_Balance!G75","v":"R5B"},null,{"$f":"IF(A81=0,\"\",(NEW_528_Forage_Balance!I75))","v":"Range"},null,{"$f":"IF(A81=0,\"\",(NEW_528_Forage_Balance!H75))","v":263},{"$f":"IF(A81=0,\"\",(NEW_528_Forage_Balance!L75))","v":106},3,0,0,0,5.3000000000000007,26.5,31.8,21.200000000000003,15.9,5.3000000000000007,0,0,0,106.00000000000001]
[{"$f":"NEW_528_Forage_Balance!G76","v":"R5C"},null,{"$f":"IF(A82=0,\"\",(NEW_528_Forage_Balance!I76))","v":"Range"},null,{"$f":"IF(A82=0,\"\",(NEW_528_Forage_Balance!H76))","v":137},{"$f":"IF(A82=0,\"\",(NEW_528_Forage_Balance!L76))","v":29},2,0,0,0,1.45,4.3499999999999996,7.2499999999999991,8.6999999999999993,5.8,1.45,0,0,0,29]
[{"$f":"NEW_528_Forage_Balance!G77","v":"R6"},null,{"$f":"IF(A83=0,\"\",(NEW_528_Forage_Balance!I77))","v":"Range"},null,{"$f":"IF(A83=0,\"\",(NEW_528_Forage_Balance!H77))","v":160},{"$f":"IF(A83=0,\"\",(NEW_528_Forage_Balance!L77))","v":90},3,0,0,0,4.5,22.5,27,18,13.5,4.5,0,0,0,90]
[{"$f":"NEW_528_Forage_Balance!G78","v":0},null,{"$f":"IF(A84=0,\"\",(NEW_528_Forage_Balance!I78))","v":""},null,{"$f":"IF(A84=0,\"\",(NEW_528_Forage_Balance!H78))","v":""},{"$f":"IF(A84=0,\"\",(NEW_528_Forage_Balance!L78))","v":""},null," "," "," "," "," "," "," "," "," "," "," "," ",""]
[{"$f":"NEW_528_Forage_Balance!G79","v":0},null,{"$f":"IF(A85=0,\"\",(NEW_528_Forage_Balance!I79))","v":""},null,{"$f":"IF(A85=0,\"\",(NEW_528_Forage_Balance!H79))","v":""},{"$f":"IF(A85=0,\"\",(NEW_528_Forage_Balance!L79))","v":""},null," "," "," "," "," "," "," "," "," "," "," "," ",""]
[{"$f":"NEW_528_Forage_Balance!G80","v":0},null,{"$f":"IF(A86=0,\"\",(NEW_528_Forage_Balance!I80))","v":""},null,{"$f":"IF(A86=0,\"\",(NEW_528_Forage_Balance!H80))","v":""},{"$f":"IF(A86=0,\"\",(NEW_528_Forage_Balance!L80))","v":""},null," "," "," "," "," "," "," "," "," "," "," "," ",""]
[{"$f":"NEW_528_Forage_Balance!G81","v":0},null,{"$f":"IF(A87=0,\"\",(NEW_528_Forage_Balance!I81))","v":""},null,{"$f":"IF(A87=0,\"\",(NEW_528_Forage_Balance!H81))","v":""},{"$f":"IF(A87=0,\"\",(NEW_528_Forage_Balance!L81))","v":""},null," "," "," "," "," "," "," "," "," "," "," "," ",""]
[{"$f":"NEW_528_Forage_Balance!G82","v":0},null,{"$f":"IF(A88=0,\"\",(NEW_528_Forage_Balance!I82))","v":""},null,{"$f":"IF(A88=0,\"\",(NEW_528_Forage_Balance!H82))","v":""},{"$f":"IF(A88=0,\"\",(NEW_528_Forage_Balance!L82))","v":""},null," "," "," "," "," "," "," "," "," "," "," "," ",""]
[{"$f":"NEW_528_Forage_Balance!G83","v":0},null,{"$f":"IF(A89=0,\"\",(NEW_528_Forage_Balance!I83))","v":""},null,{"$f":"IF(A89=0,\"\",(NEW_528_Forage_Balance!H83))","v":""},{"$f":"IF(A89=0,\"\",(NEW_528_Forage_Balance!L83))","v":""},null," "," "," "," "," "," "," "," "," "," "," "," ",""]
[{"$f":"NEW_528_Forage_Balance!G84","v":0},null,{"$f":"IF(A90=0,\"\",(NEW_528_Forage_Balance!I84))","v":""},null,{"$f":"IF(A90=0,\"\",(NEW_528_Forage_Balance!H84))","v":""},{"$f":"IF(A90=0,\"\",(NEW_528_Forage_Balance!L84))","v":""},null," "," "," "," "," "," "," "," "," "," "," "," ",""]
[{"$f":"NEW_528_Forage_Balance!G85","v":0},null,{"$f":"IF(A91=0,\"\",(NEW_528_Forage_Balance!I85))","v":""},null,{"$f":"IF(A91=0,\"\",(NEW_528_Forage_Balance!H85))","v":""},{"$f":"IF(A91=0,\"\",(NEW_528_Forage_Balance!L85))","v":""},null," "," "," "," "," "," "," "," "," "," "," "," ",""]
[{"$f":"NEW_528_Forage_Balance!G86","v":0},null,{"$f":"IF(A92=0,\"\",(NEW_528_Forage_Balance!I86))","v":""},null,{"$f":"IF(A92=0,\"\",(NEW_528_Forage_Balance!H86))","v":""},{"$f":"IF(A92=0,\"\",(NEW_528_Forage_Balance!L86))","v":""},null," "," "," "," "," "," "," "," "," "," "," "," ",""]
[{"$f":"NEW_528_Forage_Balance!G87","v":0},null,{"$f":"IF(A93=0,\"\",(NEW_528_Forage_Balance!I87))","v":""},null,{"$f":"IF(A93=0,\"\",(NEW_528_Forage_Balance!H87))","v":""},{"$f":"IF(A93=0,\"\",(NEW_528_Forage_Balance!L87))","v":""},null," "," "," "," "," "," "," "," "," "," "," "," ",""]
[{"$f":"NEW_528_Forage_Balance!G88","v":0},null,{"$f":"IF(A94=0,\"\",(NEW_528_Forage_Balance!I88))","v":""},null,{"$f":"IF(A94=0,\"\",(NEW_528_Forage_Balance!H88))","v":""},{"$f":"IF(A94=0,\"\",(NEW_528_Forage_Balance!L88))","v":""},null," "," "," "," "," "," "," "," "," "," "," "," ",""]
[{"$f":"NEW_528_Forage_Balance!G89","v":0},null,{"$f":"IF(A95=0,\"\",(NEW_528_Forage_Balance!I89))","v":""},null,{"$f":"IF(A95=0,\"\",(NEW_528_Forage_Balance!H89))","v":""},{"$f":"IF(A95=0,\"\",(NEW_528_Forage_Balance!L89))","v":""},null," "," "," "," "," "," "," "," "," "," "," "," ",""]
[{"$f":"NEW_528_Forage_Balance!G90","v":0},null,{"$f":"IF(A96=0,\"\",(NEW_528_Forage_Balance!I90))","v":""},null,{"$f":"IF(A96=0,\"\",(NEW_528_Forage_Balance!H90))","v":""},{"$f":"IF(A96=0,\"\",(NEW_528_Forage_Balance!L90))","v":""},null," "," "," "," "," "," "," "," "," "," "," "," ",""]
[{"$f":"NEW_528_Forage_Balance!G91","v":0},null,{"$f":"IF(A97=0,\"\",(NEW_528_Forage_Balance!I91))","v":""},null,{"$f":"IF(A97=0,\"\",(NEW_528_Forage_Balance!H91))","v":""},{"$f":"IF(A97=0,\"\",(NEW_528_Forage_Balance!L91))","v":""},null," "," "," "," "," "," "," "," "," "," "," "," ",""]
[{"$f":"NEW_528_Forage_Balance!G92","v":0},null,{"$f":"IF(A98=0,\"\",(NEW_528_Forage_Balance!I92))","v":""},null,{"$f":"IF(A98=0,\"\",(NEW_528_Forage_Balance!H92))","v":""},{"$f":"IF(A98=0,\"\",(NEW_528_Forage_Balance!L92))","v":""},null," "," "," "," "," "," "," "," "," "," "," "," ",""]
[{"$f":"NEW_528_Forage_Balance!G93","v":0},null,{"$f":"IF(A99=0,\"\",(NEW_528_Forage_Balance!I93))","v":""},null,{"$f":"IF(A99=0,\"\",(NEW_528_Forage_Balance!H93))","v":""},{"$f":"IF(A99=0,\"\",(NEW_528_Forage_Balance!L93))","v":""},null," "," "," "," "," "," "," "," "," "," "," "," ",""]
[{"$f":"NEW_528_Forage_Balance!G94","v":0},null,{"$f":"IF(A100=0,\"\",(NEW_528_Forage_Balance!I94))","v":""},null,{"$f":"IF(A100=0,\"\",(NEW_528_Forage_Balance!H94))","v":""},{"$f":"IF(A100=0,\"\",(NEW_528_Forage_Balance!L94))","v":""},null," "," "," "," "," "," "," "," "," "," "," "," ",""]
[{"$f":"NEW_528_Forage_Balance!G95","v":0},null,{"$f":"IF(A101=0,\"\",(NEW_528_Forage_Balance!I95))","v":""},null,{"$f":"IF(A101=0,\"\",(NEW_528_Forage_Balance!H95))","v":""},{"$f":"IF(A101=0,\"\",(NEW_528_Forage_Balance!L95))","v":""},null," "," "," "," "," "," "," "," "," "," "," "," ",""]
[{"$f":"NEW_528_Forage_Balance!G96","v":0},null,{"$f":"IF(A102=0,\"\",(NEW_528_Forage_Balance!I96))","v":""},null,{"$f":"IF(A102=0,\"\",(NEW_528_Forage_Balance!H96))","v":""},{"$f":"IF(A102=0,\"\",(NEW_528_Forage_Balance!L96))","v":""},null," "," "," "," "," "," "," "," "," "," "," "," ",""]
[{"$f":"NEW_528_Forage_Balance!G97","v":0},null,{"$f":"IF(A103=0,\"\",(NEW_528_Forage_Balance!I97))","v":""},null,{"$f":"IF(A103=0,\"\",(NEW_528_Forage_Balance!H97))","v":""},{"$f":"IF(A103=0,\"\",(NEW_528_Forage_Balance!L97))","v":""},null," "," "," "," "," "," "," "," "," "," "," "," ",""]
[{"$f":"NEW_528_Forage_Balance!G98","v":0},null,{"$f":"IF(A104=0,\"\",(NEW_528_Forage_Balance!I98))","v":""},null,{"$f":"IF(A104=0,\"\",(NEW_528_Forage_Balance!H98))","v":""},{"$f":"IF(A104=0,\"\",(NEW_528_Forage_Balance!L98))","v":""},null," "," "," "," "," "," "," "," "," "," "," "," ",""]
[{"$f":"NEW_528_Forage_Balance!G99","v":0},null,{"$f":"IF(A105=0,\"\",(NEW_528_Forage_Balance!I99))","v":""},null,{"$f":"IF(A105=0,\"\",(NEW_528_Forage_Balance!H99))","v":""},{"$f":"IF(A105=0,\"\",(NEW_528_Forage_Balance!L99))","v":""},null," "," "," "," "," "," "," "," "," "," "," "," ",""]
[{"$f":"NEW_528_Forage_Balance!G100","v":0},null,{"$f":"IF(A106=0,\"\",(NEW_528_Forage_Balance!I100))","v":""},null,{"$f":"IF(A106=0,\"\",(NEW_528_Forage_Balance!H100))","v":""},{"$f":"IF(A106=0,\"\",(NEW_528_Forage_Balance!L100))","v":""},null," "," "," "," "," "," "," "," "," "," "," "," ",""]
[{"$f":"NEW_528_Forage_Balance!G101","v":0},null,{"$f":"IF(A107=0,\"\",(NEW_528_Forage_Balance!I101))","v":""},null,{"$f":"IF(A107=0,\"\",(NEW_528_Forage_Balance!H101))","v":""},{"$f":"IF(A107=0,\"\",(NEW_528_Forage_Balance!L101))","v":""},null," "," "," "," "," "," "," "," "," "," "," "," ",""]
[{"$f":"NEW_528_Forage_Balance!G102","v":0},null,{"$f":"IF(A108=0,\"\",(NEW_528_Forage_Balance!I102))","v":""},null,{"$f":"IF(A108=0,\"\",(NEW_528_Forage_Balance!H102))","v":""},{"$f":"IF(A108=0,\"\",(NEW_528_Forage_Balance!L102))","v":""},null," "," "," "," "," "," "," "," "," "," "," "," ",""]
[{"$f":"NEW_528_Forage_Balance!G103","v":0},null,{"$f":"IF(A109=0,\"\",(NEW_528_Forage_Balance!I103))","v":""},null,{"$f":"IF(A109=0,\"\",(NEW_528_Forage_Balance!H103))","v":""},{"$f":"IF(A109=0,\"\",(NEW_528_Forage_Balance!L103))","v":""},null," "," "," "," "," "," "," "," "," "," "," "," ",""]
[{"$f":"NEW_528_Forage_Balance!G104","v":0},null,{"$f":"IF(A110=0,\"\",(NEW_528_Forage_Balance!I104))","v":""},null,{"$f":"IF(A110=0,\"\",(NEW_528_Forage_Balance!H104))","v":""},{"$f":"IF(A110=0,\"\",(NEW_528_Forage_Balance!L104))","v":""},null," "," "," "," "," "," "," "," "," "," "," "," ",""]
[{"$f":"NEW_528_Forage_Balance!G105","v":0},null,{"$f":"IF(A111=0,\"\",(NEW_528_Forage_Balance!I105))","v":""},null,{"$f":"IF(A111=0,\"\",(NEW_528_Forage_Balance!H105))","v":""},{"$f":"IF(A111=0,\"\",(NEW_528_Forage_Balance!L105))","v":""},null," "," "," "," "," "," "," "," "," "," "," "," ",""]
[{"$f":"NEW_528_Forage_Balance!G106","v":0},null,{"$f":"IF(A112=0,\"\",(NEW_528_Forage_Balance!I106))","v":""},null,{"$f":"IF(A112=0,\"\",(NEW_528_Forage_Balance!H106))","v":""},{"$f":"IF(A112=0,\"\",(NEW_528_Forage_Balance!L106))","v":""},null," "," "," "," "," "," "," "," "," "," "," "," ",""]
[{"$f":"NEW_528_Forage_Balance!G107","v":0},null,{"$f":"IF(A113=0,\"\",(NEW_528_Forage_Balance!I107))","v":""},null,{"$f":"IF(A113=0,\"\",(NEW_528_Forage_Balance!H107))","v":""},{"$f":"IF(A113=0,\"\",(NEW_528_Forage_Balance!L107))","v":""},null," "," "," "," "," "," "," "," "," "," "," "," ",""]
[{"$f":"NEW_528_Forage_Balance!G108","v":0},null,{"$f":"IF(A114=0,\"\",(NEW_528_Forage_Balance!I108))","v":""},null,{"$f":"IF(A114=0,\"\",(NEW_528_Forage_Balance!H108))","v":""},{"$f":"IF(A114=0,\"\",(NEW_528_Forage_Balance!L108))","v":""},null," "," "," "," "," "," "," "," "," "," "," "," ",""]
[{"$f":"NEW_528_Forage_Balance!G109","v":0},null,{"$f":"IF(A115=0,\"\",(NEW_528_Forage_Balance!I109))","v":""},null,{"$f":"IF(A115=0,\"\",(NEW_528_Forage_Balance!H109))","v":""},{"$f":"IF(A115=0,\"\",(NEW_528_Forage_Balance!L109))","v":""},null," "," "," "," "," "," "," "," "," "," "," "," ",""]
[{"$f":"NEW_528_Forage_Balance!G110","v":0},null,{"$f":"IF(A116=0,\"\",(NEW_528_Forage_Balance!I110))","v":""},null,{"$f":"IF(A116=0,\"\",(NEW_528_Forage_Balance!H110))","v":""},{"$f":"IF(A116=0,\"\",(NEW_528_Forage_Balance!L110))","v":""},null," "," "," "," "," "," "," "," "," "," "," "," ",""]
[{"$f":"NEW_528_Forage_Balance!G111","v":0},null,{"$f":"IF(A117=0,\"\",(NEW_528_Forage_Balance!I111))","v":""},null,{"$f":"IF(A117=0,\"\",(NEW_528_Forage_Balance!H111))","v":""},{"$f":"IF(A117=0,\"\",(NEW_528_Forage_Balance!L111))","v":""},null," "," "," "," "," "," "," "," "," "," "," "," ",""]
[{"$f":"NEW_528_Forage_Balance!G112","v":0},null,{"$f":"IF(A118=0,\"\",(NEW_528_Forage_Balance!I112))","v":""},null,{"$f":"IF(A118=0,\"\",(NEW_528_Forage_Balance!H112))","v":""},{"$f":"IF(A118=0,\"\",(NEW_528_Forage_Balance!L112))","v":""},null," "," "," "," "," "," "," "," "," "," "," "," ",""]
[{"$f":"NEW_528_Forage_Balance!G113","v":0},null,{"$f":"IF(A119=0,\"\",(NEW_528_Forage_Balance!I113))","v":""},null,{"$f":"IF(A119=0,\"\",(NEW_528_Forage_Balance!H113))","v":""},{"$f":"IF(A119=0,\"\",(NEW_528_Forage_Balance!L113))","v":""},null," "," "," "," "," "," "," "," "," "," "," "," ",""]
[{"$f":"NEW_528_Forage_Balance!G114","v":0},null,{"$f":"IF(A120=0,\"\",(NEW_528_Forage_Balance!I114))","v":""},null,{"$f":"IF(A120=0,\"\",(NEW_528_Forage_Balance!H114))","v":""},{"$f":"IF(A120=0,\"\",(NEW_528_Forage_Balance!L114))","v":""},null," "," "," "," "," "," "," "," "," "," "," "," ",""]
[{"$f":"NEW_528_Forage_Balance!G115","v":0},null,{"$f":"IF(A121=0,\"\",(NEW_528_Forage_Balance!I115))","v":""},null,{"$f":"IF(A121=0,\"\",(NEW_528_Forage_Balance!H115))","v":""},{"$f":"IF(A121=0,\"\",(NEW_528_Forage_Balance!L115))","v":""},null," "," "," "," "," "," "," "," "," "," "," "," ",""]
[{"$f":"NEW_528_Forage_Balance!G116","v":0},null,{"$f":"IF(A122=0,\"\",(NEW_528_Forage_Balance!I116))","v":""},null,{"$f":"IF(A122=0,\"\",(NEW_528_Forage_Balance!H116))","v":""},{"$f":"IF(A122=0,\"\",(NEW_528_Forage_Balance!L116))","v":""},null," "," "," "," "," "," "," "," "," "," "," "," ",""]
[{"$f":"NEW_528_Forage_Balance!G117","v":0},null,{"$f":"IF(A123=0,\"\",(NEW_528_Forage_Balance!I117))","v":""},null,{"$f":"IF(A123=0,\"\",(NEW_528_Forage_Balance!H117))","v":""},{"$f":"IF(A123=0,\"\",(NEW_528_Forage_Balance!L117))","v":""},null," "," "," "," "," "," "," "," "," "," "," "," ",""]
[{"$f":"NEW_528_Forage_Balance!G118","v":0},null,{"$f":"IF(A124=0,\"\",(NEW_528_Forage_Balance!I118))","v":""},null,{"$f":"IF(A124=0,\"\",(NEW_528_Forage_Balance!H118))","v":""},{"$f":"IF(A124=0,\"\",(NEW_528_Forage_Balance!L118))","v":""},null," "," "," "," "," "," "," "," "," "," "," "," ",""]
[{"$f":"NEW_528_Forage_Balance!G119","v":0},null,{"$f":"IF(A125=0,\"\",(NEW_528_Forage_Balance!I119))","v":""},null,{"$f":"IF(A125=0,\"\",(NEW_528_Forage_Balance!H119))","v":""},{"$f":"IF(A125=0,\"\",(NEW_528_Forage_Balance!L119))","v":""},null," "," "," "," "," "," "," "," "," "," "," "," ",""]
[{"$f":"NEW_528_Forage_Balance!G120","v":0},null,{"$f":"IF(A126=0,\"\",(NEW_528_Forage_Balance!I120))","v":""},null,{"$f":"IF(A126=0,\"\",(NEW_528_Forage_Balance!H120))","v":""},{"$f":"IF(A126=0,\"\",(NEW_528_Forage_Balance!L120))","v":""},null," "," "," "," "," "," "," "," "," "," "," "," ",""]
[{"$f":"NEW_528_Forage_Balance!G121","v":0},null,{"$f":"IF(A127=0,\"\",(NEW_528_Forage_Balance!I121))","v":""},null,{"$f":"IF(A127=0,\"\",(NEW_528_Forage_Balance!H121))","v":""},{"$f":"IF(A127=0,\"\",(NEW_528_Forage_Balance!L121))","v":""},null," "," "," "," "," "," "," "," "," "," "," "," ",""]
["FORAGE BALANCE EXISTING AND PLANNED",null,null,null,null,null,null,"Jan","Feb","Mar","Apr","May","Jun","Jul","Aug","Sep","Oct","Nov","Dec","TOTAL"]
["Total forage (grazing) available by month (AUM or AUD)",null,null,null,null,null,null,{"$f":"SUM(H75:H127)","v":0},0,0,35.650000000000006,157.25,230.6,150,90.25,49.25,0,0,0,{"$f":"SUM(H129:S129)","v":713},"While negative numbers for individual months are good for discussion with client our primary concern is the forage balance for the entire grazing season.  Stockpiled forage (left over herbage from earlier months or even last year) can provide some forage but it is of lower quality than growing or less mature forages.  When the differences are significant, supplementing with protein and/or energy may be necessary to maintain animal health."]
["Total existing forage needs (AUM or AUD) by month",null,null,null,null,null,null,{"$f":"I21","v":6},6,6,6,63,136,136,121,121,112,6,6,{"$f":"SUM(H130:S130)","v":725}]
["Difference (+) or (-)  (AUM or AUD)",null,null,null,null,null,null,{"$f":"SUM(H129-H130)","v":-6},{"$f":"SUM(I129-I130)","v":-6},-6,29.650000000000006,94.25,94.6,14,-30.75,-71.75,-112,-6,-6,{"$f":"SUM(T129-T130)","v":-12}]
["Total planned forage needs (AUM or AUD) by month",null,null,null,null,null,null,{"$f":"I42","v":6},6,6,6,121,136,136,121,121,112,59,6,{"$f":"SUM(H132:S132)","v":836}]
["Difference (+) or (-)  (AUM or AUD)",null,null,null,null,null,null,{"$f":"SUM(H129-H132)","v":-6},{"$f":"SUM(I129-I132)","v":-6},-6,29.650000000000006,36.25,94.6,14,-30.75,-71.75,-112,-59,-6,{"$f":"SUM(T129-T132)","v":-123}]
[null,"% Existing - Cumulative Difference (available / needed)",null,null,null,null,null,null,null,null,null,null,null,null,null,null,null,null,{"$f":"100-((T131/$T$129)*100)","v":101.68302945301542}]
["% Planned - Cumulative Difference (available / needed)",null,null,null,null,null,null,null,null,null,null,null,null,null,null,null,null,null,{"$f":"100-((T133/$T$129)*100)","v":117.25105189340813}]
[]
[null,"FEED REQUIREMENTS (OPTIONAL)",null,null,null,null,null,null,null,"HARVESTED AND/OR PURCHASED FEEDS  (OPTIONAL)"]
[null,"Livestock",null,"Number Livestock","Forage Needed / Month","Months on Feed","Needed  AUM",null,null,"Type of feed",null,"Acres if Grown on Ranch","Total tons per feed type",null,"Conversion Factor",null,"AUM  Available"]
[null,null,null,null,null,null,null,null,null,null,null,null,null,null,null,null,null,null,null,null,"If winter grazing and hay or grain is used, inventory the amount on hand or the amount typically fed."]
[null,null,null,null,null,null,{"$f":"IF(B140=0,\"\",(E140*F140))","v":""},null,null,null,null,null,null,null,{"$f":"IF(J140=0,\"\",(VLOOKUP(J140,DATA!$A$1:$B$6,2,FALSE)))","v":""},null,{"$f":"IF(M140=0,\"\",(M140*O140))","v":""}]
[null,null,null,null,null,null,{"$f":"IF(B141=0,\"\",(E141*F141))","v":""},null,null,null,null,null,null,null,{"$f":"IF(J141=0,\"\",(VLOOKUP(J141,DATA!$A$1:$B$6,2,FALSE)))","v":""},null,{"$f":"IF(M141=0,\"\",(M141*O141))","v":""}]
[null,null,null,null,null,null,"",null,null,null,null,null,null,null,{"$f":"IF(J142=0,\"\",(VLOOKUP(J142,DATA!$A$1:$B$6,2,FALSE)))","v":""},null,""]
[null,null,null,null,null,null,"",null,null,null,null,null,null,null,{"$f":"IF(J143=0,\"\",(VLOOKUP(J143,DATA!$A$1:$B$6,2,FALSE)))","v":""},null,""]
[null,null,null,null,null,null,"",null,null,null,null,null,null,null,{"$f":"IF(J144=0,\"\",(VLOOKUP(J144,DATA!$A$1:$B$6,2,FALSE)))","v":""},null,""]
[null,null,null,null,null,null,"",null,null,null,null,null,null,null,"TOTAL Forage Availability:",null,{"$f":"SUM(Q140:Q144)","v":0}]
[null,"Total AUM or AUD Needed:",null,null,null,null,{"$f":"SUM(G140:G145)","v":0}]
[]
[]
["FORAGE AND FEED BALANCE"]
["EXISTING BALANCE (GRAZING)"]
["Available AUM or AUD From Grazing:",null,null,null,{"$f":"T129","v":713},"Total AUM's  or AUD Needed: ",null,null,{"$f":"T130","v":725},"Difference in AUM or AUDs:  ",null,null,null,{"$f":"E151-I151","v":-12},null,"% Difference: ",null,null,{"$f":"(N151/I151)*100","v":-1.6551724137931034},"%","The % difference by the standard and guidance may be up to 20%.  Differences of 10% or less are expected due to  normal annual variations and variations in the same ecological site from location to location.  Differences exceeding 10% can lead to reduced ability of the plants to withstand adverse conditions and disturbances, in particular drought.  Long-term forage-demand imbalances will lead to reduction plant health and increase the likelihood that less desirable, more grazing tolerant plants will increase in the unit."]
["PLANNED BALANCE (GRAZING)"]
["Available AUM or AUD From Grazing:",null,null,null,{"$f":"T129","v":713},"Total AUM's  or AUD Needed: ",null,null,{"$f":"T132","v":836},"Difference in AUM or AUDs:  ",null,null,null,{"$f":"E153-I153","v":-123},null,"% Difference: ",null,null,{"$f":"(N153/I153)*100","v":-14.71291866028708},"%"]
["EXISTING BALANCE (FEED)"]
["Total Harvested Forage / Feeds Available in AUM:   ",null,null,null,{"$f":"Q145","v":0},"Total AUM's Feed Needed:  ",null,null,{"$f":"G146","v":0},"Difference in AUM's:  ",null,null,null,null,{"$f":"SUM(E155-I155)","v":0},"% Difference: ",null,null,{"$f":"IF(E155=0,\"\",(O155/I155)*100)","v":""},"%"]
["TOTAL PLANNED BALANCE (GRAZING  AND FEED)"]
["Total AUM Grazing and Harvested Forage:",null,null,null,{"$f":"E153+E155","v":713},null,null,null,{"$f":"I153+I155","v":836},"Difference in AUM's:  ",null,null,null,null,{"$f":"SUM(E157-I157)","v":-123},"% Difference: ",null,null,{"$f":"(I157/E157)*100","v":117.25105189340815},"%"]

{"sheet":"ECS-63-Questionaire-Optional","index":2,"n_rows":37,"n_cols":5,"rows_kept":37,"cut":false,"hidden":false,"merged":[[5,0,5,5],[7,0,7,5],[6,0,6,5],[1,3,1,5],[2,3,2,4],[3,2,3,3],[3,4,3,5],[4,1,4,5],[27,3,27,5],[8,0,8,5],[9,0,9,5],[11,0,11,5],[10,0,10,5],[12,0,12,5],[13,0,13,5],[20,0,20,5],[21,0,21,5],[14,0,14,5],[16,0,16,5],[17,0,17,5],[18,0,18,5],[19,0,19,5],[22,3,22,5],[37,0,37,5],[15,0,15,5],[38,0,38,5],[34,0,34,1],[35,0,35,1],[34,2,34,5],[35,2,35,5],[28,4,28,5],[30,0,30,5],[29,0,29,5],[32,1,32,5],[33,1,33,5],[23,3,23,5],[24,3,24,5],[25,3,25,5],[26,3,26,5]]}
["Client Name:",null,"County:",null,"Date:"]
["Property Name:",null,"Address:"]
["Phone:",null,"Cell or FAX:"]
["Email:",null,"Acres to be Planned:"]
["Legal or Farm and Tract:"]
[]
["Describe Livestock Operation:"]
[]
["Describe Goals for Grazing / Livestock Operation:"]
[]
["Describe Current Grazing System or Grazing Management Strategy:"]
[]
["Length of Grazing Season and Average Turn in and Take Out Dates:"]
[]
["Describe Drought Management or Contingency Plan:"]
[]
["Describe Winter Grazing or Feeding Program if Applicable for this Planning Unit:"]
[]
["List areas of concern (grazing distribution, plant vigor, production, erosion, weeds, animal gain, etc.):"]
[]
[]
["Livestock Information:"]
["Number","Class / Type","Average Wt.","Breed or Other Pertinent Information"]
[]
[]
[]
[]
[]
["Avg. Calving Date:",null,null,"Avg. Weaning Date:"]
[]
["Land Management Information:"]
["Type of Water Sources:"]
["Existing:"]
["Planned:"]
["Preferred Tank Type:"]
["Preferred Fence Type:"]
["Described Soil Testing and Fertilization for Tame (Planted) Pastures:"]

{"sheet":"NE-CPA-17A","index":3,"n_rows":224,"n_cols":16,"rows_kept":224,"cut":false,"hidden":false,"merged":[[222,0,222,12],[223,0,223,1],[223,3,223,14],[2,8,2,9],[2,10,2,14],[2,0,2,3],[2,4,2,7],[3,12,4,12],[3,13,4,13],[3,8,4,8],[3,9,4,9],[3,10,4,10],[3,0,3,1],[3,3,4,3],[3,5,4,5],[3,7,4,7],[0,15,0,18],[1,15,2,18],[3,15,4,18],[3,11,4,11],[3,14,4,14],[0,4,0,12],[1,3,1,11],[1,12,1,14],[13,15,21,18],[25,15,26,18],[5,15,12,18],[3,6,4,6],[22,15,24,19]]}
[null,null,null,null,"NEBRASKA PRESCRIBED GRAZING IMPLEMENTATION REQUIRMENTS NE-CPA-17A",null,null,null,null,null,null,null,null,null,null,"NOTE: All plant communities and production should be confirmed in field."]
[null,null,null,"GRAZINGLAND INVENTORY SUMMARY AND SUGGESTED INITIAL STOCKING RATES BASED ON EXISTING PLANT COMMUNITY",null,null,null,null,null,null,null,null,"Form Date: November, 2020",null,null,"List all ecological sites in each pasture, and identify the plant community/communities present in each pasture."]
["CLIENT:",null,null,null,"Mary Rancher - Sunnyvale Ranch",null,null,null,"DATE:",null,"2020-11-02"]
["PASTURE",null,null,"ECOLOGICAL SITE","PLANT COMMUNITY","Est. lbs. Production / acre","Planned Harvest Efficiency","Acres site-community combination","AUM/ac   ","AUM for Site","Adj. Factor*","Adjusted AUM for Site","Adjusted AUD for Site","AUM for Pasture","AUD for Pasture","Use copy/paste to enter multiple entries for MLRA, site and/or community or any of the unshaded cells."]
["No.","ACRES","MLRA",null,"as listed in the Ecological Site Description"]
["R1A",305,"MLRA_67A","Limy_Upland_67A","1.1 Needle and Thread, Blue Grama, Little Bluestem, Sideoats Grama-LiU67A",{"$f":"IF(C6=0,\"\",(VLOOKUP(E6,NEW_DATA!$D$2:$E$2000,2,FALSE)))","v":1250},0.3,148,{"$f":"IF(D6=0,\"\",(F6/912*G6))","v":0.41118421052631582},{"$f":"IF(E6=0,\"\",H6*I6)","v":60.85526315789474},1,{"$f":"IF(E6=0,\"\",J6*K6)","v":60.85526315789474},{"$f":"IF(E6=0,\"\",L6*30)","v":1825.6578947368421},null,null,"Adjustment Factor:  Use this to account for necessary reductions in production due to tree cover, rock cover, areas too steep to graze, or other factors that reduce grazable production.  For example:  Grasses are similar to community 1.2, but there is 30% cedar cover; use adjustment factor of 0.7 (70% of typical forage production for the community).  If no reductions are needed use 1.0.  "]
[null,null,"MLRA_67A","Limy_Upland_67A","1.2 Blue Grama, Threadleaf Sedge, Remnant Mid-grasses-LiU67A",{"$f":"IF(C7=0,\"\",(VLOOKUP(E7,NEW_DATA!$D$2:$E$2000,2,FALSE)))","v":950},0.3,55,{"$f":"IF(D7=0,\"\",(F7/912*G7))","v":0.3125},{"$f":"IF(E7=0,\"\",H7*I7)","v":17.1875},1,{"$f":"IF(E7=0,\"\",J7*K7)","v":17.1875},{"$f":"IF(E7=0,\"\",L7*30)","v":515.625}]
[null,null,"MLRA_67A","Sandy_67A","1.1 Needle and Thread, Prairie Sandreed, Little Bluestem-Sy67A",{"$f":"IF(C8=0,\"\",(VLOOKUP(E8,NEW_DATA!$D$2:$E$2000,2,FALSE)))","v":1500},0.3,58,0.49342105263157887,28.618421052631575,1,28.618421052631575,858.55263157894728]
[null,null,"MLRA_67A","Sandy_67A","2.1 Blue Grama, Threadleaf Sedge Sod, Spreading Buckwheat-Sy67A",{"$f":"IF(C9=0,\"\",(VLOOKUP(E9,NEW_DATA!$D$2:$E$2000,2,FALSE)))","v":600},0.3,44,0.19736842105263158,8.6842105263157894,1,8.6842105263157894,260.5263157894737,115.3,3460.4]
[null,null,null,null,null,{"$f":"IF(C10=0,\"\",(VLOOKUP(E10,NEW_DATA!$D$2:$E$2000,2,FALSE)))","v":""},null,null,{"$f":"IF(D10=0,\"\",(F10/912*G10))","v":""},{"$f":"IF(E10=0,\"\",H10*I10)","v":""},null,{"$f":"IF(E10=0,\"\",J10*K10)","v":""},{"$f":"IF(E10=0,\"\",L10*30)","v":""}]
["R1B",335,"MLRA_67A","Gravelly_67A","1.2 Blue Grama, Needle and Thread-Gv67A",{"$f":"IF(C11=0,\"\",(VLOOKUP(E11,NEW_DATA!$D$2:$E$2000,2,FALSE)))","v":600},0.3,133,0.19736842105263158,26.25,1,26.25,787.5]
[null,null,"MLRA_67A","Loamy_67A","1.2 Blue Grama, Threadleaf Sedge, Remnant Mid-grasses-Lo67A",{"$f":"IF(C12=0,\"\",(VLOOKUP(E12,NEW_DATA!$D$2:$E$2000,2,FALSE)))","v":1100},0.3,103,{"$f":"IF(D12=0,\"\",(F12/912*G12))","v":0.36184210526315791},{"$f":"IF(E12=0,\"\",H12*I12)","v":37.269736842105267},1,{"$f":"IF(E12=0,\"\",J12*K12)","v":37.269736842105267},{"$f":"IF(E12=0,\"\",L12*30)","v":1118.0921052631579}]
[null,null,"MLRA_67A","Limy_Upland_67A","1.1 Needle and Thread, Blue Grama, Little Bluestem, Sideoats Grama-LiU67A",{"$f":"IF(C13=0,\"\",(VLOOKUP(E13,NEW_DATA!$D$2:$E$2000,2,FALSE)))","v":1250},0.3,99,{"$f":"IF(D13=0,\"\",(F13/912*G13))","v":0.41118421052631582},{"$f":"IF(E13=0,\"\",H13*I13)","v":40.707236842105267},0.7,{"$f":"IF(E13=0,\"\",J13*K13)","v":28.495065789473685},{"$f":"IF(E13=0,\"\",L13*30)","v":854.85197368421052},{"$f":"SUM(L11:L13)","v":92.014802631578959},{"$f":"SUM(M11:M13)","v":2760.4440789473683}]
[null,null,null,null,null,{"$f":"IF(C14=0,\"\",(VLOOKUP(E14,NEW_DATA!$D$2:$E$2000,2,FALSE)))","v":""},null,null,"","",null,"","",null,null,"Since every pasture will contain a different number of site/community combinations, manually calculate AUM and AUD.  To speed the process you can use the excel formula:  =SUM(LX:LY) and =SUM(MX:MY) where X is the row number for the first cell number for the pasture and Y is the row number for the second cell number for the pasture. (Click in the cells of the example to see formula)."]
["R2",320,"MLRA_67A","Loamy_Lowland_67A","2.1 Blue Grama, Buffalograss, Decadent Cottonwood-LoLo67A",{"$f":"IF(C15=0,\"\",(VLOOKUP(E15,NEW_DATA!$D$2:$E$2000,2,FALSE)))","v":1250},0.3,82,0.41118421052631582,33.717105263157897,0.9,30.34539473684211,910.36184210526335]
[null,null,"MLRA_67A","Limy_Upland_67A","1.1 Needle and Thread, Blue Grama, Little Bluestem, Sideoats Grama-LiU67A",{"$f":"IF(C16=0,\"\",(VLOOKUP(E16,NEW_DATA!$D$2:$E$2000,2,FALSE)))","v":1250},0.3,109,0.41118421052631582,44.819078947368425,1,44.819078947368425,1344.5723684210527]
[null,null,"MLRA_67A","Sandy_67A","1.2 Blue Grama, Needle and Thread, Prairie Sandreed-Sy67A",{"$f":"IF(C17=0,\"\",(VLOOKUP(E17,NEW_DATA!$D$2:$E$2000,2,FALSE)))","v":1100},0.3,129,{"$f":"IF(D17=0,\"\",(F17/912*G17))","v":0.36184210526315791},{"$f":"IF(E17=0,\"\",H17*I17)","v":46.67763157894737},1,{"$f":"IF(E17=0,\"\",J17*K17)","v":46.67763157894737},{"$f":"IF(E17=0,\"\",L17*30)","v":1400.328947368421},{"$f":"SUM(L15:L17)","v":121.8421052631579},{"$f":"SUM(M15:M17)","v":3655.2631578947367}]
[null,null,null,null,null,{"$f":"IF(C18=0,\"\",(VLOOKUP(E18,NEW_DATA!$D$2:$E$2000,2,FALSE)))","v":""},null,null,"","",null,"",""]
["R3",80,"MLRA_67A","Sandy_67A","1.1 Needle and Thread, Prairie Sandreed, Little Bluestem-Sy67A",{"$f":"IF(C19=0,\"\",(VLOOKUP(E19,NEW_DATA!$D$2:$E$2000,2,FALSE)))","v":1500},0.3,47,0.49342105263157887,23.190789473684205,1,23.190789473684205,695.72368421052613]
[null,null,"MLRA_67A","Sandy_67A","1.2 Blue Grama, Needle and Thread, Prairie Sandreed-Sy67A",{"$f":"IF(C20=0,\"\",(VLOOKUP(E20,NEW_DATA!$D$2:$E$2000,2,FALSE)))","v":1100},0.3,33,0.36184210526315791,11.940789473684211,1,11.940789473684211,358.2236842105263,{"$f":"SUM(L19:L20)","v":35.131578947368418},{"$f":"SUM(M19:M20)","v":1053.9473684210525}]
[null,null,null,null,null,{"$f":"IF(C21=0,\"\",(VLOOKUP(E21,NEW_DATA!$D$2:$E$2000,2,FALSE)))","v":""},null,null,"","",null,"",""]
["R4",160,"MLRA_67A","Sandy_67A","1.2 Blue Grama, Needle and Thread, Prairie Sandreed-Sy67A",{"$f":"IF(C22=0,\"\",(VLOOKUP(E22,NEW_DATA!$D$2:$E$2000,2,FALSE)))","v":1100},0.3,160,0.36184210526315791,57.894736842105267,1,57.894736842105267,1736.8421052631579,{"$f":"L22","v":57.894736842105267},{"$f":"M22","v":1736.8421052631579}]
[null,null,null,null,null,{"$f":"IF(C23=0,\"\",(VLOOKUP(E23,NEW_DATA!$D$2:$E$2000,2,FALSE)))","v":""},null,null,"","",null,"","",null,null,"After entering information for all pastures, hide unneeded rows in order to clean up the printout.  If you do not want to display both AUM and AUD, hide the 2 columns for the option that you do not wish to display on your printout."]
["R5A",240,"MLRA_67A","Sandy_67A","1.2 Blue Grama, Needle and Thread, Prairie Sandreed-Sy67A",{"$f":"IF(C24=0,\"\",(VLOOKUP(E24,NEW_DATA!$D$2:$E$2000,2,FALSE)))","v":1100},0.3,47,0.36184210526315791,17.006578947368421,1,17.006578947368421,510.19736842105266]
[null,null,"MLRA_67A","Sandy_67A","2.1 Blue Grama, Threadleaf Sedge Sod, Spreading Buckwheat-Sy67A",{"$f":"IF(C25=0,\"\",(VLOOKUP(E25,NEW_DATA!$D$2:$E$2000,2,FALSE)))","v":600},0.3,83,0.19736842105263158,16.381578947368421,1,16.381578947368421,491.44736842105266]
[null,null,"MLRA_67A","Limy_Upland_67A","1.2 Blue Grama, Threadleaf Sedge, Remnant Mid-grasses-LiU67A",{"$f":"IF(C26=0,\"\",(VLOOKUP(E26,NEW_DATA!$D$2:$E$2000,2,FALSE)))","v":950},0.3,39,0.3125,12.1875,1,12.1875,365.625,null,null,"Insert page breaks so that page breaks do not break up data for individual pastures."]
[null,null,"MLRA_67A","Shallow_67A","1.1 Rhizomatous Wheatgrass-Little Bluestem-Blue Grama-Needle and Thread, Sw67A",{"$f":"IF(C27=0,\"\",(VLOOKUP(E27,NEW_DATA!$D$2:$E$2000,2,FALSE)))","v":1100},0.3,71,0.36184210526315791,25.690789473684212,0.8,20.55263157894737,616.57894736842104,{"$f":"SUM(L24:L27)","v":66.12828947368422},{"$f":"SUM(M24:M27)","v":1983.8486842105265}]
[null,null,null,null,null,{"$f":"IF(C28=0,\"\",(VLOOKUP(E28,NEW_DATA!$D$2:$E$2000,2,FALSE)))","v":""},null,null,"","",null,"",""]
["R5B",263,"MLRA_67A","Loamy_67A","1.1 Needle and Thread, Little Bluestem, Blue Grama-Lo67A",{"$f":"IF(C29=0,\"\",(VLOOKUP(E29,NEW_DATA!$D$2:$E$2000,2,FALSE)))","v":1500},0.25,90,0.41118421052631576,37.006578947368418,1,37.006578947368418,1110.1973684210525]
[null,null,"MLRA_67A","Loamy_Lowland_67A","1.2 Blue Grama, Western Wheatgrass, Cottonwood-LoLo67A",{"$f":"IF(C30=0,\"\",(VLOOKUP(E30,NEW_DATA!$D$2:$E$2000,2,FALSE)))","v":1750},0.25,107,0.47971491228070173,51.329495614035082,1,51.329495614035082,1539.8848684210525]
[null,null,"MLRA_67A","Limy_Upland_67A","1.2 Blue Grama, Threadleaf Sedge, Remnant Mid-grasses-LiU67A",{"$f":"IF(C31=0,\"\",(VLOOKUP(E31,NEW_DATA!$D$2:$E$2000,2,FALSE)))","v":950},0.25,66,0.26041666666666669,17.1875,1,17.1875,515.625,{"$f":"SUM(L29:L31)","v":105.52357456140351},{"$f":"SUM(M29:M31)","v":3165.707236842105}]
[null,null,null,null,null,{"$f":"IF(C32=0,\"\",(VLOOKUP(E32,NEW_DATA!$D$2:$E$2000,2,FALSE)))","v":""},null,null,"","",null,"",""]
["R5C",137,"MLRA_67A","Limy_Upland_67A","3.1 Broom Snakeweed, Annual Grasses, Forbs, Bare Ground-LiU67A",{"$f":"IF(C33=0,\"\",(VLOOKUP(E33,NEW_DATA!$D$2:$E$2000,2,FALSE)))","v":650},0.3,29,0.21381578947368421,6.2006578947368425,0.7,4.3404605263157894,130.21381578947367]
[null,null,"MLRA_67A","Limy_Upland_67A","2.1 Blue Grama, Buffalograss, Threadleaf Sedge-LiU67A",{"$f":"IF(C34=0,\"\",(VLOOKUP(E34,NEW_DATA!$D$2:$E$2000,2,FALSE)))","v":700},0.3,108,0.23026315789473684,24.868421052631579,1,24.868421052631579,746.0526315789474,{"$f":"SUM(L33:L34)","v":29.20888157894737},{"$f":"SUM(M33:M34)","v":876.26644736842104}]
[null,null,null,null,null,{"$f":"IF(C35=0,\"\",(VLOOKUP(E35,NEW_DATA!$D$2:$E$2000,2,FALSE)))","v":""},null,null,"","",null,"",""]
["R6",160,"MLRA_67A","Loamy_67A","4.2A Range Seeding, Natives, Excellent Stand-Lo67A",{"$f":"IF(C36=0,\"\",(VLOOKUP(E36,NEW_DATA!$D$2:$E$2000,2,FALSE)))","v":1700},0.3,160,0.55921052631578938,89.473684210526301,1,89.473684210526301,2684.2105263157891,89.5,2684.2]
[null,null,null,null,null,{"$f":"IF(C37=0,\"\",(VLOOKUP(E37,NEW_DATA!$D$2:$E$2000,2,FALSE)))","v":""},null,null,"","",null,"",""]
[null,null,null,null,null,{"$f":"IF(C38=0,\"\",(VLOOKUP(E38,NEW_DATA!$D$2:$E$2000,2,FALSE)))","v":""},null,null,"","",null,"",""]
[null,null,null,null,null,{"$f":"IF(C39=0,\"\",(VLOOKUP(E39,NEW_DATA!$D$2:$E$2000,2,FALSE)))","v":""},null,null,"","",null,"",""]
[null,null,null,null,null,{"$f":"IF(C40=0,\"\",(VLOOKUP(E40,NEW_DATA!$D$2:$E$2000,2,FALSE)))","v":""},null,null,"","",null,"",""]
[null,null,null,null,null,{"$f":"IF(C41=0,\"\",(VLOOKUP(E41,NEW_DATA!$D$2:$E$2000,2,FALSE)))","v":""},null,null,"","",null,"",""]
[null,null,null,null,null,{"$f":"IF(C42=0,\"\",(VLOOKUP(E42,NEW_DATA!$D$2:$E$2000,2,FALSE)))","v":""},null,null,"","",null,"",""]
[null,null,null,null,null,{"$f":"IF(C43=0,\"\",(VLOOKUP(E43,NEW_DATA!$D$2:$E$2000,2,FALSE)))","v":""},null,null,"","",null,"",""]
[null,null,null,null,null,{"$f":"IF(C44=0,\"\",(VLOOKUP(E44,NEW_DATA!$D$2:$E$2000,2,FALSE)))","v":""},null,null,"","",null,"",""]
[null,null,null,null,null,{"$f":"IF(C45=0,\"\",(VLOOKUP(E45,NEW_DATA!$D$2:$E$2000,2,FALSE)))","v":""},null,null,"","",null,"",""]
[null,null,null,null,null,{"$f":"IF(C46=0,\"\",(VLOOKUP(E46,NEW_DATA!$D$2:$E$2000,2,FALSE)))","v":""},null,null,"","",null,"",""]
[null,null,null,null,null,{"$f":"IF(C47=0,\"\",(VLOOKUP(E47,NEW_DATA!$D$2:$E$2000,2,FALSE)))","v":""},null,null,"","",null,"",""]
[null,null,null,null,null,{"$f":"IF(C48=0,\"\",(VLOOKUP(E48,NEW_DATA!$D$2:$E$2000,2,FALSE)))","v":""},null,null,"","",null,"",""]
[null,null,null,null,null,{"$f":"IF(C49=0,\"\",(VLOOKUP(E49,NEW_DATA!$D$2:$E$2000,2,FALSE)))","v":""},null,null,"","",null,"",""]
[null,null,null,null,null,{"$f":"IF(C50=0,\"\",(VLOOKUP(E50,NEW_DATA!$D$2:$E$2000,2,FALSE)))","v":""},null,null,"","",null,"",""]
[null,null,null,null,null,{"$f":"IF(C51=0,\"\",(VLOOKUP(E51,NEW_DATA!$D$2:$E$2000,2,FALSE)))","v":""},null,null,"","",null,"",""]
[null,null,null,null,null,{"$f":"IF(C52=0,\"\",(VLOOKUP(E52,NEW_DATA!$D$2:$E$2000,2,FALSE)))","v":""},null,null,"","",null,"",""]
[null,null,null,null,null,{"$f":"IF(C53=0,\"\",(VLOOKUP(E53,NEW_DATA!$D$2:$E$2000,2,FALSE)))","v":""},null,null,"","",null,"",""]
[null,null,null,null,null,{"$f":"IF(C54=0,\"\",(VLOOKUP(E54,NEW_DATA!$D$2:$E$2000,2,FALSE)))","v":""},null,null,"","",null,"",""]
[null,null,null,null,null,{"$f":"IF(C55=0,\"\",(VLOOKUP(E55,NEW_DATA!$D$2:$E$2000,2,FALSE)))","v":""},null,null,"","",null,"",""]
[null,null,null,null,null,{"$f":"IF(C56=0,\"\",(VLOOKUP(E56,NEW_DATA!$D$2:$E$2000,2,FALSE)))","v":""},null,null,"","",null,"",""]
[null,null,null,null,null,{"$f":"IF(C57=0,\"\",(VLOOKUP(E57,NEW_DATA!$D$2:$E$2000,2,FALSE)))","v":""},null,null,"","",null,"",""]
[null,null,null,null,null,{"$f":"IF(C58=0,\"\",(VLOOKUP(E58,NEW_DATA!$D$2:$E$2000,2,FALSE)))","v":""},null,null,"","",null,"",""]
[null,null,null,null,null,{"$f":"IF(C59=0,\"\",(VLOOKUP(E59,NEW_DATA!$D$2:$E$2000,2,FALSE)))","v":""},null,null,"","",null,"",""]
[null,null,null,null,null,{"$f":"IF(C60=0,\"\",(VLOOKUP(E60,NEW_DATA!$D$2:$E$2000,2,FALSE)))","v":""},null,null,"","",null,"",""]
[null,null,null,null,null,{"$f":"IF(C61=0,\"\",(VLOOKUP(E61,NEW_DATA!$D$2:$E$2000,2,FALSE)))","v":""},null,null,"","",null,"",""]
[null,null,null,null,null,{"$f":"IF(C62=0,\"\",(VLOOKUP(E62,NEW_DATA!$D$2:$E$2000,2,FALSE)))","v":""},null,null,"","",null,"",""]
[null,null,null,null,null,{"$f":"IF(C63=0,\"\",(VLOOKUP(E63,NEW_DATA!$D$2:$E$2000,2,FALSE)))","v":""},null,null,"","",null,"",""]
[null,null,null,null,null,{"$f":"IF(C64=0,\"\",(VLOOKUP(E64,NEW_DATA!$D$2:$E$2000,2,FALSE)))","v":""},null,null,"","",null,"",""]
[null,null,null,null,null,{"$f":"IF(C65=0,\"\",(VLOOKUP(E65,NEW_DATA!$D$2:$E$2000,2,FALSE)))","v":""},null,null,"","",null,"",""]
[null,null,null,null,null,{"$f":"IF(C66=0,\"\",(VLOOKUP(E66,NEW_DATA!$D$2:$E$2000,2,FALSE)))","v":""},null,null,"","",null,"",""]
[null,null,null,null,null,{"$f":"IF(C67=0,\"\",(VLOOKUP(E67,NEW_DATA!$D$2:$E$2000,2,FALSE)))","v":""},null,null,"","",null,"",""]
[null,null,null,null,null,{"$f":"IF(C68=0,\"\",(VLOOKUP(E68,NEW_DATA!$D$2:$E$2000,2,FALSE)))","v":""},null,null,"","",null,"",""]
[null,null,null,null,null,{"$f":"IF(C69=0,\"\",(VLOOKUP(E69,NEW_DATA!$D$2:$E$2000,2,FALSE)))","v":""},null,null,"","",null,"",""]
[null,null,null,null,null,{"$f":"IF(C70=0,\"\",(VLOOKUP(E70,NEW_DATA!$D$2:$E$2000,2,FALSE)))","v":""},null,null,"","",null,"",""]
[null,null,null,null,null,{"$f":"IF(C71=0,\"\",(VLOOKUP(E71,NEW_DATA!$D$2:$E$2000,2,FALSE)))","v":""},null,null,"","",null,"",""]
[null,null,null,null,null,{"$f":"IF(C72=0,\"\",(VLOOKUP(E72,NEW_DATA!$D$2:$E$2000,2,FALSE)))","v":""},null,null,"","",null,"",""]
[null,null,null,null,null,{"$f":"IF(C73=0,\"\",(VLOOKUP(E73,NEW_DATA!$D$2:$E$2000,2,FALSE)))","v":""},null,null,"","",null,"",""]
[null,null,null,null,null,{"$f":"IF(C74=0,\"\",(VLOOKUP(E74,NEW_DATA!$D$2:$E$2000,2,FALSE)))","v":""},null,null,{"$f":"IF(D74=0,\"\",(F74/912*G74))","v":""},{"$f":"IF(E74=0,\"\",H74*I74)","v":""},null,{"$f":"IF(E74=0,\"\",J74*K74)","v":""},{"$f":"IF(E74=0,\"\",L74*30)","v":""}]
[null,null,null,null,null,{"$f":"IF(C75=0,\"\",(VLOOKUP(E75,NEW_DATA!$D$2:$E$2000,2,FALSE)))","v":""},null,null,"","",null,"",""]
[null,null,null,null,null,{"$f":"IF(C76=0,\"\",(VLOOKUP(E76,NEW_DATA!$D$2:$E$2000,2,FALSE)))","v":""},null,null,"","",null,"",""]
[null,null,null,null,null,{"$f":"IF(C77=0,\"\",(VLOOKUP(E77,NEW_DATA!$D$2:$E$2000,2,FALSE)))","v":""},null,null,"","",null,"",""]
[null,null,null,null,null,{"$f":"IF(C78=0,\"\",(VLOOKUP(E78,NEW_DATA!$D$2:$E$2000,2,FALSE)))","v":""},null,null,"","",null,"",""]
[null,null,null,null,null,{"$f":"IF(C79=0,\"\",(VLOOKUP(E79,NEW_DATA!$D$2:$E$2000,2,FALSE)))","v":""},null,null,"","",null,"",""]
[null,null,null,null,null,{"$f":"IF(C80=0,\"\",(VLOOKUP(E80,NEW_DATA!$D$2:$E$2000,2,FALSE)))","v":""},null,null,"","",null,"",""]
[null,null,null,null,null,{"$f":"IF(C81=0,\"\",(VLOOKUP(E81,NEW_DATA!$D$2:$E$2000,2,FALSE)))","v":""},null,null,"","",null,"",""]
[null,null,null,null,null,{"$f":"IF(C82=0,\"\",(VLOOKUP(E82,NEW_DATA!$D$2:$E$2000,2,FALSE)))","v":""},null,null,"","",null,"",""]
[null,null,null,null,null,{"$f":"IF(C83=0,\"\",(VLOOKUP(E83,NEW_DATA!$D$2:$E$2000,2,FALSE)))","v":""},null,null,"","",null,"",""]
[null,null,null,null,null,{"$f":"IF(C84=0,\"\",(VLOOKUP(E84,NEW_DATA!$D$2:$E$2000,2,FALSE)))","v":""},null,null,"","",null,"",""]
[null,null,null,null,null,{"$f":"IF(C85=0,\"\",(VLOOKUP(E85,NEW_DATA!$D$2:$E$2000,2,FALSE)))","v":""},null,null,"","",null,"",""]
[null,null,null,null,null,{"$f":"IF(C86=0,\"\",(VLOOKUP(E86,NEW_DATA!$D$2:$E$2000,2,FALSE)))","v":""},null,null,"","",null,"",""]
[null,null,null,null,null,{"$f":"IF(C87=0,\"\",(VLOOKUP(E87,NEW_DATA!$D$2:$E$2000,2,FALSE)))","v":""},null,null,"","",null,"",""]
[null,null,null,null,null,{"$f":"IF(C88=0,\"\",(VLOOKUP(E88,NEW_DATA!$D$2:$E$2000,2,FALSE)))","v":""},null,null,"","",null,"",""]
[null,null,null,null,null,{"$f":"IF(C89=0,\"\",(VLOOKUP(E89,NEW_DATA!$D$2:$E$2000,2,FALSE)))","v":""},null,null,"","",null,"",""]
[null,null,null,null,null,{"$f":"IF(C90=0,\"\",(VLOOKUP(E90,NEW_DATA!$D$2:$E$2000,2,FALSE)))","v":""},null,null,"","",null,"",""]
[null,null,null,null,null,{"$f":"IF(C91=0,\"\",(VLOOKUP(E91,NEW_DATA!$D$2:$E$2000,2,FALSE)))","v":""},null,null,"","",null,"",""]
[null,null,null,null,null,{"$f":"IF(C92=0,\"\",(VLOOKUP(E92,NEW_DATA!$D$2:$E$2000,2,FALSE)))","v":""},null,null,"","",null,"",""]
[null,null,null,null,null,{"$f":"IF(C93=0,\"\",(VLOOKUP(E93,NEW_DATA!$D$2:$E$2000,2,FALSE)))","v":""},null,null,"","",null,"",""]
[null,null,null,null,null,{"$f":"IF(C94=0,\"\",(VLOOKUP(E94,NEW_DATA!$D$2:$E$2000,2,FALSE)))","v":""},null,null,"","",null,"",""]
[null,null,null,null,null,{"$f":"IF(C95=0,\"\",(VLOOKUP(E95,NEW_DATA!$D$2:$E$2000,2,FALSE)))","v":""},null,null,"","",null,"",""]
[null,null,null,null,null,{"$f":"IF(C96=0,\"\",(VLOOKUP(E96,NEW_DATA!$D$2:$E$2000,2,FALSE)))","v":""},null,null,"","",null,"",""]
[null,null,null,null,null,{"$f":"IF(C97=0,\"\",(VLOOKUP(E97,NEW_DATA!$D$2:$E$2000,2,FALSE)))","v":""},null,null,"","",null,"",""]
[null,null,null,null,null,{"$f":"IF(C98=0,\"\",(VLOOKUP(E98,NEW_DATA!$D$2:$E$2000,2,FALSE)))","v":""},null,null,"","",null,"",""]
[null,null,null,null,null,{"$f":"IF(C99=0,\"\",(VLOOKUP(E99,NEW_DATA!$D$2:$E$2000,2,FALSE)))","v":""},null,null,"","",null,"",""]
[null,null,null,null,null,{"$f":"IF(C100=0,\"\",(VLOOKUP(E100,NEW_DATA!$D$2:$E$2000,2,FALSE)))","v":""},null,null,"","",null,"",""]
[null,null,null,null,null,{"$f":"IF(C101=0,\"\",(VLOOKUP(E101,NEW_DATA!$D$2:$E$2000,2,FALSE)))","v":""},null,null,"","",null,"",""]
[null,null,null,null,null,{"$f":"IF(C102=0,\"\",(VLOOKUP(E102,NEW_DATA!$D$2:$E$2000,2,FALSE)))","v":""},null,null,"","",null,"",""]
[null,null,null,null,null,{"$f":"IF(C103=0,\"\",(VLOOKUP(E103,NEW_DATA!$D$2:$E$2000,2,FALSE)))","v":""},null,null,"","",null,"",""]
[null,null,null,null,null,{"$f":"IF(C104=0,\"\",(VLOOKUP(E104,NEW_DATA!$D$2:$E$2000,2,FALSE)))","v":""},null,null,"","",null,"",""]
[null,null,null,null,null,{"$f":"IF(C105=0,\"\",(VLOOKUP(E105,NEW_DATA!$D$2:$E$2000,2,FALSE)))","v":""},null,null,"","",null,"",""]
[null,null,null,null,null,{"$f":"IF(C106=0,\"\",(VLOOKUP(E106,NEW_DATA!$D$2:$E$2000,2,FALSE)))","v":""},null,null,"","",null,"",""]
[null,null,null,null,null,{"$f":"IF(C107=0,\"\",(VLOOKUP(E107,NEW_DATA!$D$2:$E$2000,2,FALSE)))","v":""},null,null,"","",null,"",""]
[null,null,null,null,null,{"$f":"IF(C108=0,\"\",(VLOOKUP(E108,NEW_DATA!$D$2:$E$2000,2,FALSE)))","v":""},null,null,"","",null,"",""]
[null,null,null,null,null,{"$f":"IF(C109=0,\"\",(VLOOKUP(E109,NEW_DATA!$D$2:$E$2000,2,FALSE)))","v":""},null,null,"","",null,"",""]
[null,null,null,null,null,{"$f":"IF(C110=0,\"\",(VLOOKUP(E110,NEW_DATA!$D$2:$E$2000,2,FALSE)))","v":""},null,null,"","",null,"",""]
[null,null,null,null,null,{"$f":"IF(C111=0,\"\",(VLOOKUP(E111,NEW_DATA!$D$2:$E$2000,2,FALSE)))","v":""},null,null,"","",null,"",""]
[null,null,null,null,null,{"$f":"IF(C112=0,\"\",(VLOOKUP(E112,NEW_DATA!$D$2:$E$2000,2,FALSE)))","v":""},null,null,"","",null,"",""]
[null,null,null,null,null,{"$f":"IF(C113=0,\"\",(VLOOKUP(E113,NEW_DATA!$D$2:$E$2000,2,FALSE)))","v":""},null,null,"","",null,"",""]
[null,null,null,null,null,{"$f":"IF(C114=0,\"\",(VLOOKUP(E114,NEW_DATA!$D$2:$E$2000,2,FALSE)))","v":""},null,null,"","",null,"",""]
[null,null,null,null,null,{"$f":"IF(C115=0,\"\",(VLOOKUP(E115,NEW_DATA!$D$2:$E$2000,2,FALSE)))","v":""},null,null,"","",null,"",""]
[null,null,null,null,null,{"$f":"IF(C116=0,\"\",(VLOOKUP(E116,NEW_DATA!$D$2:$E$2000,2,FALSE)))","v":""},null,null,"","",null,"",""]
[null,null,null,null,null,{"$f":"IF(C117=0,\"\",(VLOOKUP(E117,NEW_DATA!$D$2:$E$2000,2,FALSE)))","v":""},null,null,"","",null,"",""]
[null,null,null,null,null,{"$f":"IF(C118=0,\"\",(VLOOKUP(E118,NEW_DATA!$D$2:$E$2000,2,FALSE)))","v":""},null,null,"","",null,"",""]
[null,null,null,null,null,{"$f":"IF(C119=0,\"\",(VLOOKUP(E119,NEW_DATA!$D$2:$E$2000,2,FALSE)))","v":""},null,null,"","",null,"",""]
[null,null,null,null,null,{"$f":"IF(C120=0,\"\",(VLOOKUP(E120,NEW_DATA!$D$2:$E$2000,2,FALSE)))","v":""},null,null,"","",null,"",""]
[null,null,null,null,null,{"$f":"IF(C121=0,\"\",(VLOOKUP(E121,NEW_DATA!$D$2:$E$2000,2,FALSE)))","v":""},null,null,"","",null,"",""]
[null,null,null,null,null,{"$f":"IF(C122=0,\"\",(VLOOKUP(E122,NEW_DATA!$D$2:$E$2000,2,FALSE)))","v":""},null,null,"","",null,"",""]
[null,null,null,null,null,{"$f":"IF(C123=0,\"\",(VLOOKUP(E123,NEW_DATA!$D$2:$E$2000,2,FALSE)))","v":""},null,null,"","",null,"",""]
[null,null,null,null,null,{"$f":"IF(C124=0,\"\",(VLOOKUP(E124,NEW_DATA!$D$2:$E$2000,2,FALSE)))","v":""},null,null,"","",null,"",""]
[null,null,null,null,null,{"$f":"IF(C125=0,\"\",(VLOOKUP(E125,NEW_DATA!$D$2:$E$2000,2,FALSE)))","v":""},null,null,"","",null,"",""]
[null,null,null,null,null,{"$f":"IF(C126=0,\"\",(VLOOKUP(E126,NEW_DATA!$D$2:$E$2000,2,FALSE)))","v":""},null,null,"","",null,"",""]
[null,null,null,null,null,{"$f":"IF(C127=0,\"\",(VLOOKUP(E127,NEW_DATA!$D$2:$E$2000,2,FALSE)))","v":""},null,null,"","",null,"",""]
[null,null,null,null,null,{"$f":"IF(C128=0,\"\",(VLOOKUP(E128,NEW_DATA!$D$2:$E$2000,2,FALSE)))","v":""},null,null,"","",null,"",""]
[null,null,null,null,null,{"$f":"IF(C129=0,\"\",(VLOOKUP(E129,NEW_DATA!$D$2:$E$2000,2,FALSE)))","v":""},null,null,"","",null,"",""]
[null,null,null,null,null,{"$f":"IF(C130=0,\"\",(VLOOKUP(E130,NEW_DATA!$D$2:$E$2000,2,FALSE)))","v":""},null,null,"","",null,"",""]
[null,null,null,null,null,{"$f":"IF(C131=0,\"\",(VLOOKUP(E131,NEW_DATA!$D$2:$E$2000,2,FALSE)))","v":""},null,null,"","",null,"",""]
[null,null,null,null,null,{"$f":"IF(C132=0,\"\",(VLOOKUP(E132,NEW_DATA!$D$2:$E$2000,2,FALSE)))","v":""},null,null,"","",null,"",""]
[null,null,null,null,null,{"$f":"IF(C133=0,\"\",(VLOOKUP(E133,NEW_DATA!$D$2:$E$2000,2,FALSE)))","v":""},null,null,"","",null,"",""]
[null,null,null,null,null,{"$f":"IF(C134=0,\"\",(VLOOKUP(E134,NEW_DATA!$D$2:$E$2000,2,FALSE)))","v":""},null,null,"","",null,"",""]
[null,null,null,null,null,{"$f":"IF(C135=0,\"\",(VLOOKUP(E135,NEW_DATA!$D$2:$E$2000,2,FALSE)))","v":""},null,null,"","",null,"",""]
[null,null,null,null,null,{"$f":"IF(C136=0,\"\",(VLOOKUP(E136,NEW_DATA!$D$2:$E$2000,2,FALSE)))","v":""},null,null,"","",null,"",""]
[null,null,null,null,null,{"$f":"IF(C137=0,\"\",(VLOOKUP(E137,NEW_DATA!$D$2:$E$2000,2,FALSE)))","v":""},null,null,"","",null,"",""]
[null,null,null,null,null,{"$f":"IF(C138=0,\"\",(VLOOKUP(E138,NEW_DATA!$D$2:$E$2000,2,FALSE)))","v":""},null,null,{"$f":"IF(D138=0,\"\",(F138/912*G138))","v":""},{"$f":"IF(E138=0,\"\",H138*I138)","v":""},null,{"$f":"IF(E138=0,\"\",J138*K138)","v":""},{"$f":"IF(E138=0,\"\",L138*30)","v":""}]
[null,null,null,null,null,{"$f":"IF(C139=0,\"\",(VLOOKUP(E139,NEW_DATA!$D$2:$E$2000,2,FALSE)))","v":""},null,null,"","",null,"",""]
[null,null,null,null,null,{"$f":"IF(C140=0,\"\",(VLOOKUP(E140,NEW_DATA!$D$2:$E$2000,2,FALSE)))","v":""},null,null,"","",null,"",""]
[null,null,null,null,null,{"$f":"IF(C141=0,\"\",(VLOOKUP(E141,NEW_DATA!$D$2:$E$2000,2,FALSE)))","v":""},null,null,"","",null,"",""]
[null,null,null,null,null,{"$f":"IF(C142=0,\"\",(VLOOKUP(E142,NEW_DATA!$D$2:$E$2000,2,FALSE)))","v":""},null,null,"","",null,"",""]
[null,null,null,null,null,{"$f":"IF(C143=0,\"\",(VLOOKUP(E143,NEW_DATA!$D$2:$E$2000,2,FALSE)))","v":""},null,null,"","",null,"",""]
[null,null,null,null,null,{"$f":"IF(C144=0,\"\",(VLOOKUP(E144,NEW_DATA!$D$2:$E$2000,2,FALSE)))","v":""},null,null,"","",null,"",""]
[null,null,null,null,null,{"$f":"IF(C145=0,\"\",(VLOOKUP(E145,NEW_DATA!$D$2:$E$2000,2,FALSE)))","v":""},null,null,"","",null,"",""]
[null,null,null,null,null,{"$f":"IF(C146=0,\"\",(VLOOKUP(E146,NEW_DATA!$D$2:$E$2000,2,FALSE)))","v":""},null,null,"","",null,"",""]
[null,null,null,null,null,{"$f":"IF(C147=0,\"\",(VLOOKUP(E147,NEW_DATA!$D$2:$E$2000,2,FALSE)))","v":""},null,null,"","",null,"",""]
[null,null,null,null,null,{"$f":"IF(C148=0,\"\",(VLOOKUP(E148,NEW_DATA!$D$2:$E$2000,2,FALSE)))","v":""},null,null,"","",null,"",""]
[null,null,null,null,null,{"$f":"IF(C149=0,\"\",(VLOOKUP(E149,NEW_DATA!$D$2:$E$2000,2,FALSE)))","v":""},null,null,"","",null,"",""]
[null,null,null,null,null,{"$f":"IF(C150=0,\"\",(VLOOKUP(E150,NEW_DATA!$D$2:$E$2000,2,FALSE)))","v":""},null,null,"","",null,"",""]
[null,null,null,null,null,{"$f":"IF(C151=0,\"\",(VLOOKUP(E151,NEW_DATA!$D$2:$E$2000,2,FALSE)))","v":""},null,null,"","",null,"",""]
[null,null,null,null,null,{"$f":"IF(C152=0,\"\",(VLOOKUP(E152,NEW_DATA!$D$2:$E$2000,2,FALSE)))","v":""},null,null,"","",null,"",""]
[null,null,null,null,null,{"$f":"IF(C153=0,\"\",(VLOOKUP(E153,NEW_DATA!$D$2:$E$2000,2,FALSE)))","v":""},null,null,"","",null,"",""]
[null,null,null,null,null,{"$f":"IF(C154=0,\"\",(VLOOKUP(E154,NEW_DATA!$D$2:$E$2000,2,FALSE)))","v":""},null,null,"","",null,"",""]
[null,null,null,null,null,{"$f":"IF(C155=0,\"\",(VLOOKUP(E155,NEW_DATA!$D$2:$E$2000,2,FALSE)))","v":""},null,null,"","",null,"",""]
[null,null,null,null,null,{"$f":"IF(C156=0,\"\",(VLOOKUP(E156,NEW_DATA!$D$2:$E$2000,2,FALSE)))","v":""},null,null,"","",null,"",""]
[null,null,null,null,null,{"$f":"IF(C157=0,\"\",(VLOOKUP(E157,NEW_DATA!$D$2:$E$2000,2,FALSE)))","v":""},null,null,"","",null,"",""]
[null,null,null,null,null,{"$f":"IF(C158=0,\"\",(VLOOKUP(E158,NEW_DATA!$D$2:$E$2000,2,FALSE)))","v":""},null,null,"","",null,"",""]
[null,null,null,null,null,{"$f":"IF(C159=0,\"\",(VLOOKUP(E159,NEW_DATA!$D$2:$E$2000,2,FALSE)))","v":""},null,null,"","",null,"",""]
[null,null,null,null,null,{"$f":"IF(C160=0,\"\",(VLOOKUP(E160,NEW_DATA!$D$2:$E$2000,2,FALSE)))","v":""},null,null,"","",null,"",""]
[null,null,null,null,null,{"$f":"IF(C161=0,\"\",(VLOOKUP(E161,NEW_DATA!$D$2:$E$2000,2,FALSE)))","v":""},null,null,"","",null,"",""]
[null,null,null,null,null,{"$f":"IF(C162=0,\"\",(VLOOKUP(E162,NEW_DATA!$D$2:$E$2000,2,FALSE)))","v":""},null,null,"","",null,"",""]
[null,null,null,null,null,{"$f":"IF(C163=0,\"\",(VLOOKUP(E163,NEW_DATA!$D$2:$E$2000,2,FALSE)))","v":""},null,null,"","",null,"",""]
[null,null,null,null,null,{"$f":"IF(C164=0,\"\",(VLOOKUP(E164,NEW_DATA!$D$2:$E$2000,2,FALSE)))","v":""},null,null,"","",null,"",""]
[null,null,null,null,null,{"$f":"IF(C165=0,\"\",(VLOOKUP(E165,NEW_DATA!$D$2:$E$2000,2,FALSE)))","v":""},null,null,"","",null,"",""]
[null,null,null,null,null,{"$f":"IF(C166=0,\"\",(VLOOKUP(E166,NEW_DATA!$D$2:$E$2000,2,FALSE)))","v":""},null,null,"","",null,"",""]
[null,null,null,null,null,{"$f":"IF(C167=0,\"\",(VLOOKUP(E167,NEW_DATA!$D$2:$E$2000,2,FALSE)))","v":""},null,null,"","",null,"",""]
[null,null,null,null,null,{"$f":"IF(C168=0,\"\",(VLOOKUP(E168,NEW_DATA!$D$2:$E$2000,2,FALSE)))","v":""},null,null,"","",null,"",""]
[null,null,null,null,null,{"$f":"IF(C169=0,\"\",(VLOOKUP(E169,NEW_DATA!$D$2:$E$2000,2,FALSE)))","v":""},null,null,"","",null,"",""]
[null,null,null,null,null,{"$f":"IF(C170=0,\"\",(VLOOKUP(E170,NEW_DATA!$D$2:$E$2000,2,FALSE)))","v":""},null,null,"","",null,"",""]
[null,null,null,null,null,{"$f":"IF(C171=0,\"\",(VLOOKUP(E171,NEW_DATA!$D$2:$E$2000,2,FALSE)))","v":""},null,null,"","",null,"",""]
[null,null,null,null,null,{"$f":"IF(C172=0,\"\",(VLOOKUP(E172,NEW_DATA!$D$2:$E$2000,2,FALSE)))","v":""},null,null,"","",null,"",""]
[null,null,null,null,null,{"$f":"IF(C173=0,\"\",(VLOOKUP(E173,NEW_DATA!$D$2:$E$2000,2,FALSE)))","v":""},null,null,"","",null,"",""]
[null,null,null,null,null,{"$f":"IF(C174=0,\"\",(VLOOKUP(E174,NEW_DATA!$D$2:$E$2000,2,FALSE)))","v":""},null,null,"","",null,"",""]
[null,null,null,null,null,{"$f":"IF(C175=0,\"\",(VLOOKUP(E175,NEW_DATA!$D$2:$E$2000,2,FALSE)))","v":""},null,null,"","",null,"",""]
[null,null,null,null,null,{"$f":"IF(C176=0,\"\",(VLOOKUP(E176,NEW_DATA!$D$2:$E$2000,2,FALSE)))","v":""},null,null,"","",null,"",""]
[null,null,null,null,null,{"$f":"IF(C177=0,\"\",(VLOOKUP(E177,NEW_DATA!$D$2:$E$2000,2,FALSE)))","v":""},null,null,"","",null,"",""]
[null,null,null,null,null,{"$f":"IF(C178=0,\"\",(VLOOKUP(E178,NEW_DATA!$D$2:$E$2000,2,FALSE)))","v":""},null,null,"","",null,"",""]
[null,null,null,null,null,{"$f":"IF(C179=0,\"\",(VLOOKUP(E179,NEW_DATA!$D$2:$E$2000,2,FALSE)))","v":""},null,null,"","",null,"",""]
[null,null,null,null,null,{"$f":"IF(C180=0,\"\",(VLOOKUP(E180,NEW_DATA!$D$2:$E$2000,2,FALSE)))","v":""},null,null,"","",null,"",""]
[null,null,null,null,null,{"$f":"IF(C181=0,\"\",(VLOOKUP(E181,NEW_DATA!$D$2:$E$2000,2,FALSE)))","v":""},null,null,"","",null,"",""]
[null,null,null,null,null,{"$f":"IF(C182=0,\"\",(VLOOKUP(E182,NEW_DATA!$D$2:$E$2000,2,FALSE)))","v":""},null,null,"","",null,"",""]
[null,null,null,null,null,{"$f":"IF(C183=0,\"\",(VLOOKUP(E183,NEW_DATA!$D$2:$E$2000,2,FALSE)))","v":""},null,null,"","",null,"",""]
[null,null,null,null,null,{"$f":"IF(C184=0,\"\",(VLOOKUP(E184,NEW_DATA!$D$2:$E$2000,2,FALSE)))","v":""},null,null,"","",null,"",""]
[null,null,null,null,null,{"$f":"IF(C185=0,\"\",(VLOOKUP(E185,NEW_DATA!$D$2:$E$2000,2,FALSE)))","v":""},null,null,"","",null,"",""]
[null,null,null,null,null,{"$f":"IF(C186=0,\"\",(VLOOKUP(E186,NEW_DATA!$D$2:$E$2000,2,FALSE)))","v":""},null,null,"","",null,"",""]
[null,null,null,null,null,{"$f":"IF(C187=0,\"\",(VLOOKUP(E187,NEW_DATA!$D$2:$E$2000,2,FALSE)))","v":""},null,null,"","",null,"",""]
[null,null,null,null,null,{"$f":"IF(C188=0,\"\",(VLOOKUP(E188,NEW_DATA!$D$2:$E$2000,2,FALSE)))","v":""},null,null,"","",null,"",""]
[null,null,null,null,null,{"$f":"IF(C189=0,\"\",(VLOOKUP(E189,NEW_DATA!$D$2:$E$2000,2,FALSE)))","v":""},null,null,"","",null,"",""]
[null,null,null,null,null,{"$f":"IF(C190=0,\"\",(VLOOKUP(E190,NEW_DATA!$D$2:$E$2000,2,FALSE)))","v":""},null,null,"","",null,"",""]
[null,null,null,null,null,{"$f":"IF(C191=0,\"\",(VLOOKUP(E191,NEW_DATA!$D$2:$E$2000,2,FALSE)))","v":""},null,null,"","",null,"",""]
[null,null,null,null,null,{"$f":"IF(C192=0,\"\",(VLOOKUP(E192,NEW_DATA!$D$2:$E$2000,2,FALSE)))","v":""},null,null,"","",null,"",""]
[null,null,null,null,null,{"$f":"IF(C193=0,\"\",(VLOOKUP(E193,NEW_DATA!$D$2:$E$2000,2,FALSE)))","v":""},null,null,"","",null,"",""]
[null,null,null,null,null,{"$f":"IF(C194=0,\"\",(VLOOKUP(E194,NEW_DATA!$D$2:$E$2000,2,FALSE)))","v":""},null,null,"","",null,"",""]
[null,null,null,null,null,{"$f":"IF(C195=0,\"\",(VLOOKUP(E195,NEW_DATA!$D$2:$E$2000,2,FALSE)))","v":""},null,null,"","",null,"",""]
[null,null,null,null,null,{"$f":"IF(C196=0,\"\",(VLOOKUP(E196,NEW_DATA!$D$2:$E$2000,2,FALSE)))","v":""},null,null,"","",null,"",""]
[null,null,null,null,null,{"$f":"IF(C197=0,\"\",(VLOOKUP(E197,NEW_DATA!$D$2:$E$2000,2,FALSE)))","v":""},null,null,"","",null,"",""]
[null,null,null,null,null,{"$f":"IF(C198=0,\"\",(VLOOKUP(E198,NEW_DATA!$D$2:$E$2000,2,FALSE)))","v":""},null,null,"","",null,"",""]
[null,null,null,null,null,{"$f":"IF(C199=0,\"\",(VLOOKUP(E199,NEW_DATA!$D$2:$E$2000,2,FALSE)))","v":""},null,null,"","",null,"",""]
[null,null,null,null,null,{"$f":"IF(C200=0,\"\",(VLOOKUP(E200,NEW_DATA!$D$2:$E$2000,2,FALSE)))","v":""},null,null,"","",null,"",""]
[null,null,null,null,null,{"$f":"IF(C201=0,\"\",(VLOOKUP(E201,NEW_DATA!$D$2:$E$2000,2,FALSE)))","v":""},null,null,"","",null,"",""]
[null,null,null,null,null,{"$f":"IF(C202=0,\"\",(VLOOKUP(E202,NEW_DATA!$D$2:$E$2000,2,FALSE)))","v":""},null,null,{"$f":"IF(D202=0,\"\",(F202/912*G202))","v":""},{"$f":"IF(E202=0,\"\",H202*I202)","v":""},null,{"$f":"IF(E202=0,\"\",J202*K202)","v":""},{"$f":"IF(E202=0,\"\",L202*30)","v":""}]
[null,null,null,null,null,{"$f":"IF(C203=0,\"\",(VLOOKUP(E203,NEW_DATA!$D$2:$E$2000,2,FALSE)))","v":""},null,null,"","",null,"",""]
[null,null,null,null,null,{"$f":"IF(C204=0,\"\",(VLOOKUP(E204,NEW_DATA!$D$2:$E$2000,2,FALSE)))","v":""},null,null,"","",null,"",""]
[null,null,null,null,null,{"$f":"IF(C205=0,\"\",(VLOOKUP(E205,NEW_DATA!$D$2:$E$2000,2,FALSE)))","v":""},null,null,"","",null,"",""]
[null,null,null,null,null,{"$f":"IF(C206=0,\"\",(VLOOKUP(E206,NEW_DATA!$D$2:$E$2000,2,FALSE)))","v":""},null,null,"","",null,"",""]
[null,null,null,null,null,{"$f":"IF(C207=0,\"\",(VLOOKUP(E207,NEW_DATA!$D$2:$E$2000,2,FALSE)))","v":""},null,null,"","",null,"",""]
[null,null,null,null,null,{"$f":"IF(C208=0,\"\",(VLOOKUP(E208,NEW_DATA!$D$2:$E$2000,2,FALSE)))","v":""},null,null,"","",null,"",""]
[null,null,null,null,null,{"$f":"IF(C209=0,\"\",(VLOOKUP(E209,NEW_DATA!$D$2:$E$2000,2,FALSE)))","v":""},null,null,"","",null,"",""]
[null,null,null,null,null,{"$f":"IF(C210=0,\"\",(VLOOKUP(E210,NEW_DATA!$D$2:$E$2000,2,FALSE)))","v":""},null,null,"","",null,"",""]
[null,null,null,null,null,{"$f":"IF(C211=0,\"\",(VLOOKUP(E211,NEW_DATA!$D$2:$E$2000,2,FALSE)))","v":""},null,null,"","",null,"",""]
[null,null,null,null,null,{"$f":"IF(C212=0,\"\",(VLOOKUP(E212,NEW_DATA!$D$2:$E$2000,2,FALSE)))","v":""},null,null,"","",null,"",""]
[null,null,null,null,null,{"$f":"IF(C213=0,\"\",(VLOOKUP(E213,NEW_DATA!$D$2:$E$2000,2,FALSE)))","v":""},null,null,"","",null,"",""]
[null,null,null,null,null,{"$f":"IF(C214=0,\"\",(VLOOKUP(E214,NEW_DATA!$D$2:$E$2000,2,FALSE)))","v":""},null,null,"","",null,"",""]
[null,null,null,null,null,{"$f":"IF(C215=0,\"\",(VLOOKUP(E215,NEW_DATA!$D$2:$E$2000,2,FALSE)))","v":""},null,null,"","",null,"",""]
[null,null,null,null,null,{"$f":"IF(C216=0,\"\",(VLOOKUP(E216,NEW_DATA!$D$2:$E$2000,2,FALSE)))","v":""},null,null,"","",null,"",""]
[null,null,null,null,null,{"$f":"IF(C217=0,\"\",(VLOOKUP(E217,NEW_DATA!$D$2:$E$2000,2,FALSE)))","v":""},null,null,"","",null,"",""]
[null,null,null,null,null,{"$f":"IF(C218=0,\"\",(VLOOKUP(E218,NEW_DATA!$D$2:$E$2000,2,FALSE)))","v":""},null,null,"","",null,"",""]
[null,null,null,null,null,{"$f":"IF(C219=0,\"\",(VLOOKUP(E219,NEW_DATA!$D$2:$E$2000,2,FALSE)))","v":""},null,null,"","",null,"",""]
[null,null,null,null,null,{"$f":"IF(C220=0,\"\",(VLOOKUP(E220,NEW_DATA!$D$2:$E$2000,2,FALSE)))","v":""},null,null,"","",null,"",""]
[null,null,null,null,null,{"$f":"IF(C221=0,\"\",(VLOOKUP(E221,NEW_DATA!$D$2:$E$2000,2,FALSE)))","v":""},null,null,"","",null,"",""]
[null,null,null,null,null,{"$f":"IF(C222=0,\"\",(VLOOKUP(E222,NEW_DATA!$D$2:$E$2000,2,FALSE)))","v":""},null,null,"","",null,"",""]
["TOTAL AUM/AUD FOR UNIT :",null,null,null,null,null,null,null,null,null,null,null,null,{"$f":"SUM(N6:N222)","v":712.54396929824577},{"$f":"SUM(O6:O222)","v":21376.919078947369}]
["COMMENTS:"]

{"sheet":"NE-CPA-17B","index":4,"n_rows":224,"n_cols":16,"rows_kept":224,"cut":false,"hidden":false,"merged":[[3,8,4,8],[0,4,0,12],[1,3,1,12],[1,13,1,14],[2,0,2,3],[2,4,2,7],[2,8,2,9],[2,10,2,14],[3,0,3,1],[3,3,4,3],[3,5,4,5],[3,6,4,6],[3,7,4,7],[222,0,222,12],[223,0,223,1],[223,3,223,14],[2,15,2,20],[0,15,1,20],[3,15,4,18],[5,15,12,18],[13,15,21,18],[22,15,24,18],[25,15,26,18],[3,9,4,9],[3,10,4,10],[3,11,4,11],[3,12,4,12],[3,13,4,13],[3,14,4,14]]}
[null,null,null,null,"NEBRASKA PRESCRIBED GRAZING IMPLEMENTATION REQUIRMENTS - NE-CPA-17B",null,null,null,null,null,null,null,null,null,null,"NOTE:  This is one option for displaying the forage inventory; it can be used when clipping has been done to confirm production and it varies significantly from ESD or FSG information"]
[null,null,null,"GRAZINGLAND INVENTORY SUMMARY AND SUGGESTED INITIAL STOCKING RATES BASED ON CLIPPING or ON-SITE PRODUCTION ESTIMATES",null,null,null,null,null,null,null,null,null,"Form Date: November, 2020"]
["CLIENT:",null,null,null,"Mary Rancher, Sunnyvale Ranch",null,null,null,"DATE:",null,"2020-11-12",null,null,null,null,"List all ecological sites in each pasture, and identify the plant community/communities present in each pasture."]
["PASTURE",null,null,"ECOLOGICAL SITE","PLANT COMMUNITY","Pounds Production Measured and Reconstructed On-Site","Planned Harvest Efficiency","Acres site-community combination","AUM/ac   ","AUM for Site","Adj. Factor*","Adjusted AUM for Site","Adjusted AUD for Site","AUM for Pasture","AUD for Pasture","Use copy/paste to enter multiple entries for MLRA, ecological site, plant communities, etc."]
["No.","ACRES","MLRA",null,"List Dominant Plants Found on Site"]
["R7",150,"MLRA_67A","Saline_Subirrigated_67A","Tall Wheatgrass, saltgrass, annuals",2200,0.3,150,{"$f":"IF(F6=0,\"\",(F6/912*G6))","v":0.72368421052631582},{"$f":"IF(F6=0,\"\",H6*I6)","v":108.55263157894737},0.8,{"$f":"IF(F6=0,\"\",J6*K6)","v":86.842105263157904},{"$f":"IF(F6=0,\"\",L6*30)","v":2605.2631578947371},86.8,2605.3000000000002,"Adjustment Factor:  Use this to account for necessary reductions in production due to tree cover, rock cover, areas too steep to graze, or other factors that reduce grazable production.  For example:  Grasses are similar to community 1.2, but there is 30% cedar cover; use adjustment factor of 0.7 (70% of typical forage production for the community).  If no reductions are needed use 1.0.  "]
[null,null,null,null,null,null,null,null,{"$f":"IF(F7=0,\"\",(F7/912*G7))","v":""},{"$f":"IF(F7=0,\"\",H7*I7)","v":""},null,{"$f":"IF(F7=0,\"\",J7*K7)","v":""},{"$f":"IF(F7=0,\"\",L7*30)","v":""}]
["R8",195,"MLRA_67A","Subirrigated_67A","Reed canarygrass",5200,0.3,195,1.7105263157894737,333.55263157894734,1,333.55263157894734,10006.57894736842,333.6,10006.6]
[null,null,null,null,null,null,null,null,"","",null,"",""]
[null,null,null,null,null,null,null,null,"","",null,"",""]
[null,null,null,null,null,null,null,null,"","",null,"",""]
[null,null,null,null,null,null,null,null,"","",null,"",""]
[null,null,null,null,null,null,null,null,"","",null,"",""]
[null,null,null,null,null,null,null,null,"","",null,"","",null,null,"Since every pasture will contain a different number of site/community combinations, manually calculate AUM and AUD.  To speed the process you can use the excel formula:  =SUM(LX:LY) and =SUM(MX:MY) where X is the row number for the first cell number for the pasture and Y is the row number for the second cell number for the pasture. (Click in the cells of the example to see formula)."]
[null,null,null,null,null,null,null,null,"","",null,"",""]
[null,null,null,null,null,null,null,null,"","",null,"",""]
[null,null,null,null,null,null,null,null,"","",null,"",""]
[null,null,null,null,null,null,null,null,"","",null,"",""]
[null,null,null,null,null,null,null,null,"","",null,"",""]
[null,null,null,null,null,null,null,null,"","",null,"",""]
[null,null,null,null,null,null,null,null,"","",null,"",""]
[null,null,null,null,null,null,null,null,"","",null,"",""]
[null,null,null,null,null,null,null,null,"","",null,"","",null,null,"After entering information for all pastures, hide unneeded rows in order to clean up the printout."]
[null,null,null,null,null,null,null,null,"","",null,"",""]
[null,null,null,null,null,null,null,null,"","",null,"",""]
[null,null,null,null,null,null,null,null,"","",null,"","",null,null,"Insert page breaks so that page breaks do not break up data for individual pastures."]
[null,null,null,null,null,null,null,null,"","",null,"",""]
[null,null,null,null,null,null,null,null,"","",null,"",""]
[null,null,null,null,null,null,null,null,"","",null,"",""]
[null,null,null,null,null,null,null,null,"","",null,"",""]
[null,null,null,null,null,null,null,null,"","",null,"",""]
[null,null,null,null,null,null,null,null,"","",null,"",""]
[null,null,null,null,null,null,null,null,"","",null,"",""]
[null,null,null,null,null,null,null,null,"","",null,"",""]
[null,null,null,null,null,null,null,null,"","",null,"",""]
[null,null,null,null,null,null,null,null,"","",null,"",""]
[null,null,null,null,null,null,null,null,"","",null,"",""]
[null,null,null,null,null,null,null,null,"","",null,"",""]
[null,null,null,null,null,null,null,null,"","",null,"",""]
[null,null,null,null,null,null,null,null,"","",null,"",""]
[null,null,null,null,null,null,null,null,"","",null,"",""]
[null,null,null,null,null,null,null,null,"","",null,"",""]
[null,null,null,null,null,null,null,null,"","",null,"",""]
[null,null,null,null,null,null,null,null,"","",null,"",""]
[null,null,null,null,null,null,null,null,"","",null,"",""]
[null,null,null,null,null,null,null,null,"","",null,"",""]
[null,null,null,null,null,null,null,null,"","",null,"",""]
[null,null,null,null,null,null,null,null,"","",null,"",""]
[null,null,null,null,null,null,null,null,"","",null,"",""]
[null,null,null,null,null,null,null,null,"","",null,"",""]
[null,null,null,null,null,null,null,null,"","",null,"",""]
[null,null,null,null,null,null,null,null,"","",null,"",""]
[null,null,null,null,null,null,null,null,"","",null,"",""]
[null,null,null,null,null,null,null,null,"","",null,"",""]
[null,null,null,null,null,null,null,null,"","",null,"",""]
[null,null,null,null,null,null,null,null,"","",null,"",""]
[null,null,null,null,null,null,null,null,"","",null,"",""]
[null,null,null,null,null,null,null,null,"","",null,"",""]
[null,null,null,null,null,null,null,null,"","",null,"",""]
[null,null,null,null,null,null,null,null,"","",null,"",""]
[null,null,null,null,null,null,null,null,"","",null,"",""]
[null,null,null,null,null,null,null,null,"","",null,"",""]
[null,null,null,null,null,null,null,null,"","",null,"",""]
[null,null,null,null,null,null,null,null,"","",null,"",""]
[null,null,null,null,null,null,null,null,"","",null,"",""]
[null,null,null,null,null,null,null,null,"","",null,"",""]
[null,null,null,null,null,null,null,null,"","",null,"",""]
[null,null,null,null,null,null,null,null,"","",null,"",""]
[null,null,null,null,null,null,null,null,"","",null,"",""]
[null,null,null,null,null,null,null,null,"","",null,"",""]
[null,null,null,null,null,null,null,null,{"$f":"IF(F71=0,\"\",(F71/912*G71))","v":""},{"$f":"IF(F71=0,\"\",H71*I71)","v":""},null,{"$f":"IF(F71=0,\"\",J71*K71)","v":""},{"$f":"IF(F71=0,\"\",L71*30)","v":""}]
[null,null,null,null,null,null,null,null,"","",null,"",""]
[null,null,null,null,null,null,null,null,"","",null,"",""]
[null,null,null,null,null,null,null,null,"","",null,"",""]
[null,null,null,null,null,null,null,null,"","",null,"",""]
[null,null,null,null,null,null,null,null,"","",null,"",""]
[null,null,null,null,null,null,null,null,"","",null,"",""]
[null,null,null,null,null,null,null,null,"","",null,"",""]
[null,null,null,null,null,null,null,null,"","",null,"",""]
[null,null,null,null,null,null,null,null,"","",null,"",""]
[null,null,null,null,null,null,null,null,"","",null,"",""]
[null,null,null,null,null,null,null,null,"","",null,"",""]
[null,null,null,null,null,null,null,null,"","",null,"",""]
[null,null,null,null,null,null,null,null,"","",null,"",""]
[null,null,null,null,null,null,null,null,"","",null,"",""]
[null,null,null,null,null,null,null,null,"","",null,"",""]
[null,null,null,null,null,null,null,null,"","",null,"",""]
[null,null,null,null,null,null,null,null,"","",null,"",""]
[null,null,null,null,null,null,null,null,"","",null,"",""]
[null,null,null,null,null,null,null,null,"","",null,"",""]
[null,null,null,null,null,null,null,null,"","",null,"",""]
[null,null,null,null,null,null,null,null,"","",null,"",""]
[null,null,null,null,null,null,null,null,"","",null,"",""]
[null,null,null,null,null,null,null,null,"","",null,"",""]
[null,null,null,null,null,null,null,null,"","",null,"",""]
[null,null,null,null,null,null,null,null,"","",null,"",""]
[null,null,null,null,null,null,null,null,"","",null,"",""]
[null,null,null,null,null,null,null,null,"","",null,"",""]
[null,null,null,null,null,null,null,null,"","",null,"",""]
[null,null,null,null,null,null,null,null,"","",null,"",""]
[null,null,null,null,null,null,null,null,"","",null,"",""]
[null,null,null,null,null,null,null,null,"","",null,"",""]
[null,null,null,null,null,null,null,null,"","",null,"",""]
[null,null,null,null,null,null,null,null,"","",null,"",""]
[null,null,null,null,null,null,null,null,"","",null,"",""]
[null,null,null,null,null,null,null,null,"","",null,"",""]
[null,null,null,null,null,null,null,null,"","",null,"",""]
[null,null,null,null,null,null,null,null,"","",null,"",""]
[null,null,null,null,null,null,null,null,"","",null,"",""]
[null,null,null,null,null,null,null,null,"","",null,"",""]
[null,null,null,null,null,null,null,null,"","",null,"",""]
[null,null,null,null,null,null,null,null,"","",null,"",""]
[null,null,null,null,null,null,null,null,"","",null,"",""]
[null,null,null,null,null,null,null,null,"","",null,"",""]
[null,null,null,null,null,null,null,null,"","",null,"",""]
[null,null,null,null,null,null,null,null,"","",null,"",""]
[null,null,null,null,null,null,null,null,"","",null,"",""]
[null,null,null,null,null,null,null,null,"","",null,"",""]
[null,null,null,null,null,null,null,null,"","",null,"",""]
[null,null,null,null,null,null,null,null,"","",null,"",""]
[null,null,null,null,null,null,null,null,"","",null,"",""]
[null,null,null,null,null,null,null,null,"","",null,"",""]
[null,null,null,null,null,null,null,null,"","",null,"",""]
[null,null,null,null,null,null,null,null,"",{"$f":"IF(F124=0,\"\",H124*I124)","v":""},null,"",""]
[null,null,null,null,null,null,null,null,"","",null,"",""]
[null,null,null,null,null,null,null,null,"","",null,"",""]
[null,null,null,null,null,null,null,null,"","",null,"",""]
[null,null,null,null,null,null,null,null,"","",null,"",""]
[null,null,null,null,null,null,null,null,"","",null,"",""]
[null,null,null,null,null,null,null,null,"","",null,"",""]
[null,null,null,null,null,null,null,null,"","",null,"",""]
[null,null,null,null,null,null,null,null,"","",null,"",""]
[null,null,null,null,null,null,null,null,"","",null,"",""]
[null,null,null,null,null,null,null,null,"","",null,"",""]
[null,null,null,null,null,null,null,null,{"$f":"IF(F135=0,\"\",(F135/912*G135))","v":""},"",null,{"$f":"IF(F135=0,\"\",J135*K135)","v":""},{"$f":"IF(F135=0,\"\",L135*30)","v":""}]
[null,null,null,null,null,null,null,null,"","",null,"",""]
[null,null,null,null,null,null,null,null,"","",null,"",""]
[null,null,null,null,null,null,null,null,"","",null,"",""]
[null,null,null,null,null,null,null,null,"","",null,"",""]
[null,null,null,null,null,null,null,null,"","",null,"",""]
[null,null,null,null,null,null,null,null,"","",null,"",""]
[null,null,null,null,null,null,null,null,"","",null,"",""]
[null,null,null,null,null,null,null,null,"","",null,"",""]
[null,null,null,null,null,null,null,null,"","",null,"",""]
[null,null,null,null,null,null,null,null,"","",null,"",""]
[null,null,null,null,null,null,null,null,"","",null,"",""]
[null,null,null,null,null,null,null,null,"","",null,"",""]
[null,null,null,null,null,null,null,null,"","",null,"",""]
[null,null,null,null,null,null,null,null,"","",null,"",""]
[null,null,null,null,null,null,null,null,"","",null,"",""]
[null,null,null,null,null,null,null,null,"","",null,"",""]
[null,null,null,null,null,null,null,null,"","",null,"",""]
[null,null,null,null,null,null,null,null,"","",null,"",""]
[null,null,null,null,null,null,null,null,"","",null,"",""]
[null,null,null,null,null,null,null,null,"","",null,"",""]
[null,null,null,null,null,null,null,null,"","",null,"",""]
[null,null,null,null,null,null,null,null,"","",null,"",""]
[null,null,null,null,null,null,null,null,"","",null,"",""]
[null,null,null,null,null,null,null,null,"","",null,"",""]
[null,null,null,null,null,null,null,null,"","",null,"",""]
[null,null,null,null,null,null,null,null,"","",null,"",""]
[null,null,null,null,null,null,null,null,"","",null,"",""]
[null,null,null,null,null,null,null,null,"","",null,"",""]
[null,null,null,null,null,null,null,null,"","",null,"",""]
[null,null,null,null,null,null,null,null,"","",null,"",""]
[null,null,null,null,null,null,null,null,"","",null,"",""]
[null,null,null,null,null,null,null,null,"","",null,"",""]
[null,null,null,null,null,null,null,null,"","",null,"",""]
[null,null,null,null,null,null,null,null,"","",null,"",""]
[null,null,null,null,null,null,null,null,"","",null,"",""]
[null,null,null,null,null,null,null,null,"","",null,"",""]
[null,null,null,null,null,null,null,null,"","",null,"",""]
[null,null,null,null,null,null,null,null,"","",null,"",""]
[null,null,null,null,null,null,null,null,"","",null,"",""]
[null,null,null,null,null,null,null,null,"","",null,"",""]
[null,null,null,null,null,null,null,null,"","",null,"",""]
[null,null,null,null,null,null,null,null,"","",null,"",""]
[null,null,null,null,null,null,null,null,"","",null,"",""]
[null,null,null,null,null,null,null,null,"","",null,"",""]
[null,null,null,null,null,null,null,null,"","",null,"",""]
[null,null,null,null,null,null,null,null,"","",null,"",""]
[null,null,null,null,null,null,null,null,"","",null,"",""]
[null,null,null,null,null,null,null,null,"","",null,"",""]
[null,null,null,null,null,null,null,null,"","",null,"",""]
[null,null,null,null,null,null,null,null,"","",null,"",""]
[null,null,null,null,null,null,null,null,"","",null,"",""]
[null,null,null,null,null,null,null,null,"","",null,"",""]
[null,null,null,null,null,null,null,null,"",{"$f":"IF(F188=0,\"\",H188*I188)","v":""},null,"",""]
[null,null,null,null,null,null,null,null,"","",null,"",""]
[null,null,null,null,null,null,null,null,"","",null,"",""]
[null,null,null,null,null,null,null,null,"","",null,"",""]
[null,null,null,null,null,null,null,null,"","",null,"",""]
[null,null,null,null,null,null,null,null,"","",null,"",""]
[null,null,null,null,null,null,null,null,"","",null,"",""]
[null,null,null,null,null,null,null,null,"","",null,"",""]
[null,null,null,null,null,null,null,null,"","",null,"",""]
[null,null,null,null,null,null,null,null,"","",null,"",""]
[null,null,null,null,null,null,null,null,"","",null,"",""]
[null,null,null,null,null,null,null,null,{"$f":"IF(F199=0,\"\",(F199/912*G199))","v":""},"",null,{"$f":"IF(F199=0,\"\",J199*K199)","v":""},{"$f":"IF(F199=0,\"\",L199*30)","v":""}]
[null,null,null,null,null,null,null,null,"","",null,"",""]
[null,null,null,null,null,null,null,null,"","",null,"",""]
[null,null,null,null,null,null,null,null,"","",null,"",""]
[null,null,null,null,null,null,null,null,"","",null,"",""]
[null,null,null,null,null,null,null,null,"","",null,"",""]
[null,null,null,null,null,null,null,null,"","",null,"",""]
[null,null,null,null,null,null,null,null,"","",null,"",""]
[null,null,null,null,null,null,null,null,"","",null,"",""]
[null,null,null,null,null,null,null,null,"","",null,"",""]
[null,null,null,null,null,null,null,null,"","",null,"",""]
[null,null,null,null,null,null,null,null,"","",null,"",""]
[null,null,null,null,null,null,null,null,"","",null,"",""]
[null,null,null,null,null,null,null,null,"","",null,"",""]
[null,null,null,null,null,null,null,null,"","",null,"",""]
[null,null,null,null,null,null,null,null,"","",null,"",""]
[null,null,null,null,null,null,null,null,"","",null,"",""]
[null,null,null,null,null,null,null,null,"","",null,"",""]
[null,null,null,null,null,null,null,null,"","",null,"",""]
[null,null,null,null,null,null,null,null,"","",null,"",""]
[null,null,null,null,null,null,null,null,"","",null,"",""]
[null,null,null,null,null,null,null,null,"","",null,"",""]
[null,null,null,null,null,null,null,null,"","",null,"",""]
[null,null,null,null,null,null,null,null,"",{"$f":"IF(F222=0,\"\",H222*I222)","v":""},null,"",""]
["TOTAL AUM/AUD FOR UNIT :  ",null,null,null,null,null,null,null,null,null,null,null,null,{"$f":"SUM(N6:N222)","v":420.40000000000003},{"$f":"SUM(O6:O222)","v":12611.900000000001}]
["COMMENTS:"]

{"sheet":"Grazing Schedule Option 1-Auto","index":5,"n_rows":479,"n_cols":57,"rows_kept":479,"cut":false,"hidden":false,"merged":[[25,56,26,59],[27,56,33,59],[18,0,18,5],[18,6,18,14],[18,16,18,25],[18,27,18,42],[22,15,22,18],[43,0,43,1],[20,1,22,1],[20,2,22,2],[21,3,22,3],[22,11,22,14],[22,7,22,10],[44,0,49,1],[3,0,3,54],[6,0,6,54],[5,0,5,54],[4,0,4,54],[44,2,49,54],[21,4,22,4],[21,5,22,5],[20,6,20,54],[21,31,21,34],[21,35,21,38],[21,39,21,42],[21,43,21,46],[9,2,9,54],[10,2,10,54],[14,2,14,54],[12,2,12,54],[8,2,8,54],[17,0,17,3],[17,4,17,21],[17,22,17,25],[15,2,15,54],[16,2,16,54],[13,2,13,54],[17,26,17,31],[17,34,17,41],[17,42,17,54],[2,0,2,54],[0,0,0,54],[1,0,1,54],[7,0,7,54],[11,2,11,54],[19,0,19,54],[20,3,20,5],[21,6,22,6],[21,19,21,22],[21,23,21,26],[21,27,21,30],[20,0,22,0],[22,51,22,54],[22,47,22,50],[18,56,23,59]]}
["GRAZING MANAGEMENT STRATEGIES"]
["Grazing management systems are planned forage and livestock management programs designed to accomplish range improvement.  A grazing system is developed to maintain or improve range similarity index, productivity, health and vigor while simultaneously achieving a high, sustainable level of livestock production.  "]
["Types of Grazing Systems:  Prescribed grazing is a grazing system which is tailored to the individual operation and designed to achieve the specific objectives of the operation.  To be effective a grazing strategy should be flexible and modified with changes in weather, plant growth and disturbances.  Which every grazing management strategy is implemented, it should allow for adequate recovery time of the primary forage grasses before the pasture, paddock, or grazing unit is grazed again.  Recovery should be based upon the growth of key forage species, and not based solely on the days of rest or the calendar.  There are several general types of grazing management systems:"]
["1.  Rest Rotation:  In a rest rotation grazing management system, one or more pastures are left ungrazed for the entire growing season.  Each year a different pasture(s) is ungrazed; in other words, the rest is rotated.  Incorporating rest so that each pasture is ungrazed once every 5-7 years builds in resilience, aids in drought recovery and provides wildlife habitat.  Stocking rates should be adjusted to account for the forage that is unavailable each year.  Often times, a rest rotation is coupled with a deferred rotation rather than grazed pastures being grazed season long."]
["2.  Deferred Rotation:  In a deferred rotation grazing management system, a herd is rotated through three or more pastures.  While one pasture is being grazed, the remaining pastures are not grazed (deferred).  The pastures are grazed in a planned sequence.  The sequence of grazing is changed each year to make certain that the grasses are not being grazed during the same time in the growing season in consecutive years.  "]
["3.  High Intensity/Low Frequency Rotation: In a high intensity/low frequency rotation grazing management system, one herd of livestock grazes eight or more pastures in a planned sequence. Livestock are moved into one pasture and the other pastures are rested. When the forage is grazed to the desired intensity, livestock are moved to the next pasture in the rotation. Livestock typically stay in a pasture 10 to 25 days. The frequent moves allow long rest periods for each pasture.  The sequence of grazing is changed each year.  Depending upon production and precipitation, pastures may be grazed once per growing season, or more than once per growing season.  "]
["4.  Short-duration. (Management Intensive Grazing.) This is similar to the high intensity/low frequency system, except the speed of the rotation is adjusted according to the growth rate and the required rest period of the plants. During the peak of the growing season, livestock are moved rapidly with slower moves when pasture growth rate slow down.  In some systems, livestock are moved every 3-5 days or more frequently.  Mob grazing is a variation of this type of grazing strategy.  With mob grazing, stock density is very high and moves may be as often as 3 or more times per day and paddocks are temporary and are in different locations each time the unit is grazed.  Usually, each paddock is grazed only one time per year."]
["Purpose of prescribed grazing management systems:"]
[null,"¨","Maintain or speed up improvement in plant cover while properly using the forage in all pastures."]
[null,"¨","Improve efficiency of grazing by uniformly using all parts of each grazed pasture."]
[null,"¨","Permit a higher level of livestock production."]
[null,"¨","Insure a supply of forage throughout the grazing season."]
[null,"¨","Insure that an adequate feed and forage balance is maintained for the unit."]
[null,"¨","Improve control of undesirable plants."]
[null,"¨","Allow easier handling and observation of livestock."]
[null,"¨","Enhance wildlife habitat."]
[null,"¨","Enhance watershed protection."]
["CLIENT NAME:",null,null,null,{"$f":"NEW_528_Forage_Balance!C2","v":"Mary Rancher - Sunnyvale Ranch"},null,null,null,null,null,null,null,null,null,null,null,null,null,null,null,null,null,"YEAR",null,null,null,"1905-07-13",null,null,null,null,null,null,null,"CONTRACT NO:",null,null,null,null,null,null,null,{"$f":"NEW_528_Forage_Balance!R2","v":"12345K"}]
["LENGTH GRAZING SEASON (DAYS):",null,null,null,null,null,{"$f":"NEW_528_Forage_Balance!Q68","v":195},null,null,null,null,null,null,null,null,null,"Planned Grazing Dates:",null,null,null,null,null,null,null,null,null,null,"May 1 - November 15",null,null,null,null,null,null,null,null,null,null,null,null,null,null,null,null,null,null,null,null,null,null,null,null,null,null,null,null,"This type of schedule is appropriate for smaller systems - for systems with more pastures, use a different scheduler.  If the bars are not lining up correctly, left-click in the middle of the boxes.  A text box should appear; drag the box so that it lines up correctly."]
[]
["Field no. ","Forage Type","Acres","AUM Information",null,null,"Dates are approximate - actual moves should be based upon plant growth which will vary from year to year"]
[null,null,null,"Estimated AUM or AUD for field","% AUM or AUD by field","Est. Days / Field","Start  Date",null,null,null,null,null,null,null,null,null,null,null,null,"April  (week)",null,null,null,"May  (week)",null,null,null,"June  (week)",null,null,null,"July (week)",null,null,null,"August  (week)",null,null,null,"Sept. (week)",null,null,null,"October  (week)"]
[null,null,null,null,null,null,null,"Jan",null,null,null,"Feb",null,null,null,"Mar",null,null,null,1,2,3,4,1,2,3,4,1,2,3,4,1,2,3,4,1,2,3,4,1,2,3,4,1,2,3,4,"Nov",null,null,null,"Dec"]
[{"$f":"NEW_528_Forage_Balance!G69","v":"R1A"},{"$f":"IF(A24=0,\"\",(NEW_528_Forage_Balance!I69))","v":"Range"},{"$f":"IF(A24=0,\"\",(NEW_528_Forage_Balance!H69))","v":305},{"$f":"IF(A24=0,\"\",(NEW_528_Forage_Balance!L69))","v":115},{"$f":"IF(A24=0,\"\", D24/D44*100)","v":16.129032258064516},{"$f":"IF(A24=0,\"\",$G$19* E24/100)","v":31.451612903225804},"Ma1"]
[{"$f":"NEW_528_Forage_Balance!G70","v":"R1B"},{"$f":"IF(A25=0,\"\",(NEW_528_Forage_Balance!I70))","v":"Range"},{"$f":"IF(A25=0,\"\",(NEW_528_Forage_Balance!H70))","v":335},{"$f":"IF(A25=0,\"\",(NEW_528_Forage_Balance!L70))","v":92},{"$f":"IF(A25=0,\"\", D25/D44*100)","v":12.903225806451612},25.161290322580644,"Jn1"]
[{"$f":"NEW_528_Forage_Balance!G71","v":"R2"},{"$f":"IF(A26=0,\"\",(NEW_528_Forage_Balance!I71))","v":"Range"},{"$f":"IF(A26=0,\"\",(NEW_528_Forage_Balance!H71))","v":320},{"$f":"IF(A26=0,\"\",(NEW_528_Forage_Balance!L71))","v":122},{"$f":"IF(A26=0,\"\", D26/D44*100)","v":17.110799438990181},33.366058906030851,"Jn4",null,null,null,null,null,null,null,null,null,null,null,null,null,null,null,null,null,null,null,null,null,null,null,null,null,null,null,null,null,null,null,null,null,null,null,null,null,null,null,null,null,null,null,null,null,null,null,null,null,"Enter the planned dates.  For example, May 1 - Sept 30."]
[{"$f":"NEW_528_Forage_Balance!G72","v":"R3"},{"$f":"IF(A27=0,\"\",(NEW_528_Forage_Balance!I72))","v":"Range"},{"$f":"IF(A27=0,\"\",(NEW_528_Forage_Balance!H72))","v":80},{"$f":"IF(A27=0,\"\",(NEW_528_Forage_Balance!L72))","v":35},{"$f":"IF(A27=0,\"\", D27/D44 *100)","v":4.9088359046283312},9.5722300140252461,"Oc4"]
[{"$f":"NEW_528_Forage_Balance!G73","v":"R4"},{"$f":"IF(A28=0,\"\",(NEW_528_Forage_Balance!I73))","v":"Range"},{"$f":"IF(A28=0,\"\",(NEW_528_Forage_Balance!H73))","v":160},{"$f":"IF(A28=0,\"\",(NEW_528_Forage_Balance!L73))","v":58},{"$f":"IF(A28=0, \"\", D28/D44*100)","v":8.1346423562412333},15.862552594670406,"Oc2",null,null,null,null,null,null,null,null,null,null,null,null,null,null,null,null,null,null,null,null,null,null,null,null,null,null,null,null,null,null,null,null,null,null,null,null,null,null,null,null,null,null,null,null,null,null,null,null,null,"In the start date column, select the week that grazing will begin in the selected pasture.  For example if pasture R1 will be grazed beginning on 5/15, select Ma3 (3rd week of May).  Schedule each pasture by selecting the week that grazing will begin in that pasture."]
[{"$f":"NEW_528_Forage_Balance!G74","v":"R5A"},{"$f":"IF(A29=0,\"\",(NEW_528_Forage_Balance!I74))","v":"Range"},{"$f":"IF(A29=0,\"\",(NEW_528_Forage_Balance!H74))","v":240},{"$f":"IF(A29=0,\"\",(NEW_528_Forage_Balance!L74))","v":66},{"$f":"IF(A29=0,\"\", D29/D44*100)","v":9.2566619915848527},18.050490883590463,"Se4"]
[{"$f":"NEW_528_Forage_Balance!G75","v":"R5B"},{"$f":"IF(A30=0,\"\",(NEW_528_Forage_Balance!I75))","v":"Range"},{"$f":"IF(A30=0,\"\",(NEW_528_Forage_Balance!H75))","v":263},{"$f":"IF(A30=0,\"\",(NEW_528_Forage_Balance!L75))","v":106},{"$f":"IF(A30=0,\"\", D30/D44*100)","v":14.866760168302944},28.990182328190741,"Jy4"]
[{"$f":"NEW_528_Forage_Balance!G76","v":"R5C"},{"$f":"IF(A31=0,\"\",(NEW_528_Forage_Balance!I76))","v":"Range"},{"$f":"IF(A31=0,\"\",(NEW_528_Forage_Balance!H76))","v":137},{"$f":"IF(A31=0,\"\",(NEW_528_Forage_Balance!L76))","v":29},{"$f":"IF(A31=0,\"\", D31/D44*100)","v":4.0673211781206167},7.9312762973352031,"Nov"]
[{"$f":"NEW_528_Forage_Balance!G77","v":"R6"},{"$f":"IF(A32=0,\"\",(NEW_528_Forage_Balance!I77))","v":"Range"},{"$f":"IF(A32=0,\"\",(NEW_528_Forage_Balance!H77))","v":160},{"$f":"IF(A32=0,\"\",(NEW_528_Forage_Balance!L77))","v":90},{"$f":"IF(A32=0,\"\", D32/D44*100)","v":12.622720897615707},24.614305750350628,"Ag4"]
[{"$f":"NEW_528_Forage_Balance!G78","v":0},{"$f":"IF(A33=0,\"\",(NEW_528_Forage_Balance!I78))","v":""},{"$f":"IF(A33=0,\"\",(NEW_528_Forage_Balance!H78))","v":""},{"$f":"IF(A33=0,\"\",(NEW_528_Forage_Balance!L78))","v":""},{"$f":"IF(A33=0,\"\", D33/D44*100)","v":""},""]
[{"$f":"NEW_528_Forage_Balance!G79","v":0},{"$f":"IF(A34=0,\"\",(NEW_528_Forage_Balance!I79))","v":""},{"$f":"IF(A34=0,\"\",(NEW_528_Forage_Balance!H79))","v":""},{"$f":"IF(A34=0,\"\",(NEW_528_Forage_Balance!L79))","v":""},{"$f":"IF(A34=0,\"\", D34/D44*100)","v":""},""]
[{"$f":"NEW_528_Forage_Balance!G80","v":0},{"$f":"IF(A35=0,\"\",(NEW_528_Forage_Balance!I80))","v":""},{"$f":"IF(A35=0,\"\",(NEW_528_Forage_Balance!H80))","v":""},{"$f":"IF(A35=0,\"\",(NEW_528_Forage_Balance!L80))","v":""},{"$f":"IF(A35=0,\"\", D35/D44*100)","v":""},""]
[{"$f":"NEW_528_Forage_Balance!G81","v":0},{"$f":"IF(A36=0,\"\",(NEW_528_Forage_Balance!I81))","v":""},{"$f":"IF(A36=0,\"\",(NEW_528_Forage_Balance!H81))","v":""},{"$f":"IF(A36=0,\"\",(NEW_528_Forage_Balance!L81))","v":""},{"$f":"IF(A36=0, \"\", D36/D44*100)","v":""},""]
[{"$f":"NEW_528_Forage_Balance!G82","v":0},{"$f":"IF(A37=0,\"\",(NEW_528_Forage_Balance!I82))","v":""},{"$f":"IF(A37=0,\"\",(NEW_528_Forage_Balance!H82))","v":""},{"$f":"IF(A37=0,\"\",(NEW_528_Forage_Balance!L82))","v":""},{"$f":"IF(A37=0, \"\", D37/D44*100)","v":""},""]
[{"$f":"NEW_528_Forage_Balance!G83","v":0},{"$f":"IF(A38=0,\"\",(NEW_528_Forage_Balance!I83))","v":""},{"$f":"IF(A38=0,\"\",(NEW_528_Forage_Balance!H83))","v":""},{"$f":"IF(A38=0,\"\",(NEW_528_Forage_Balance!L83))","v":""},{"$f":"IF(A38=0,\"\", D38/D44*100)","v":""},""]
[{"$f":"NEW_528_Forage_Balance!G84","v":0},{"$f":"IF(A39=0,\"\",(NEW_528_Forage_Balance!I84))","v":""},{"$f":"IF(A39=0,\"\",(NEW_528_Forage_Balance!H84))","v":""},{"$f":"IF(A39=0,\"\",(NEW_528_Forage_Balance!L84))","v":""},{"$f":"IF(A39=0,\"\", D39/D44*100)","v":""},""]
[{"$f":"NEW_528_Forage_Balance!G85","v":0},{"$f":"IF(A40=0,\"\",(NEW_528_Forage_Balance!I85))","v":""},{"$f":"IF(A40=0,\"\",(NEW_528_Forage_Balance!H85))","v":""},{"$f":"IF(A40=0,\"\",(NEW_528_Forage_Balance!L85))","v":""},{"$f":"IF(A40=0,\"\", D40/D44*100)","v":""},""]
[{"$f":"NEW_528_Forage_Balance!G86","v":0},{"$f":"IF(A41=0,\"\",(NEW_528_Forage_Balance!I86))","v":""},{"$f":"IF(A41=0,\"\",(NEW_528_Forage_Balance!H86))","v":""},{"$f":"IF(A41=0,\"\",(NEW_528_Forage_Balance!L86))","v":""},{"$f":"IF(A41=0, \"\", D41/D44*100)","v":""},""]
[{"$f":"NEW_528_Forage_Balance!G87","v":0},{"$f":"IF(A42=0,\"\",(NEW_528_Forage_Balance!I87))","v":""},{"$f":"IF(A42=0,\"\",(NEW_528_Forage_Balance!H87))","v":""},{"$f":"IF(A42=0,\"\",(NEW_528_Forage_Balance!L87))","v":""},{"$f":"IF(A42=0, \"\", D42/D44*100)","v":""},""]
[{"$f":"NEW_528_Forage_Balance!G88","v":0},{"$f":"IF(A43=0,\"\",(NEW_528_Forage_Balance!I88))","v":""},{"$f":"IF(A43=0,\"\",(NEW_528_Forage_Balance!H88))","v":""},{"$f":"IF(A43=0,\"\",(NEW_528_Forage_Balance!L88))","v":""},{"$f":"IF(A43=0, \"\", D43/D44*100)","v":""},""]
["TOTAL",null,{"$f":"SUM(C24:C43)","v":2000},{"$f":"SUM(D24:D43)","v":713},{"$f":"SUM(E24:E43)","v":100},{"$f":"SUM(F24:F43)","v":195.00000000000003}]
["Comments:"]
[]
[]
[]
[]
[]
[]
[]
[]
[]
[]
[]
[]
[]
[]
[]
[]
[]
[]
[]
[]
[]
[]
[]
[]
[]
[]
[]
[]
[]
[]
[]
[]
[]
[]
[]
[]
[]
[]
[]
[]
[]
[]
[]
[]
[]
[]
[]
[]
[]
[]
[]
[]
[]
[]
[]
[]
[]
[]
[]
[]
[]
[]
[]
[]
[null,null,null,null,null,"Gantt final as of 1/06/2014"]
[null,null,null,null,null,"Do not adjust these values"]
[]
[null,null,null,null,null,"Errors in these ranges are intentional."]
[null,null,null,null,null,null,null,null,null,null,null,null,null,null,null,null,null,null,null,null,null,"start",null,"duration",null,null,null,"start","end"]
[null,null,null,null,null,"Jan",1,"Jan","2014-01-01",1,null,null,null,null,null,null,null,null,null,null,null,{"$f":"VLOOKUP(G24,H115:R479,3,FALSE)","v":122},null,{"$f":"F24","v":31.451612903225804},null,null,null,{"$f":"V115","v":122},{"$f":"SUM(V115,X115)","v":153.45161290322579}]
[null,null,null,null,null,"Feb",2,null,"2014-01-02",2,null,null,null,null,null,null,null,null,null,null,null,{"$f":"VLOOKUP(G25,H116:T480,3,FALSE)","v":153},null,25.161290322580644,null,null,null,153,178.16129032258064]
[null,null,null,null,null,"Mar",3,null,"2014-01-03",3,null,null,null,null,null,null,null,null,null,null,null,175,null,33.366058906030851,null,null,null,175,208.36605890603084]
[null,null,null,null,null,"Ap1",4,null,"2014-01-04",4,null,null,null,null,null,null,null,null,null,null,null,297,null,9.5722300140252461,null,null,null,297,306.57223001402525]
[null,null,null,null,null,"Ap2",5,null,"2014-01-05",5,null,null,null,null,null,null,null,null,null,null,null,282,null,15.862552594670406,null,null,null,282,297.86255259467043]
[null,null,null,null,null,"Ap3",6,null,"2014-01-06",6,null,null,null,null,null,null,null,null,null,null,null,265,null,18.050490883590463,null,null,null,265,283.05049088359044]
[null,null,null,null,null,"Ap4",7,null,"2014-01-07",7,null,null,null,null,null,null,null,null,null,null,null,205,null,28.990182328190741,null,null,null,205,233.99018232819074]
[null,null,null,null,null,"Ma1",8,null,"2014-01-08",8,null,null,null,null,null,null,null,null,null,null,null,305,null,7.9312762973352031,null,null,null,305,312.93127629733522]
[null,null,null,null,null,"Ma2",9,null,"2014-01-09",9,null,null,null,null,null,null,null,null,null,null,null,238,null,24.614305750350628,null,null,null,238,262.61430575035064]
[null,null,null,null,null,"Ma3",10,null,"2014-01-10",10,null,null,null,null,null,null,null,null,null,null,null,{"$error":"#N/A"},null,"",null,null,null,{"$error":"#N/A"},{"$error":"#N/A"}]
[null,null,null,null,null,"Ma4",11,null,"2014-01-11",11,null,null,null,null,null,null,null,null,null,null,null,{"$error":"#N/A"},null,"",null,null,null,{"$error":"#N/A"},{"$error":"#N/A"}]
[null,null,null,null,null,"Jn1",12,null,"2014-01-12",12,null,null,null,null,null,null,null,null,null,null,null,{"$error":"#N/A"},null,"",null,null,null,{"$error":"#N/A"},{"$error":"#N/A"}]
[null,null,null,null,null,"Jn2",13,null,"2014-01-13",13,null,null,null,null,null,null,null,null,null,null,null,{"$error":"#N/A"},null,"",null,null,null,{"$error":"#N/A"},{"$error":"#N/A"}]
[null,null,null,null,null,"Jn3",14,null,"2014-01-14",14,null,null,null,null,null,null,null,null,null,null,null,{"$error":"#N/A"},null,"",null,null,null,{"$error":"#N/A"},{"$error":"#N/A"}]
[null,null,null,null,null,"Jn4",15,null,"2014-01-15",15,null,null,null,null,null,null,null,null,null,null,null,{"$error":"#N/A"},null,"",null,null,null,{"$error":"#N/A"},{"$error":"#N/A"}]
[null,null,null,null,null,"Jy1",16,null,"2014-01-16",16,null,null,null,null,null,null,null,null,null,null,null,{"$error":"#N/A"},null,"",null,null,null,{"$error":"#N/A"},{"$error":"#N/A"}]
[null,null,null,null,null,"Jy2",17,null,"2014-01-17",17,null,null,null,null,null,null,null,null,null,null,null,{"$error":"#N/A"},null,"",null,null,null,{"$error":"#N/A"},{"$error":"#N/A"}]
[null,null,null,null,null,"Jy3",18,null,"2014-01-18",18,null,null,null,null,null,null,null,null,null,null,null,{"$error":"#N/A"},null,"",null,null,null,{"$error":"#N/A"},{"$error":"#N/A"}]
[null,null,null,null,null,"Jy4",19,null,"2014-01-19",19,null,null,null,null,null,null,null,null,null,null,null,{"$error":"#N/A"},null,"",null,null,null,{"$error":"#N/A"},{"$error":"#N/A"}]
[null,null,null,null,null,"Ag1",20,null,"2014-01-20",20,null,null,null,null,null,null,null,null,null,null,null,{"$error":"#N/A"},null,"",null,null,null,{"$error":"#N/A"},{"$error":"#N/A"}]
[null,null,null,null,null,"Ag2",21,null,"2014-01-21",21]
[null,null,null,null,null,"Ag3",22,null,"2014-01-22",22]
[null,null,null,null,null,"Ag4",23,null,"2014-01-23",23]
[null,null,null,null,null,"Se1",24,null,"2014-01-24",24]
[null,null,null,null,null,"Se2",25,null,"2014-01-25",25]
[null,null,null,null,null,"Se3",26,null,"2014-01-26",26]
[null,null,null,null,null,"Se4",27,null,"2014-01-27",27]
[null,null,null,null,null,"Oc1",28,null,"2014-01-28",28]
[null,null,null,null,null,"Oc2",29,null,"2014-01-29",29]
[null,null,null,null,null,"Oc3",30,null,"2014-01-30",30]
[null,null,null,null,null,"Oc4",31,"Feb","2014-01-31",31]
[null,null,null,null,null,"Nov",32,null,"2014-02-01",32]
[null,null,null,null,null,"Dec",33,null,"2014-02-02",33]
[null,null,null,null,null,null,34,null,"2014-02-03",34]
[null,null,null,null,null,null,35,null,"2014-02-04",35]
[null,null,null,null,null,null,36,null,"2014-02-05",36]
[null,null,null,null,null,null,37,null,"2014-02-06",37]
[null,null,null,null,null,null,38,null,"2014-02-07",38]
[null,null,null,null,null,null,39,null,"2014-02-08",39]
[null,null,null,null,null,null,40,null,"2014-02-09",40]
[null,null,null,null,null,null,41,null,"2014-02-10",41]
[null,null,null,null,null,null,42,null,"2014-02-11",42]
[null,null,null,null,null,null,43,null,"2014-02-12",43]
[null,null,null,null,null,null,44,null,"2014-02-13",44]
[null,null,null,null,null,null,45,null,"2014-02-14",45]
[null,null,null,null,null,null,46,null,"2014-02-15",46]
[null,null,null,null,null,null,47,null,"2014-02-16",47]
[null,null,null,null,null,null,48,null,"2014-02-17",48]
[null,null,null,null,null,null,49,null,"2014-02-18",49]
[null,null,null,null,null,null,50,null,"2014-02-19",50]
[null,null,null,null,null,null,51,null,"2014-02-20",51]
[null,null,null,null,null,null,52,null,"2014-02-21",52]
[null,null,null,null,null,null,53,null,"2014-02-22",53]
[null,null,null,null,null,null,54,null,"2014-02-23",54]
[null,null,null,null,null,null,55,null,"2014-02-24",55]
[null,null,null,null,null,null,56,null,"2014-02-25",56]
[null,null,null,null,null,null,57,null,"2014-02-26",57]
[null,null,null,null,null,null,58,null,"2014-02-27",58]
[null,null,null,null,null,null,59,null,"2014-02-28",59]
[null,null,null,null,null,null,60,null,"2014-03-01",60]
[null,null,null,null,null,null,61,"Mar","2014-03-02",61]
[null,null,null,null,null,null,62,null,"2014-03-03",62]
[null,null,null,null,null,null,63,null,"2014-03-04",63]
[null,null,null,null,null,null,64,null,"2014-03-05",64]
[null,null,null,null,null,null,65,null,"2014-03-06",65]
[null,null,null,null,null,null,66,null,"2014-03-07",66]
[null,null,null,null,null,null,67,null,"2014-03-08",67]
[null,null,null,null,null,null,68,null,"2014-03-09",68]
[null,null,null,null,null,null,69,null,"2014-03-10",69]
[null,null,null,null,null,null,70,null,"2014-03-11",70]
[null,null,null,null,null,null,71,null,"2014-03-12",71]
[null,null,null,null,null,null,72,null,"2014-03-13",72]
[null,null,null,null,null,null,73,null,"2014-03-14",73]
[null,null,null,null,null,null,74,null,"2014-03-15",74]
[null,null,null,null,null,null,75,null,"2014-03-16",75]
[null,null,null,null,null,null,76,null,"2014-03-17",76]
[null,null,null,null,null,null,77,null,"2014-03-18",77]
[null,null,null,null,null,null,78,null,"2014-03-19",78]
[null,null,null,null,null,null,79,null,"2014-03-20",79]
[null,null,null,null,null,null,80,null,"2014-03-21",80]
[null,null,null,null,null,null,81,null,"2014-03-22",81]
[null,null,null,null,null,null,82,null,"2014-03-23",82]
[null,null,null,null,null,null,83,null,"2014-03-24",83]
[null,null,null,null,null,null,84,null,"2014-03-25",84]
[null,null,null,null,null,null,85,null,"2014-03-26",85]
[null,null,null,null,null,null,86,null,"2014-03-27",86]
[null,null,null,null,null,null,87,null,"2014-03-28",87]
[null,null,null,null,null,null,88,null,"2014-03-29",88]
[null,null,null,null,null,null,89,null,"2014-03-30",89]
[null,null,null,null,null,null,90,null,"2014-03-31",90]
[null,null,null,null,null,null,91,null,"2014-04-01",91]
[null,null,null,null,null,null,92,"Ap1","2014-04-02",92]
[null,null,null,null,null,null,93,null,"2014-04-03",93]
[null,null,null,null,null,null,94,null,"2014-04-04",94]
[null,null,null,null,null,null,95,null,"2014-04-05",95]
[null,null,null,null,null,null,96,null,"2014-04-06",96]
[null,null,null,null,null,null,97,null,"2014-04-07",97]
[null,null,null,null,null,null,98,null,"2014-04-08",98]
[null,null,null,null,null,null,99,"Ap2","2014-04-09",99]
[null,null,null,null,null,null,100,null,"2014-04-10",100]
[null,null,null,null,null,null,101,null,"2014-04-11",101]
[null,null,null,null,null,null,102,null,"2014-04-12",102]
[null,null,null,null,null,null,103,null,"2014-04-13",103]
[null,null,null,null,null,null,104,null,"2014-04-14",104]
[null,null,null,null,null,null,105,null,"2014-04-15",105]
[null,null,null,null,null,null,106,"Ap3","2014-04-16",106]
[null,null,null,null,null,null,107,null,"2014-04-17",107]
[null,null,null,null,null,null,108,null,"2014-04-18",108]
[null,null,null,null,null,null,109,null,"2014-04-19",109]
[null,null,null,null,null,null,110,null,"2014-04-20",110]
[null,null,null,null,null,null,111,null,"2014-04-21",111]
[null,null,null,null,null,null,112,null,"2014-04-22",112]
[null,null,null,null,null,null,113,null,"2014-04-23",113]
[null,null,null,null,null,null,114,"Ap4","2014-04-24",114]
[null,null,null,null,null,null,115,null,"2014-04-25",115]
[null,null,null,null,null,null,116,null,"2014-04-26",116]
[null,null,null,null,null,null,117,null,"2014-04-27",117]
[null,null,null,null,null,null,118,null,"2014-04-28",118]
[null,null,null,null,null,null,119,null,"2014-04-29",119]
[null,null,null,null,null,null,120,null,"2014-04-30",120]
[null,null,null,null,null,null,121,null,"2014-05-01",121]
[null,null,null,null,null,null,122,"Ma1","2014-05-02",122]
[null,null,null,null,null,null,123,null,"2014-05-03",123]
[null,null,null,null,null,null,124,null,"2014-05-04",124]
[null,null,null,null,null,null,125,null,"2014-05-05",125]
[null,null,null,null,null,null,126,null,"2014-05-06",126]
[null,null,null,null,null,null,127,null,"2014-05-07",127]
[null,null,null,null,null,null,128,null,"2014-05-08",128]
[null,null,null,null,null,null,129,"Ma2","2014-05-09",129]
[null,null,null,null,null,null,130,null,"2014-05-10",130]
[null,null,null,null,null,null,131,null,"2014-05-11",131]
[null,null,null,null,null,null,132,null,"2014-05-12",132]
[null,null,null,null,null,null,133,null,"2014-05-13",133]
[null,null,null,null,null,null,134,null,"2014-05-14",134]
[null,null,null,null,null,null,135,null,"2014-05-15",135]
[null,null,null,null,null,null,136,"Ma3","2014-05-16",136]
[null,null,null,null,null,null,137,null,"2014-05-17",137]
[null,null,null,null,null,null,138,null,"2014-05-18",138]
[null,null,null,null,null,null,139,null,"2014-05-19",139]
[null,null,null,null,null,null,140,null,"2014-05-20",140]
[null,null,null,null,null,null,141,null,"2014-05-21",141]
[null,null,null,null,null,null,142,null,"2014-05-22",142]
[null,null,null,null,null,null,143,"Ma4","2014-05-23",143]
[null,null,null,null,null,null,144,null,"2014-05-24",144]
[null,null,null,null,null,null,145,null,"2014-05-25",145]
[null,null,null,null,null,null,146,null,"2014-05-26",146]
[null,null,null,null,null,null,147,null,"2014-05-27",147]
[null,null,null,null,null,null,148,null,"2014-05-28",148]
[null,null,null,null,null,null,149,null,"2014-05-29",149]
[null,null,null,null,null,null,150,null,"2014-05-30",150]
[null,null,null,null,null,null,151,null,"2014-05-31",151]
[null,null,null,null,null,null,152,null,"2014-06-01",152]
[null,null,null,null,null,null,153,"Jn1","2014-06-02",153]
[null,null,null,null,null,null,154,null,"2014-06-03",154]
[null,null,null,null,null,null,155,null,"2014-06-04",155]
[null,null,null,null,null,null,156,null,"2014-06-05",156]
[null,null,null,null,null,null,157,null,"2014-06-06",157]
[null,null,null,null,null,null,158,null,"2014-06-07",158]
[null,null,null,null,null,null,159,null,"2014-06-08",159]
[null,null,null,null,null,null,160,"Jn2","2014-06-09",160]
[null,null,null,null,null,null,161,null,"2014-06-10",161]
[null,null,null,null,null,null,162,null,"2014-06-11",162]
[null,null,null,null,null,null,163,null,"2014-06-12",163]
[null,null,null,null,null,null,164,null,"2014-06-13",164]
[null,null,null,null,null,null,165,null,"2014-06-14",165]
[null,null,null,null,null,null,166,null,"2014-06-15",166]
[null,null,null,null,null,null,167,null,"2014-06-16",167]
[null,null,null,null,null,null,168,"Jn3","2014-06-17",168]
[null,null,null,null,null,null,169,null,"2014-06-18",169]
[null,null,null,null,null,null,170,null,"2014-06-19",170]
[null,null,null,null,null,null,171,null,"2014-06-20",171]
[null,null,null,null,null,null,172,null,"2014-06-21",172]
[null,null,null,null,null,null,173,null,"2014-06-22",173]
[null,null,null,null,null,null,174,null,"2014-06-23",174]
[null,null,null,null,null,null,175,"Jn4","2014-06-24",175]
[null,null,null,null,null,null,176,null,"2014-06-25",176]
[null,null,null,null,null,null,177,null,"2014-06-26",177]
[null,null,null,null,null,null,178,null,"2014-06-27",178]
[null,null,null,null,null,null,179,null,"2014-06-28",179]
[null,null,null,null,null,null,180,null,"2014-06-29",180]
[null,null,null,null,null,null,181,null,"2014-06-30",181]
[null,null,null,null,null,null,182,"Jy1","2014-07-01",182]
[null,null,null,null,null,null,183,null,"2014-07-02",183]
[null,null,null,null,null,null,184,null,"2014-07-03",184]
[null,null,null,null,null,null,185,null,"2014-07-04",185]
[null,null,null,null,null,null,186,null,"2014-07-05",186]
[null,null,null,null,null,null,187,null,"2014-07-06",187]
[null,null,null,null,null,null,188,null,"2014-07-07",188]
[null,null,null,null,null,null,189,null,"2014-07-08",189]
[null,null,null,null,null,null,190,"Jy2","2014-07-09",190]
[null,null,null,null,null,null,191,null,"2014-07-10",191]
[null,null,null,null,null,null,192,null,"2014-07-11",192]
[null,null,null,null,null,null,193,null,"2014-07-12",193]
[null,null,null,null,null,null,194,null,"2014-07-13",194]
[null,null,null,null,null,null,195,null,"2014-07-14",195]
[null,null,null,null,null,null,196,null,"2014-07-15",196]
[null,null,null,null,null,null,197,"Jy3","2014-07-16",197]
[null,null,null,null,null,null,198,null,"2014-07-17",198]
[null,null,null,null,null,null,199,null,"2014-07-18",199]
[null,null,null,null,null,null,200,null,"2014-07-19",200]
[null,null,null,null,null,null,201,null,"2014-07-20",201]
[null,null,null,null,null,null,202,null,"2014-07-21",202]
[null,null,null,null,null,null,203,null,"2014-07-22",203]
[null,null,null,null,null,null,204,null,"2014-07-23",204]
[null,null,null,null,null,null,205,"Jy4","2014-07-24",205]
[null,null,null,null,null,null,206,null,"2014-07-25",206]
[null,null,null,null,null,null,207,null,"2014-07-26",207]
[null,null,null,null,null,null,208,null,"2014-07-27",208]
[null,null,null,null,null,null,209,null,"2014-07-28",209]
[null,null,null,null,null,null,210,null,"2014-07-29",210]
[null,null,null,null,null,null,211,null,"2014-07-30",211]
[null,null,null,null,null,null,212,null,"2014-07-31",212]
[null,null,null,null,null,null,213,"Ag1","2014-08-01",213]
[null,null,null,null,null,null,214,null,"2014-08-02",214]
[null,null,null,null,null,null,215,null,"2014-08-03",215]
[null,null,null,null,null,null,216,null,"2014-08-04",216]
[null,null,null,null,null,null,217,null,"2014-08-05",217]
[null,null,null,null,null,null,218,null,"2014-08-06",218]
[null,null,null,null,null,null,219,null,"2014-08-07",219]
[null,null,null,null,null,null,220,null,"2014-08-08",220]
[null,null,null,null,null,null,221,"Ag2","2014-08-09",221]
[null,null,null,null,null,null,222,null,"2014-08-10",222]
[null,null,null,null,null,null,223,null,"2014-08-11",223]
[null,null,null,null,null,null,224,null,"2014-08-12",224]
[null,null,null,null,null,null,225,null,"2014-08-13",225]
[null,null,null,null,null,null,226,null,"2014-08-14",226]
[null,null,null,null,null,null,227,null,"2014-08-15",227]
[null,null,null,null,null,null,228,"Ag3","2014-08-16",228]
[null,null,null,null,null,null,229,null,"2014-08-17",229]
[null,null,null,null,null,null,230,null,"2014-08-18",230]
[null,null,null,null,null,null,231,null,"2014-08-19",231]
[null,null,null,null,null,null,232,null,"2014-08-20",232]
[null,null,null,null,null,null,233,null,"2014-08-21",233]
[null,null,null,null,null,null,234,null,"2014-08-22",234]
[null,null,null,null,null,null,235,null,"2014-08-23",235]
[null,null,null,null,null,null,236,null,"2014-08-24",236]
[null,null,null,null,null,null,237,null,"2014-08-25",237]
[null,null,null,null,null,null,238,"Ag4","2014-08-26",238]
[null,null,null,null,null,null,239,null,"2014-08-27",239]
[null,null,null,null,null,null,240,null,"2014-08-28",240]
[null,null,null,null,null,null,241,null,"2014-08-29",241]
[null,null,null,null,null,null,242,null,"2014-08-30",242]
[null,null,null,null,null,null,243,null,"2014-08-31",243]
[null,null,null,null,null,null,244,"Se1","2014-09-01",244]
[null,null,null,null,null,null,245,null,"2014-09-02",245]
[null,null,null,null,null,null,246,null,"2014-09-03",246]
[null,null,null,null,null,null,247,null,"2014-09-04",247]
[null,null,null,null,null,null,248,null,"2014-09-05",248]
[null,null,null,null,null,null,249,null,"2014-09-06",249]
[null,null,null,null,null,null,250,null,"2014-09-07",250]
[null,null,null,null,null,null,251,"Se2","2014-09-08",251]
[null,null,null,null,null,null,252,null,"2014-09-09",252]
[null,null,null,null,null,null,253,null,"2014-09-10",253]
[null,null,null,null,null,null,254,null,"2014-09-11",254]
[null,null,null,null,null,null,255,null,"2014-09-12",255]
[null,null,null,null,null,null,256,null,"2014-09-13",256]
[null,null,null,null,null,null,257,null,"2014-09-14",257]
[null,null,null,null,null,null,258,"Se3","2014-09-15",258]
[null,null,null,null,null,null,259,null,"2014-09-16",259]
[null,null,null,null,null,null,260,null,"2014-09-17",260]
[null,null,null,null,null,null,261,null,"2014-09-18",261]
[null,null,null,null,null,null,262,null,"2014-09-19",262]
[null,null,null,null,null,null,263,null,"2014-09-20",263]
[null,null,null,null,null,null,264,null,"2014-09-21",264]
[null,null,null,null,null,null,265,"Se4","2014-09-22",265]
[null,null,null,null,null,null,266,null,"2014-09-23",266]
[null,null,null,null,null,null,267,null,"2014-09-24",267]
[null,null,null,null,null,null,268,null,"2014-09-25",268]
[null,null,null,null,null,null,269,null,"2014-09-26",269]
[null,null,null,null,null,null,270,null,"2014-09-27",270]
[null,null,null,null,null,null,271,null,"2014-09-28",271]
[null,null,null,null,null,null,272,null,"2014-09-29",272]
[null,null,null,null,null,null,273,null,"2014-09-30",273]
[null,null,null,null,null,null,274,"Oc1","2014-10-01",274]
[null,null,null,null,null,null,275,null,"2014-10-02",275]
[null,null,null,null,null,null,276,null,"2014-10-03",276]
[null,null,null,null,null,null,277,null,"2014-10-04",277]
[null,null,null,null,null,null,278,null,"2014-10-05",278]
[null,null,null,null,null,null,279,null,"2014-10-06",279]
[null,null,null,null,null,null,280,null,"2014-10-07",280]
[null,null,null,null,null,null,281,null,"2014-10-08",281]
[null,null,null,null,null,null,282,"Oc2","2014-10-09",282]
[null,null,null,null,null,null,283,null,"2014-10-10",283]
[null,null,null,null,null,null,284,null,"2014-10-11",284]
[null,null,null,null,null,null,285,null,"2014-10-12",285]
[null,null,null,null,null,null,286,null,"2014-10-13",286]
[null,null,null,null,null,null,287,null,"2014-10-14",287]
[null,null,null,null,null,null,288,null,"2014-10-15",288]
[null,null,null,null,null,null,289,"Oc3","2014-10-16",289]
[null,null,null,null,null,null,290,null,"2014-10-17",290]
[null,null,null,null,null,null,291,null,"2014-10-18",291]
[null,null,null,null,null,null,292,null,"2014-10-19",292]
[null,null,null,null,null,null,293,null,"2014-10-20",293]
[null,null,null,null,null,null,294,null,"2014-10-21",294]
[null,null,null,null,null,null,295,null,"2014-10-22",295]
[null,null,null,null,null,null,296,null,"2014-10-23",296]
[null,null,null,null,null,null,297,"Oc4","2014-10-24",297]
[null,null,null,null,null,null,298,null,"2014-10-25",298]
[null,null,null,null,null,null,299,null,"2014-10-26",299]
[null,null,null,null,null,null,300,null,"2014-10-27",300]
[null,null,null,null,null,null,301,null,"2014-10-28",301]
[null,null,null,null,null,null,302,null,"2014-10-29",302]
[null,null,null,null,null,null,303,null,"2014-10-30",303]
[null,null,null,null,null,null,304,null,"2014-10-31",304]
[null,null,null,null,null,null,305,"Nov","2014-11-01",305]
[null,null,null,null,null,null,306,null,"2014-11-02",306]
[null,null,null,null,null,null,307,null,"2014-11-03",307]
[null,null,null,null,null,null,308,null,"2014-11-04",308]
[null,null,null,null,null,null,309,null,"2014-11-05",309]
[null,null,null,null,null,null,310,null,"2014-11-06",310]
[null,null,null,null,null,null,311,null,"2014-11-07",311]
[null,null,null,null,null,null,312,null,"2014-11-08",312]
[null,null,null,null,null,null,313,null,"2014-11-09",313]
[null,null,null,null,null,null,314,null,"2014-11-10",314]
[null,null,null,null,null,null,315,null,"2014-11-11",315]
[null,null,null,null,null,null,316,null,"2014-11-12",316]
[null,null,null,null,null,null,317,null,"2014-11-13",317]
[null,null,null,null,null,null,318,null,"2014-11-14",318]
[null,null,null,null,null,null,319,null,"2014-11-15",319]
[null,null,null,null,null,null,320,null,"2014-11-16",320]
[null,null,null,null,null,null,321,null,"2014-11-17",321]
[null,null,null,null,null,null,322,null,"2014-11-18",322]
[null,null,null,null,null,null,323,null,"2014-11-19",323]
[null,null,null,null,null,null,324,null,"2014-11-20",324]
[null,null,null,null,null,null,325,null,"2014-11-21",325]
[null,null,null,null,null,null,326,null,"2014-11-22",326]
[null,null,null,null,null,null,327,null,"2014-11-23",327]
[null,null,null,null,null,null,328,null,"2014-11-24",328]
[null,null,null,null,null,null,329,null,"2014-11-25",329]
[null,null,null,null,null,null,330,null,"2014-11-26",330]
[null,null,null,null,null,null,331,null,"2014-11-27",331]
[null,null,null,null,null,null,332,null,"2014-11-28",332]
[null,null,null,null,null,null,333,null,"2014-11-29",333]
[null,null,null,null,null,null,334,null,"2014-11-30",334]
[null,null,null,null,null,null,335,"Dec","2014-12-01",335]
[null,null,null,null,null,null,336,null,"2014-12-02",336]
[null,null,null,null,null,null,337,null,"2014-12-03",337]
[null,null,null,null,null,null,338,null,"2014-12-04",338]
[null,null,null,null,null,null,339,null,"2014-12-05",339]
[null,null,null,null,null,null,340,null,"2014-12-06",340]
[null,null,null,null,null,null,341,null,"2014-12-07",341]
[null,null,null,null,null,null,342,null,"2014-12-08",342]
[null,null,null,null,null,null,343,null,"2014-12-09",343]
[null,null,null,null,null,null,344,null,"2014-12-10",344]
[null,null,null,null,null,null,345,null,"2014-12-11",345]
[null,null,null,null,null,null,346,null,"2014-12-12",346]
[null,null,null,null,null,null,347,null,"2014-12-13",347]
[null,null,null,null,null,null,348,null,"2014-12-14",348]
[null,null,null,null,null,null,349,null,"2014-12-15",349]
[null,null,null,null,null,null,350,null,"2014-12-16",350]
[null,null,null,null,null,null,351,null,"2014-12-17",351]
[null,null,null,null,null,null,352,null,"2014-12-18",352]
[null,null,null,null,null,null,353,null,"2014-12-19",353]
[null,null,null,null,null,null,354,null,"2014-12-20",354]
[null,null,null,null,null,null,355,null,"2014-12-21",355]
[null,null,null,null,null,null,356,null,"2014-12-22",356]
[null,null,null,null,null,null,357,null,"2014-12-23",357]
[null,null,null,null,null,null,358,null,"2014-12-24",358]
[null,null,null,null,null,null,359,null,"2014-12-25",359]
[null,null,null,null,null,null,360,null,"2014-12-26",360]
[null,null,null,null,null,null,361,null,"2014-12-27",361]
[null,null,null,null,null,null,362,null,"2014-12-28",362]
[null,null,null,null,null,null,363,null,"2014-12-29",363]
[null,null,null,null,null,null,364,null,"2014-12-30",364]
[null,null,null,null,null,null,365,null,"2014-12-31",365]

{"sheet":"Grazing Schedule Option 1Manual","index":6,"n_rows":78,"n_cols":56,"rows_kept":78,"cut":false,"hidden":false,"merged":[[19,0,19,54],[17,55,20,58],[21,55,22,58],[76,0,76,1],[77,2,82,54],[21,31,21,34],[21,35,21,38],[21,39,21,42],[21,43,21,46],[21,47,21,50],[21,51,21,54],[21,7,21,10],[21,11,21,14],[21,15,21,18],[21,19,21,22],[21,23,21,26],[20,0,22,0],[20,1,22,1],[20,2,22,2],[20,3,20,5],[20,6,20,54],[21,3,22,3],[21,4,22,4],[21,5,22,5],[21,6,22,6],[21,27,21,30],[10,2,10,54],[12,2,12,54],[13,2,13,54],[14,2,14,54],[15,2,15,54],[5,0,5,54],[6,0,6,54],[7,0,7,54],[8,2,8,54],[9,2,9,54],[0,0,0,54],[1,0,1,54],[2,0,2,54],[3,0,3,54],[4,0,4,54],[77,0,82,1],[23,55,26,58],[27,55,29,58],[30,55,31,58],[11,2,11,54],[16,2,16,54],[17,42,17,54],[18,0,18,5],[18,6,18,14],[18,16,18,25],[18,27,18,42],[17,0,17,3],[17,4,17,21],[17,22,17,25],[17,26,17,31],[17,34,17,41]]}
["Grazing Management Strategies"]
["Grazing management systems are planned forage and livestock management programs designed to accomplish range improvement.  A grazing system is developed to maintain or improve range similarity index, productivity, health and vigor while simultaneously achieving a high, sustainable level of livestock production.  "]
["Types of Grazing Systems:  Prescribed grazing is a grazing system which is tailored to the individual operation and designed to achieve the specific objectives of the operation.  To be effective a grazing strategy should be flexible and modified with changes in weather, plant growth and disturbances.  Which every grazing management strategy is implemented, it should allow for adequate recovery time of the primary forage grasses before the pasture, paddock, or grazing unit is grazed again.  Recovery should be based upon the growth of key forage species, and not based solely on the days of rest or the calendar.  There are several general types of grazing management systems:"]
["1.  Rest Rotation:  In a rest rotation grazing management system, one or more pastures are left ungrazed for the entire growing season.  Each year a different pasture(s) is ungrazed; in other words, the rest is rotated.  Incorporating rest so that each pasture is ungrazed once every 5-7 years builds in resilience, aids in drought recovery and provides wildlife habitat.  Stocking rates should be adjusted to account for the forage that is unavailable each year.  Often times, a rest rotation is coupled with a deferred rotation rather than grazed pastures being grazed season long."]
["2.  Deferred Rotation:  In a deferred rotation grazing management system, a herd is rotated through three or more pastures.  While one pasture is being grazed, the remaining pastures are not grazed (deferred).  The pastures are grazed in a planned sequence.  The sequence of grazing is changed each year to make certain that the grasses are not being grazed during the same time in the growing season in consecutive years.  "]
["3.  High Intensity/Low Frequency Rotation:  In a high intensity/low frequency rotation grazing management system, one herd of livestock grazes eight or more pastures in a planned sequence. Livestock are moved into one pasture and the other pastures are rested. When the forage is grazed to the desired intensity, livestock are moved to the next pasture in the rotation. Livestock typically stay in a pasture 10 to 25 days. The frequent moves allow long rest periods for each pasture.  The sequence of grazing is changed each year.  Depending upon production and precipitation, pastures may be grazed once per growing season, or more than once per growing season.  "]
["4.  Short-duration. (Management Intensive Grazing.) This is similar to the high intensity/low frequency system, except the speed of the rotation is adjusted according to the growth rate and the required rest period of the plants. During the peak of the growing season, livestock are moved rapidly with slower moves when pasture growth rate slow down.  In some systems, livestock are moved every 3-5 days or more frequently.  Mob grazing is a variation of this type of grazing strategy.  With mob grazing, stock density is very high and moves may be as often as 3 or more times per day and paddocks are temporary and are in different locations each time the unit is grazed.  Usually, each paddock is grazed only one time per year."]
["Purpose of prescribed grazing management systems:  Prescribed grazing systems are implemented in order to achieve any number of objectives, which include but are not limited to:"]
[null,"¨","Maintain or increase improvement in plant cover while properly using the forage in all pastures."]
[null,"¨","Improve efficiency of grazing by uniformly using all parts of each grazed pasture."]
[null,"¨","Permit a higher level of livestock production."]
[null,"¨","Insure a supply of forage throughout the grazing season."]
[null,"¨","Insure that an adequate feed and forage balance is maintained for the unit."]
[null,"¨","Improve control of undesirable plants."]
[null,"¨","Allow easier handling and observation of livestock."]
[null,"¨","Enhance wildlife habitat."]
[null,"¨","Enhance watershed protection."]
["CLIENT NAME:",null,null,null,{"$f":"NEW_528_Forage_Balance!C2","v":"Mary Rancher - Sunnyvale Ranch"},null,null,null,null,null,null,null,null,null,null,null,null,null,null,null,null,null,"YEAR:",null,null,null,"1905-07-13",null,null,null,null,null,null,null,"CONTRACT NO:",null,null,null,null,null,null,null,{"$f":"NEW_528_Forage_Balance!R2","v":"12345K"},null,null,null,null,null,null,null,null,null,null,null,null,"You can create a copy of  this sheet for each future year that you would like to develop a grazing schedule."]
["LENGTH GRAZING SEASON (DAYS):",null,null,null,null,null,{"$f":"NEW_528_Forage_Balance!Q68","v":195},null,null,null,null,null,null,null,null,null,"Planned Grazing Dates:",null,null,null,null,null,null,null,null,null,null,"May 1 - November 15"]
[]
["Field no. ","Forage Type","Acres","AUM Information",null,null,"Dates are approximate - actual moves should be based upon plant growth which will vary from year to year"]
[null,null,null,"Estimated AUM or AUD for Field","% AUM or AUD by field","Est. Days / Field",null,"January (week)",null,null,null,"February (week)",null,null,null,"March (week)",null,null,null,"April  (week)",null,null,null,"May  (week)",null,null,null,"June  (week)",null,null,null,"July (week)",null,null,null,"August  (week)",null,null,null,"Sept. (week)",null,null,null,"October  (week)",null,null,null,"November (week)",null,null,null,"December (week)",null,null,null,"Enter the planned dates.  For example, May 1 - Sept 30."]
[null,null,null,null,null,null,null,1,2,3,4,1,2,3,4,1,2,3,4,1,2,3,4,1,2,3,4,1,2,3,4,1,2,3,4,1,2,3,4,1,2,3,4,1,2,3,4,1,2,3,4,1,2,3,4]
[{"$f":"NEW_528_Forage_Balance!G69","v":"R1A"},{"$f":"IF(A24=0,\"\",(NEW_528_Forage_Balance!I69))","v":"Range"},{"$f":"IF(A24=0,\"\",(NEW_528_Forage_Balance!H69))","v":305},{"$f":"IF(A24=0,\"\",(NEW_528_Forage_Balance!L69))","v":115},{"$f":"IF(A24=0,\"\", D24/$D$77*100)","v":16.129032258064516},{"$f":"IF(A24=0,\"\", $G$19*E24/100)","v":31.451612903225804},null,null,null,null,null,null,null,null,null,null,null,null,null,null,null,null,null,null,null,null,null,null,null,null,null,null,null,null,null,null,null,null,null,null,null,null,null,null,null,null,null,null,null,null,null,null,null,null,null,"Highlight the approximate dates planned for each pasture.  If pastures will be grazed multiple times, highlight approximate dates for each grazing period."]
[{"$f":"NEW_528_Forage_Balance!G70","v":"R1B"},{"$f":"IF(A25=0,\"\",(NEW_528_Forage_Balance!I70))","v":"Range"},{"$f":"IF(A25=0,\"\",(NEW_528_Forage_Balance!H70))","v":335},{"$f":"IF(A25=0,\"\",(NEW_528_Forage_Balance!L70))","v":92},12.903225806451612,{"$f":"IF(A25=0,\"\", $G$19*E25/100)","v":25.161290322580644}]
[{"$f":"NEW_528_Forage_Balance!G71","v":"R2"},{"$f":"IF(A26=0,\"\",(NEW_528_Forage_Balance!I71))","v":"Range"},{"$f":"IF(A26=0,\"\",(NEW_528_Forage_Balance!H71))","v":320},{"$f":"IF(A26=0,\"\",(NEW_528_Forage_Balance!L71))","v":122},17.110799438990181,{"$f":"IF(A26=0,\"\", $G$19*E26/100)","v":33.366058906030851}]
[{"$f":"NEW_528_Forage_Balance!G72","v":"R3"},{"$f":"IF(A27=0,\"\",(NEW_528_Forage_Balance!I72))","v":"Range"},{"$f":"IF(A27=0,\"\",(NEW_528_Forage_Balance!H72))","v":80},{"$f":"IF(A27=0,\"\",(NEW_528_Forage_Balance!L72))","v":35},4.9088359046283312,{"$f":"IF(A27=0,\"\", $G$19*E27/100)","v":9.5722300140252461}]
[{"$f":"NEW_528_Forage_Balance!G73","v":"R4"},{"$f":"IF(A28=0,\"\",(NEW_528_Forage_Balance!I73))","v":"Range"},{"$f":"IF(A28=0,\"\",(NEW_528_Forage_Balance!H73))","v":160},{"$f":"IF(A28=0,\"\",(NEW_528_Forage_Balance!L73))","v":58},8.1346423562412333,{"$f":"IF(A28=0,\"\", $G$19*E28/100)","v":15.862552594670406},null,null,null,null,null,null,null,null,null,null,null,null,null,null,null,null,null,null,null,null,null,null,null,null,null,null,null,null,null,null,null,null,null,null,null,null,null,null,null,null,null,null,null,null,null,null,null,null,null,"This worksheet is set up for up to 40 pastures.  Hide the unused lines before printing to clean up the printout."]
[{"$f":"NEW_528_Forage_Balance!G74","v":"R5A"},{"$f":"IF(A29=0,\"\",(NEW_528_Forage_Balance!I74))","v":"Range"},{"$f":"IF(A29=0,\"\",(NEW_528_Forage_Balance!H74))","v":240},{"$f":"IF(A29=0,\"\",(NEW_528_Forage_Balance!L74))","v":66},9.2566619915848527,18.050490883590463]
[{"$f":"NEW_528_Forage_Balance!G75","v":"R5B"},{"$f":"IF(A30=0,\"\",(NEW_528_Forage_Balance!I75))","v":"Range"},{"$f":"IF(A30=0,\"\",(NEW_528_Forage_Balance!H75))","v":263},{"$f":"IF(A30=0,\"\",(NEW_528_Forage_Balance!L75))","v":106},14.866760168302944,28.990182328190741]
[{"$f":"NEW_528_Forage_Balance!G76","v":"R5C"},{"$f":"IF(A31=0,\"\",(NEW_528_Forage_Balance!I76))","v":"Range"},{"$f":"IF(A31=0,\"\",(NEW_528_Forage_Balance!H76))","v":137},{"$f":"IF(A31=0,\"\",(NEW_528_Forage_Balance!L76))","v":29},4.0673211781206167,7.9312762973352031,null,null,null,null,null,null,null,null,null,null,null,null,null,null,null,null,null,null,null,null,null,null,null,null,null,null,null,null,null,null,null,null,null,null,null,null,null,null,null,null,null,null,null,null,null,null,null,null,null,"Highlighting will need to be manually cleared before using for the next client."]
[{"$f":"NEW_528_Forage_Balance!G77","v":"R6"},{"$f":"IF(A32=0,\"\",(NEW_528_Forage_Balance!I77))","v":"Range"},{"$f":"IF(A32=0,\"\",(NEW_528_Forage_Balance!H77))","v":160},{"$f":"IF(A32=0,\"\",(NEW_528_Forage_Balance!L77))","v":90},12.622720897615707,24.614305750350628]
[{"$f":"NEW_528_Forage_Balance!G78","v":0},{"$f":"IF(A33=0,\"\",(NEW_528_Forage_Balance!I78))","v":""},{"$f":"IF(A33=0,\"\",(NEW_528_Forage_Balance!H78))","v":""},{"$f":"IF(A33=0,\"\",(NEW_528_Forage_Balance!L78))","v":""},"",""]
[{"$f":"NEW_528_Forage_Balance!G79","v":0},{"$f":"IF(A34=0,\"\",(NEW_528_Forage_Balance!I79))","v":""},{"$f":"IF(A34=0,\"\",(NEW_528_Forage_Balance!H79))","v":""},{"$f":"IF(A34=0,\"\",(NEW_528_Forage_Balance!L79))","v":""},"",""]
[{"$f":"NEW_528_Forage_Balance!G80","v":0},{"$f":"IF(A35=0,\"\",(NEW_528_Forage_Balance!I80))","v":""},{"$f":"IF(A35=0,\"\",(NEW_528_Forage_Balance!H80))","v":""},{"$f":"IF(A35=0,\"\",(NEW_528_Forage_Balance!L80))","v":""},"",""]
[{"$f":"NEW_528_Forage_Balance!G81","v":0},{"$f":"IF(A36=0,\"\",(NEW_528_Forage_Balance!I81))","v":""},{"$f":"IF(A36=0,\"\",(NEW_528_Forage_Balance!H81))","v":""},{"$f":"IF(A36=0,\"\",(NEW_528_Forage_Balance!L81))","v":""},"",""]
[{"$f":"NEW_528_Forage_Balance!G82","v":0},{"$f":"IF(A37=0,\"\",(NEW_528_Forage_Balance!I82))","v":""},{"$f":"IF(A37=0,\"\",(NEW_528_Forage_Balance!H82))","v":""},{"$f":"IF(A37=0,\"\",(NEW_528_Forage_Balance!L82))","v":""},"",""]
[{"$f":"NEW_528_Forage_Balance!G83","v":0},{"$f":"IF(A38=0,\"\",(NEW_528_Forage_Balance!I83))","v":""},{"$f":"IF(A38=0,\"\",(NEW_528_Forage_Balance!H83))","v":""},{"$f":"IF(A38=0,\"\",(NEW_528_Forage_Balance!L83))","v":""},"",""]
[{"$f":"NEW_528_Forage_Balance!G84","v":0},{"$f":"IF(A39=0,\"\",(NEW_528_Forage_Balance!I84))","v":""},{"$f":"IF(A39=0,\"\",(NEW_528_Forage_Balance!H84))","v":""},{"$f":"IF(A39=0,\"\",(NEW_528_Forage_Balance!L84))","v":""},"",""]
[{"$f":"NEW_528_Forage_Balance!G85","v":0},{"$f":"IF(A40=0,\"\",(NEW_528_Forage_Balance!I85))","v":""},{"$f":"IF(A40=0,\"\",(NEW_528_Forage_Balance!H85))","v":""},{"$f":"IF(A40=0,\"\",(NEW_528_Forage_Balance!L85))","v":""},"",""]
[{"$f":"NEW_528_Forage_Balance!G86","v":0},{"$f":"IF(A41=0,\"\",(NEW_528_Forage_Balance!I86))","v":""},{"$f":"IF(A41=0,\"\",(NEW_528_Forage_Balance!H86))","v":""},{"$f":"IF(A41=0,\"\",(NEW_528_Forage_Balance!L86))","v":""},"",""]
[{"$f":"NEW_528_Forage_Balance!G87","v":0},{"$f":"IF(A42=0,\"\",(NEW_528_Forage_Balance!I87))","v":""},{"$f":"IF(A42=0,\"\",(NEW_528_Forage_Balance!H87))","v":""},{"$f":"IF(A42=0,\"\",(NEW_528_Forage_Balance!L87))","v":""},"",""]
[{"$f":"NEW_528_Forage_Balance!G88","v":0},{"$f":"IF(A43=0,\"\",(NEW_528_Forage_Balance!I88))","v":""},{"$f":"IF(A43=0,\"\",(NEW_528_Forage_Balance!H88))","v":""},{"$f":"IF(A43=0,\"\",(NEW_528_Forage_Balance!L88))","v":""},"",""]
[{"$f":"NEW_528_Forage_Balance!G89","v":0},{"$f":"IF(A44=0,\"\",(NEW_528_Forage_Balance!I89))","v":""},{"$f":"IF(A44=0,\"\",(NEW_528_Forage_Balance!H89))","v":""},{"$f":"IF(A44=0,\"\",(NEW_528_Forage_Balance!L89))","v":""},"",""]
[{"$f":"NEW_528_Forage_Balance!G90","v":0},{"$f":"IF(A45=0,\"\",(NEW_528_Forage_Balance!I90))","v":""},{"$f":"IF(A45=0,\"\",(NEW_528_Forage_Balance!H90))","v":""},{"$f":"IF(A45=0,\"\",(NEW_528_Forage_Balance!L90))","v":""},"",""]
[{"$f":"NEW_528_Forage_Balance!G91","v":0},{"$f":"IF(A46=0,\"\",(NEW_528_Forage_Balance!I91))","v":""},{"$f":"IF(A46=0,\"\",(NEW_528_Forage_Balance!H91))","v":""},{"$f":"IF(A46=0,\"\",(NEW_528_Forage_Balance!L91))","v":""},"",""]
[{"$f":"NEW_528_Forage_Balance!G92","v":0},{"$f":"IF(A47=0,\"\",(NEW_528_Forage_Balance!I92))","v":""},{"$f":"IF(A47=0,\"\",(NEW_528_Forage_Balance!H92))","v":""},{"$f":"IF(A47=0,\"\",(NEW_528_Forage_Balance!L92))","v":""},"",""]
[{"$f":"NEW_528_Forage_Balance!G93","v":0},{"$f":"IF(A48=0,\"\",(NEW_528_Forage_Balance!I93))","v":""},{"$f":"IF(A48=0,\"\",(NEW_528_Forage_Balance!H93))","v":""},{"$f":"IF(A48=0,\"\",(NEW_528_Forage_Balance!L93))","v":""},"",""]
[{"$f":"NEW_528_Forage_Balance!G94","v":0},{"$f":"IF(A49=0,\"\",(NEW_528_Forage_Balance!I94))","v":""},{"$f":"IF(A49=0,\"\",(NEW_528_Forage_Balance!H94))","v":""},{"$f":"IF(A49=0,\"\",(NEW_528_Forage_Balance!L94))","v":""},"",""]
[{"$f":"NEW_528_Forage_Balance!G95","v":0},{"$f":"IF(A50=0,\"\",(NEW_528_Forage_Balance!I95))","v":""},{"$f":"IF(A50=0,\"\",(NEW_528_Forage_Balance!H95))","v":""},{"$f":"IF(A50=0,\"\",(NEW_528_Forage_Balance!L95))","v":""},"",""]
[{"$f":"NEW_528_Forage_Balance!G96","v":0},{"$f":"IF(A51=0,\"\",(NEW_528_Forage_Balance!I96))","v":""},{"$f":"IF(A51=0,\"\",(NEW_528_Forage_Balance!H96))","v":""},{"$f":"IF(A51=0,\"\",(NEW_528_Forage_Balance!L96))","v":""},"",""]
[{"$f":"NEW_528_Forage_Balance!G97","v":0},{"$f":"IF(A52=0,\"\",(NEW_528_Forage_Balance!I97))","v":""},{"$f":"IF(A52=0,\"\",(NEW_528_Forage_Balance!H97))","v":""},{"$f":"IF(A52=0,\"\",(NEW_528_Forage_Balance!L97))","v":""},"",""]
[{"$f":"NEW_528_Forage_Balance!G98","v":0},{"$f":"IF(A53=0,\"\",(NEW_528_Forage_Balance!I98))","v":""},{"$f":"IF(A53=0,\"\",(NEW_528_Forage_Balance!H98))","v":""},{"$f":"IF(A53=0,\"\",(NEW_528_Forage_Balance!L98))","v":""},"",""]
[{"$f":"NEW_528_Forage_Balance!G99","v":0},{"$f":"IF(A54=0,\"\",(NEW_528_Forage_Balance!I99))","v":""},{"$f":"IF(A54=0,\"\",(NEW_528_Forage_Balance!H99))","v":""},{"$f":"IF(A54=0,\"\",(NEW_528_Forage_Balance!L99))","v":""},"",""]
[{"$f":"NEW_528_Forage_Balance!G100","v":0},{"$f":"IF(A55=0,\"\",(NEW_528_Forage_Balance!I100))","v":""},{"$f":"IF(A55=0,\"\",(NEW_528_Forage_Balance!H100))","v":""},{"$f":"IF(A55=0,\"\",(NEW_528_Forage_Balance!L100))","v":""},"",""]
[{"$f":"NEW_528_Forage_Balance!G101","v":0},{"$f":"IF(A56=0,\"\",(NEW_528_Forage_Balance!I101))","v":""},{"$f":"IF(A56=0,\"\",(NEW_528_Forage_Balance!H101))","v":""},{"$f":"IF(A56=0,\"\",(NEW_528_Forage_Balance!L101))","v":""},{"$f":"IF(A56=0,\"\", D56/$D$77*100)","v":""},""]
[{"$f":"NEW_528_Forage_Balance!G102","v":0},{"$f":"IF(A57=0,\"\",(NEW_528_Forage_Balance!I102))","v":""},{"$f":"IF(A57=0,\"\",(NEW_528_Forage_Balance!H102))","v":""},{"$f":"IF(A57=0,\"\",(NEW_528_Forage_Balance!L102))","v":""},"",""]
[{"$f":"NEW_528_Forage_Balance!G103","v":0},{"$f":"IF(A58=0,\"\",(NEW_528_Forage_Balance!I103))","v":""},{"$f":"IF(A58=0,\"\",(NEW_528_Forage_Balance!H103))","v":""},{"$f":"IF(A58=0,\"\",(NEW_528_Forage_Balance!L103))","v":""},"",""]
[{"$f":"NEW_528_Forage_Balance!G104","v":0},{"$f":"IF(A59=0,\"\",(NEW_528_Forage_Balance!I104))","v":""},{"$f":"IF(A59=0,\"\",(NEW_528_Forage_Balance!H104))","v":""},{"$f":"IF(A59=0,\"\",(NEW_528_Forage_Balance!L104))","v":""},"",""]
[{"$f":"NEW_528_Forage_Balance!G105","v":0},{"$f":"IF(A60=0,\"\",(NEW_528_Forage_Balance!I105))","v":""},{"$f":"IF(A60=0,\"\",(NEW_528_Forage_Balance!H105))","v":""},{"$f":"IF(A60=0,\"\",(NEW_528_Forage_Balance!L105))","v":""},"",""]
[{"$f":"NEW_528_Forage_Balance!G106","v":0},{"$f":"IF(A61=0,\"\",(NEW_528_Forage_Balance!I106))","v":""},{"$f":"IF(A61=0,\"\",(NEW_528_Forage_Balance!H106))","v":""},{"$f":"IF(A61=0,\"\",(NEW_528_Forage_Balance!L106))","v":""},"",""]
[{"$f":"NEW_528_Forage_Balance!G107","v":0},{"$f":"IF(A62=0,\"\",(NEW_528_Forage_Balance!I107))","v":""},{"$f":"IF(A62=0,\"\",(NEW_528_Forage_Balance!H107))","v":""},{"$f":"IF(A62=0,\"\",(NEW_528_Forage_Balance!L107))","v":""},"",""]
[{"$f":"NEW_528_Forage_Balance!G108","v":0},{"$f":"IF(A63=0,\"\",(NEW_528_Forage_Balance!I108))","v":""},{"$f":"IF(A63=0,\"\",(NEW_528_Forage_Balance!H108))","v":""},{"$f":"IF(A63=0,\"\",(NEW_528_Forage_Balance!L108))","v":""},"",""]
[{"$f":"NEW_528_Forage_Balance!G109","v":0},{"$f":"IF(A64=0,\"\",(NEW_528_Forage_Balance!I109))","v":""},{"$f":"IF(A64=0,\"\",(NEW_528_Forage_Balance!H109))","v":""},{"$f":"IF(A64=0,\"\",(NEW_528_Forage_Balance!L109))","v":""},"",{"$f":"IF(A64=0,\"\", $G$19*E64/100)","v":""}]
[{"$f":"NEW_528_Forage_Balance!G110","v":0},{"$f":"IF(A65=0,\"\",(NEW_528_Forage_Balance!I110))","v":""},{"$f":"IF(A65=0,\"\",(NEW_528_Forage_Balance!H110))","v":""},{"$f":"IF(A65=0,\"\",(NEW_528_Forage_Balance!L110))","v":""},"",""]
[{"$f":"NEW_528_Forage_Balance!G111","v":0},{"$f":"IF(A66=0,\"\",(NEW_528_Forage_Balance!I111))","v":""},{"$f":"IF(A66=0,\"\",(NEW_528_Forage_Balance!H111))","v":""},{"$f":"IF(A66=0,\"\",(NEW_528_Forage_Balance!L111))","v":""},"",""]
[{"$f":"NEW_528_Forage_Balance!G112","v":0},{"$f":"IF(A67=0,\"\",(NEW_528_Forage_Balance!I112))","v":""},{"$f":"IF(A67=0,\"\",(NEW_528_Forage_Balance!H112))","v":""},{"$f":"IF(A67=0,\"\",(NEW_528_Forage_Balance!L112))","v":""},"",""]
[{"$f":"NEW_528_Forage_Balance!G113","v":0},{"$f":"IF(A68=0,\"\",(NEW_528_Forage_Balance!I113))","v":""},{"$f":"IF(A68=0,\"\",(NEW_528_Forage_Balance!H113))","v":""},{"$f":"IF(A68=0,\"\",(NEW_528_Forage_Balance!L113))","v":""},"",""]
[{"$f":"NEW_528_Forage_Balance!G114","v":0},{"$f":"IF(A69=0,\"\",(NEW_528_Forage_Balance!I114))","v":""},{"$f":"IF(A69=0,\"\",(NEW_528_Forage_Balance!H114))","v":""},{"$f":"IF(A69=0,\"\",(NEW_528_Forage_Balance!L114))","v":""},"",""]
[{"$f":"NEW_528_Forage_Balance!G115","v":0},{"$f":"IF(A70=0,\"\",(NEW_528_Forage_Balance!I115))","v":""},{"$f":"IF(A70=0,\"\",(NEW_528_Forage_Balance!H115))","v":""},{"$f":"IF(A70=0,\"\",(NEW_528_Forage_Balance!L115))","v":""},"",""]
[{"$f":"NEW_528_Forage_Balance!G116","v":0},{"$f":"IF(A71=0,\"\",(NEW_528_Forage_Balance!I116))","v":""},{"$f":"IF(A71=0,\"\",(NEW_528_Forage_Balance!H116))","v":""},{"$f":"IF(A71=0,\"\",(NEW_528_Forage_Balance!L116))","v":""},"",""]
[{"$f":"NEW_528_Forage_Balance!G117","v":0},{"$f":"IF(A72=0,\"\",(NEW_528_Forage_Balance!I117))","v":""},{"$f":"IF(A72=0,\"\",(NEW_528_Forage_Balance!H117))","v":""},{"$f":"IF(A72=0,\"\",(NEW_528_Forage_Balance!L117))","v":""},"",""]
[{"$f":"NEW_528_Forage_Balance!G118","v":0},{"$f":"IF(A73=0,\"\",(NEW_528_Forage_Balance!I118))","v":""},{"$f":"IF(A73=0,\"\",(NEW_528_Forage_Balance!H118))","v":""},{"$f":"IF(A73=0,\"\",(NEW_528_Forage_Balance!L118))","v":""},"",""]
[{"$f":"NEW_528_Forage_Balance!G119","v":0},{"$f":"IF(A74=0,\"\",(NEW_528_Forage_Balance!I119))","v":""},{"$f":"IF(A74=0,\"\",(NEW_528_Forage_Balance!H119))","v":""},{"$f":"IF(A74=0,\"\",(NEW_528_Forage_Balance!L119))","v":""},"",""]
[{"$f":"NEW_528_Forage_Balance!G120","v":0},{"$f":"IF(A75=0,\"\",(NEW_528_Forage_Balance!I120))","v":""},{"$f":"IF(A75=0,\"\",(NEW_528_Forage_Balance!H120))","v":""},{"$f":"IF(A75=0,\"\",(NEW_528_Forage_Balance!L120))","v":""},"",""]
[{"$f":"NEW_528_Forage_Balance!G121","v":0},{"$f":"IF(A76=0,\"\",(NEW_528_Forage_Balance!I121))","v":""},{"$f":"IF(A76=0,\"\",(NEW_528_Forage_Balance!H121))","v":""},{"$f":"IF(A76=0,\"\",(NEW_528_Forage_Balance!L121))","v":""},"",""]
["TOTAL",null,{"$f":"SUM(C24:C76)","v":2000},{"$f":"SUM(D24:D76)","v":713},{"$f":"SUM(E24:E76)","v":100},{"$f":"SUM(F24:F76)","v":195.00000000000003}]
["Comments:"]

{"sheet":"528 JS - Schedule Option #2","index":7,"n_rows":78,"n_cols":24,"rows_kept":78,"cut":false,"hidden":false,"merged":[[0,0,0,22],[1,0,1,22],[2,0,2,22],[3,0,3,22],[4,0,4,22],[5,0,5,22],[6,0,6,22],[7,0,7,22],[17,0,17,1],[17,2,17,7],[17,9,17,10],[17,11,17,14],[17,15,17,17],[17,19,17,22],[16,2,16,22],[10,2,10,22],[11,2,11,22],[12,2,12,22],[13,2,13,22],[14,2,14,22],[15,2,15,22],[8,2,8,21],[9,2,9,21],[18,0,18,3],[18,4,18,6],[18,9,18,15],[18,16,18,22],[59,9,59,10],[59,15,59,16],[59,17,59,18],[55,9,55,10],[55,15,55,16],[55,17,55,18],[57,9,57,10],[57,15,57,16],[57,17,57,18],[58,9,58,10],[58,15,58,16],[58,17,58,18],[56,9,56,10],[56,15,56,16],[56,17,56,18],[59,7,59,8],[59,11,59,12],[59,13,59,14],[59,19,59,20],[59,21,59,22],[62,7,62,8],[62,9,62,10],[62,11,62,12],[62,13,62,14],[62,15,62,16],[62,17,62,18],[62,19,62,20],[62,21,62,22],[63,7,63,8],[63,9,63,10],[63,11,63,12],[63,13,63,14],[63,15,63,16],[63,17,63,18],[63,19,63,20],[63,21,63,22],[60,7,60,8],[60,9,60,10],[60,11,60,12],[60,13,60,14],[60,15,60,16],[60,17,60,18],[60,19,60,20],[60,21,60,22],[61,7,61,8],[61,9,61,10],[61,11,61,12],[61,13,61,14],[61,15,61,16],[61,17,61,18],[61,19,61,20],[61,21,61,22],[57,11,57,12],[57,13,57,14],[57,19,57,20],[57,21,57,22],[58,7,58,8],[58,11,58,12],[58,13,58,14],[58,19,58,20],[58,21,58,22],[54,7,54,8],[54,9,54,10],[54,11,54,12],[54,13,54,14],[54,15,54,16],[54,17,54,18],[54,19,54,20],[54,21,54,22],[55,7,55,8],[55,11,55,12],[55,13,55,14],[55,19,55,20],[55,21,55,22],[52,7,52,8],[52,9,52,10],[52,11,52,12],[52,13,52,14],[52,15,52,16],[52,17,52,18],[52,19,52,20],[52,21,52,22],[53,7,53,8],[53,9,53,10],[53,11,53,12],[53,13,53,14],[53,15,53,16],[53,17,53,18],[53,19,53,20],[53,21,53,22],[50,7,50,8],[50,9,50,10],[50,11,50,12],[50,13,50,14],[50,15,50,16],[50,17,50,18],[50,19,50,20],[50,21,50,22],[51,7,51,8],[51,9,51,10],[51,11,51,12],[51,13,51,14],[51,15,51,16],[51,17,51,18],[51,19,51,20],[51,21,51,22],[48,7,48,8],[48,9,48,10],[48,11,48,12],[48,13,48,14],[48,15,48,16],[48,17,48,18],[48,19,48,20],[48,21,48,22],[49,7,49,8],[49,9,49,10],[49,11,49,12],[49,13,49,14],[49,15,49,16],[49,17,49,18],[49,19,49,20],[49,21,49,22],[46,7,46,8],[46,9,46,10],[46,11,46,12],[46,13,46,14],[46,15,46,16],[46,17,46,18],[46,19,46,20],[46,21,46,22],[47,7,47,8],[47,9,47,10],[47,11,47,12],[47,13,47,14],[47,15,47,16],[47,17,47,18],[47,19,47,20],[47,21,47,22],[44,7,44,8],[44,9,44,10],[44,11,44,12],[44,13,44,14],[44,15,44,16],[44,17,44,18],[44,19,44,20],[44,21,44,22],[45,7,45,8],[45,9,45,10],[45,11,45,12],[45,13,45,14],[45,15,45,16],[45,17,45,18],[45,19,45,20],[45,21,45,22],[42,7,42,8],[42,9,42,10],[42,11,42,12],[42,13,42,14],[42,15,42,16],[42,17,42,18],[42,19,42,20],[42,21,42,22],[43,7,43,8],[43,9,43,10],[43,11,43,12],[43,13,43,14],[43,15,43,16],[43,17,43,18],[43,19,43,20],[43,21,43,22],[40,7,40,8],[40,9,40,10],[40,11,40,12],[40,13,40,14],[40,15,40,16],[40,17,40,18],[40,19,40,20],[40,21,40,22],[41,7,41,8],[41,9,41,10],[41,11,41,12],[41,13,41,14],[41,15,41,16],[41,17,41,18],[41,19,41,20],[41,21,41,22],[38,7,38,8],[38,9,38,10],[38,11,38,12],[38,13,38,14],[38,15,38,16],[38,17,38,18],[38,19,38,20],[38,21,38,22],[39,7,39,8],[39,9,39,10],[39,11,39,12],[39,13,39,14],[39,15,39,16],[39,17,39,18],[39,19,39,20],[39,21,39,22],[36,7,36,8],[36,9,36,10],[36,11,36,12],[36,13,36,14],[36,15,36,16],[36,17,36,18],[36,19,36,20],[36,21,36,22],[37,7,37,8],[37,9,37,10],[37,11,37,12],[37,13,37,14],[37,15,37,16],[37,17,37,18],[37,19,37,20],[37,21,37,22],[34,7,34,8],[34,9,34,10],[34,11,34,12],[34,13,34,14],[34,15,34,16],[34,17,34,18],[34,19,34,20],[34,21,34,22],[35,7,35,8],[35,9,35,10],[35,11,35,12],[35,13,35,14],[35,15,35,16],[35,17,35,18],[35,19,35,20],[35,21,35,22],[32,7,32,8],[32,9,32,10],[32,11,32,12],[32,13,32,14],[32,15,32,16],[32,17,32,18],[32,19,32,20],[32,21,32,22],[33,7,33,8],[33,9,33,10],[33,11,33,12],[33,13,33,14],[33,15,33,16],[33,17,33,18],[33,19,33,20],[33,21,33,22],[30,7,30,8],[30,9,30,10],[30,11,30,12],[30,13,30,14],[30,15,30,16],[30,17,30,18],[30,19,30,20],[30,21,30,22],[31,7,31,8],[31,9,31,10],[31,11,31,12],[31,13,31,14],[31,15,31,16],[31,17,31,18],[31,19,31,20],[31,21,31,22],[28,13,28,14],[28,15,28,16],[28,17,28,18],[28,19,28,20],[28,21,28,22],[29,7,29,8],[29,9,29,10],[29,11,29,12],[29,13,29,14],[29,15,29,16],[29,17,29,18],[29,19,29,20],[29,21,29,22],[64,21,64,22],[27,7,27,8],[27,9,27,10],[26,9,26,10],[20,0,22,0],[25,19,25,20],[25,21,25,22],[26,7,26,8],[22,11,22,12],[22,13,22,14],[22,15,22,16],[22,17,22,18],[22,19,22,20],[22,21,22,22],[20,1,22,1],[20,2,22,2],[20,7,20,22],[23,19,23,20],[23,21,23,22],[24,7,24,8],[24,9,24,10],[28,7,28,8],[28,9,28,10],[28,11,28,12],[24,11,24,12],[24,13,24,14],[24,15,24,16],[24,17,24,18],[24,19,24,20],[24,21,24,22],[23,7,23,8],[23,9,23,10],[23,11,23,12],[64,11,64,12],[64,13,64,14],[64,15,64,16],[26,21,26,22],[25,7,25,8],[25,9,25,10],[25,11,25,12],[25,13,25,14],[25,15,25,16],[56,7,56,8],[56,11,56,12],[56,13,56,14],[56,19,56,20],[56,21,56,22],[57,7,57,8],[26,11,26,12],[26,13,26,14],[26,15,26,16],[26,17,26,18],[26,19,26,20],[64,7,64,8],[64,9,64,10],[64,17,64,18],[64,19,64,20],[21,7,21,14],[21,15,21,22],[22,7,22,8],[22,9,22,10],[25,17,25,18],[66,19,66,20],[66,21,66,22],[65,7,65,8],[65,9,65,10],[65,11,65,12],[65,13,65,14],[65,15,65,16],[65,17,65,18],[23,13,23,14],[23,15,23,16],[23,17,23,18],[27,11,27,12],[27,13,27,14],[27,15,27,16],[27,17,27,18],[65,19,65,20],[65,21,65,22],[27,19,27,20],[27,21,27,22],[67,21,67,22],[68,7,68,8],[68,9,68,10],[68,11,68,12],[68,13,68,14],[68,15,68,16],[68,17,68,18],[68,19,68,20],[68,21,68,22],[67,7,67,8],[67,9,67,10],[67,11,67,12],[67,13,67,14],[67,15,67,16],[67,17,67,18],[71,17,71,18],[66,7,66,8],[66,9,66,10],[66,11,66,12],[66,13,66,14],[66,15,66,16],[66,17,66,18],[69,19,69,20],[69,21,69,22],[70,7,70,8],[70,9,70,10],[70,11,70,12],[70,13,70,14],[70,15,70,16],[70,17,70,18],[70,19,70,20],[70,21,70,22],[69,7,69,8],[69,9,69,10],[69,11,69,12],[69,13,69,14],[69,15,69,16],[69,17,69,18],[67,19,67,20],[76,0,76,1],[77,0,80,1],[77,2,80,22],[73,19,73,20],[73,21,73,22],[73,7,73,8],[73,9,73,10],[73,11,73,12],[73,13,73,14],[73,15,73,16],[73,17,73,18],[74,7,74,8],[74,9,74,10],[74,11,74,12],[74,13,74,14],[74,15,74,16],[74,17,74,18],[74,19,74,20],[74,21,74,22],[75,7,75,8],[75,9,75,10],[75,11,75,12],[75,13,75,14],[75,15,75,16],[17,23,18,28],[75,17,75,18],[75,19,75,20],[75,21,75,22],[20,3,21,5],[19,23,20,29],[22,23,22,27],[23,23,26,27],[28,23,31,27],[71,19,71,20],[71,21,71,22],[72,7,72,8],[72,9,72,10],[72,11,72,12],[72,13,72,14],[72,15,72,16],[72,17,72,18],[72,19,72,20],[72,21,72,22],[71,7,71,8],[71,9,71,10],[71,11,71,12],[71,13,71,14],[71,15,71,16]]}
["Grazing Management Strategies"]
["Grazing management systems are planned forage and livestock management programs designed to accomplish range improvement.  A grazing system is developed to maintain or improve range similarity index, productivity, health and vigor while simultaneously achieving a high, sustainable level of livestock production.  "]
["Types of Grazing Systems:  Prescribed grazing is a grazing system which is tailored to the individual operation and designed to achieve the specific objectives of the operation.  To be effective a grazing strategy should be flexible and modified with changes in weather, plant growth and disturbances.  Which every grazing management strategy is implemented, it should allow for adequate recovery time of the primary forage grasses before the pasture, paddock, or grazing unit is grazed again.  Recovery should be based upon the growth of key forage species, and not based solely on the days of rest or the calendar.  There are several general types of grazing management systems:"]
["1.  Rest Rotation:  In a rest rotation grazing management system, one or more pastures are left ungrazed for the entire growing season.  Each year a different pasture(s) is ungrazed; in other words, the rest is rotated.  Incorporating rest so that each pasture is ungrazed once every 5-7 years builds in resilience, aids in drought recovery and provides wildlife habitat.  Stocking rates should be adjusted to account for the forage that is unavailable each year.  Often times, a rest rotation is coupled with a deferred rotation rather than grazed pastures being grazed season long."]
["2.  Deferred Rotation:  In a deferred rotation grazing management system, a herd is rotated through three or more pastures.  While one pasture is being grazed, the remaining pastures are not grazed (deferred).  The pastures are grazed in a planned sequence.  The sequence of grazing is changed each year to make certain that the grasses are not being grazed during the same time in the growing season in consecutive years.  "]
["3.  High Intensity/Low Frequency Rotation:  In a high intensity/low frequency rotation grazing management system, one herd of livestock grazes eight or more pastures in a planned sequence. Livestock are moved into one pasture and the other pastures are rested. When the forage is grazed to the desired intensity, livestock are moved to the next pasture in the rotation. Livestock typically stay in a pasture 10 to 25 days. The frequent moves allow long rest periods for each pasture.  The sequence of grazing is changed each year.  Depending upon production and precipitation, pastures may be grazed once per growing season, or more than once per growing season.  "]
["4.  Short-duration. (Management Intensive Grazing.) This is similar to the high intensity/low frequency system, except the speed of the rotation is adjusted according to the growth rate and the required rest period of the plants. During the peak of the growing season, livestock are moved rapidly with slower moves when pasture growth rate slow down.  In some systems, livestock are moved every 3-5 days or more frequently.  Mob grazing is a variation of this type of grazing strategy.  With mob grazing, stock density is very high and moves may be as often as 3 or more times per day and paddocks are temporary and are in different locations each time the unit is grazed.  Usually, each paddock is grazed only one time per year."]
["Purpose of prescribed grazing management systems:  Prescribed grazing systems are implemented in order to achieve any number of objectives, which include but are not limited to:"]
[null,"¨","Maintain or increase improvement in plant cover while properly using the forage in all pastures."]
[null,"¨","Improve efficiency of grazing by uniformly using all parts of each grazed pasture."]
[null,"¨","Permit a higher level of livestock production."]
[null,"¨","Insure a supply of forage throughout the grazing season."]
[null,"¨","Insure that an adequate feed and forage balance is maintained for the unit."]
[null,"¨","Improve control of undesirable plants."]
[null,"¨","Allow easier handling and observation of livestock."]
[null,"¨","Enhance wildlife habitat."]
[null,"¨","Enhance watershed protection."]
["CLIENT NAME:",null,{"$f":"NEW_528_Forage_Balance!C2","v":"Mary Rancher - Sunnyvale Ranch"},null,null,null,null,null,null,"YEAR:",null,"2021-2022",null,null,null,"CONTRACT NO:",null,null,null,{"$f":"NEW_528_Forage_Balance!R2","v":"12345K"},null,null,null,"You can create a copy of  this sheet for each future year that you would like to develop a grazing schedule."]
["LENGTH GRAZING SEASON (DAYS):",null,null,null,{"$f":"NEW_528_Forage_Balance!Q68","v":195},null,null,null,null,"Planned Grazing Dates:",null,null,null,null,null,null,"May 1 - November 15"]
[null,null,null,null,null,null,null,null,null,null,null,null,null,null,null,null,null,null,null,null,null,null,null,"This schedule can be used when you would like to display two  years to show a different order/timing of grazing."]
["Field Number","Forage Type","Acres per Field","Planned/Estimated Days",null,null,null,"Planned and Actual Dates"]
[null,null,null,null,null,null,null,"Year 1",null,null,null,null,null,null,null,"Year 2"]
[null,null,null,"Estimated Available AUM or AUD","% of AUM or AUD per Pasture","Estimated Days Grazing",null,"Planned In Date",null,"Planned Out Date",null,"Actual In Date",null,"Actual Out Date",null,"Planned In Date",null,"Planned Out Date",null,"Actual In Date",null,"Actual Out Date"]
[{"$f":"NEW_528_Forage_Balance!G69","v":"R1A"},{"$f":"IF(A24=0,\"\",(NEW_528_Forage_Balance!I69))","v":"Range"},{"$f":"IF(A24=0,\"\",(NEW_528_Forage_Balance!H69))","v":305},{"$f":"IF(A24=0,\"\",(NEW_528_Forage_Balance!L69))","v":115},{"$f":"IF(A24=0,\"\",D24/$D$77*100)","v":16.129032258064516},{"$f":"IF(A24=0,\"\",$E$19*E24/100)","v":31.451612903225804},null,"2020-05-01",null,{"$f":"IF(H24=0,\"\",(H24+F24))","v":"2020-06-01T10:50:19.355"},null,null,null,null,null,"2020-08-06",null,{"$f":"IF(P24=0,\"\",(P24+F24))","v":"2020-09-06T10:50:19.355"},null,null,null,null,null,"Enter the planned in date in this format:  5/15.  If you use this format, the planned out date will calculate automatically based on the estimated number of days grazing available."]
[{"$f":"NEW_528_Forage_Balance!G70","v":"R1B"},{"$f":"IF(A25=0,\"\",(NEW_528_Forage_Balance!I70))","v":"Range"},{"$f":"IF(A25=0,\"\",(NEW_528_Forage_Balance!H70))","v":335},{"$f":"IF(A25=0,\"\",(NEW_528_Forage_Balance!L70))","v":92},12.903225806451612,{"$f":"IF(A25=0,\"\",$E$19*E25/100)","v":25.161290322580644},null,"2020-06-02",null,{"$f":"IF(H25=0,\"\",(H25+F25))","v":"2020-06-27T03:52:15.484"},null,null,null,null,null,"2020-09-07",null,{"$f":"IF(P25=0,\"\",(P25+F25))","v":"2020-10-02T03:52:15.484"}]
[{"$f":"NEW_528_Forage_Balance!G71","v":"R2"},{"$f":"IF(A26=0,\"\",(NEW_528_Forage_Balance!I71))","v":"Range"},{"$f":"IF(A26=0,\"\",(NEW_528_Forage_Balance!H71))","v":320},{"$f":"IF(A26=0,\"\",(NEW_528_Forage_Balance!L71))","v":122},17.110799438990181,33.366058906030851,null,"2020-06-28",null,"2020-07-31T08:47:07.489",null,null,null,null,null,"2020-10-03",null,"2020-11-05T08:47:07.489"]
[{"$f":"NEW_528_Forage_Balance!G72","v":"R3"},{"$f":"IF(A27=0,\"\",(NEW_528_Forage_Balance!I72))","v":"Range"},{"$f":"IF(A27=0,\"\",(NEW_528_Forage_Balance!H72))","v":80},{"$f":"IF(A27=0,\"\",(NEW_528_Forage_Balance!L72))","v":35},4.9088359046283312,9.5722300140252461,null,"2020-08-01",null,"2020-08-10T13:44:00.673",null,null,null,null,null,"2020-11-06",null,"2020-11-15T13:44:00.673"]
[{"$f":"NEW_528_Forage_Balance!G73","v":"R4"},{"$f":"IF(A28=0,\"\",(NEW_528_Forage_Balance!I73))","v":"Range"},{"$f":"IF(A28=0,\"\",(NEW_528_Forage_Balance!H73))","v":160},{"$f":"IF(A28=0,\"\",(NEW_528_Forage_Balance!L73))","v":58},8.1346423562412333,15.862552594670406,null,"2020-08-11",null,"2020-08-26T20:42:04.544",null,null,null,null,null,"2020-05-01",null,"2020-05-16T20:42:04.544"]
[{"$f":"NEW_528_Forage_Balance!G74","v":"R5A"},{"$f":"IF(A29=0,\"\",(NEW_528_Forage_Balance!I74))","v":"Range"},{"$f":"IF(A29=0,\"\",(NEW_528_Forage_Balance!H74))","v":240},{"$f":"IF(A29=0,\"\",(NEW_528_Forage_Balance!L74))","v":66},9.2566619915848527,18.050490883590463,null,"2020-08-27",null,"2020-09-14T01:12:42.412",null,null,null,null,null,"2020-05-17",null,"2020-06-04T01:12:42.412",null,null,null,null,null,"This scheduler is set up for 40 pastures; hide unused rows and set page breaks before printing. To view print layout and page breaks, go to view, page break preview and drag page breaks to desired location(s)."]
[{"$f":"NEW_528_Forage_Balance!G75","v":"R5B"},{"$f":"IF(A30=0,\"\",(NEW_528_Forage_Balance!I75))","v":"Range"},{"$f":"IF(A30=0,\"\",(NEW_528_Forage_Balance!H75))","v":263},{"$f":"IF(A30=0,\"\",(NEW_528_Forage_Balance!L75))","v":106},14.866760168302944,28.990182328190741,null,"2020-09-15",null,"2020-10-13T23:45:51.753",null,null,null,null,null,"2020-06-05",null,"2020-07-03T23:45:51.753"]
[{"$f":"NEW_528_Forage_Balance!G76","v":"R5C"},{"$f":"IF(A31=0,\"\",(NEW_528_Forage_Balance!I76))","v":"Range"},{"$f":"IF(A31=0,\"\",(NEW_528_Forage_Balance!H76))","v":137},{"$f":"IF(A31=0,\"\",(NEW_528_Forage_Balance!L76))","v":29},4.0673211781206167,7.9312762973352031,null,"2020-10-14",null,"2020-10-21T22:21:02.272",null,null,null,null,null,"2020-07-04",null,"2020-07-11T22:21:02.272"]
[{"$f":"NEW_528_Forage_Balance!G77","v":"R6"},{"$f":"IF(A32=0,\"\",(NEW_528_Forage_Balance!I77))","v":"Range"},{"$f":"IF(A32=0,\"\",(NEW_528_Forage_Balance!H77))","v":160},{"$f":"IF(A32=0,\"\",(NEW_528_Forage_Balance!L77))","v":90},12.622720897615707,24.614305750350628,null,"2020-10-22",null,"2020-11-15T14:44:36.017",null,null,null,null,null,"2020-07-12",null,"2020-08-05T14:44:36.017"]
[{"$f":"NEW_528_Forage_Balance!G78","v":0},{"$f":"IF(A33=0,\"\",(NEW_528_Forage_Balance!I78))","v":""},{"$f":"IF(A33=0,\"\",(NEW_528_Forage_Balance!H78))","v":""},{"$f":"IF(A33=0,\"\",(NEW_528_Forage_Balance!L78))","v":""},"","",null,null,null,"",null,null,null,null,null,null,null,""]
[{"$f":"NEW_528_Forage_Balance!G79","v":0},{"$f":"IF(A34=0,\"\",(NEW_528_Forage_Balance!I79))","v":""},{"$f":"IF(A34=0,\"\",(NEW_528_Forage_Balance!H79))","v":""},{"$f":"IF(A34=0,\"\",(NEW_528_Forage_Balance!L79))","v":""},"","",null,null,null,"",null,null,null,null,null,null,null,""]
[{"$f":"NEW_528_Forage_Balance!G80","v":0},{"$f":"IF(A35=0,\"\",(NEW_528_Forage_Balance!I80))","v":""},{"$f":"IF(A35=0,\"\",(NEW_528_Forage_Balance!H80))","v":""},{"$f":"IF(A35=0,\"\",(NEW_528_Forage_Balance!L80))","v":""},"","",null,null,null,"",null,null,null,null,null,null,null,""]
[{"$f":"NEW_528_Forage_Balance!G81","v":0},{"$f":"IF(A36=0,\"\",(NEW_528_Forage_Balance!I81))","v":""},{"$f":"IF(A36=0,\"\",(NEW_528_Forage_Balance!H81))","v":""},{"$f":"IF(A36=0,\"\",(NEW_528_Forage_Balance!L81))","v":""},"","",null,null,null,"",null,null,null,null,null,null,null,""]
[{"$f":"NEW_528_Forage_Balance!G82","v":0},{"$f":"IF(A37=0,\"\",(NEW_528_Forage_Balance!I82))","v":""},{"$f":"IF(A37=0,\"\",(NEW_528_Forage_Balance!H82))","v":""},{"$f":"IF(A37=0,\"\",(NEW_528_Forage_Balance!L82))","v":""},"","",null,null,null,"",null,null,null,null,null,null,null,""]
[{"$f":"NEW_528_Forage_Balance!G83","v":0},{"$f":"IF(A38=0,\"\",(NEW_528_Forage_Balance!I83))","v":""},{"$f":"IF(A38=0,\"\",(NEW_528_Forage_Balance!H83))","v":""},{"$f":"IF(A38=0,\"\",(NEW_528_Forage_Balance!L83))","v":""},"","",null,null,null,"",null,null,null,null,null,null,null,""]
[{"$f":"NEW_528_Forage_Balance!G84","v":0},{"$f":"IF(A39=0,\"\",(NEW_528_Forage_Balance!I84))","v":""},{"$f":"IF(A39=0,\"\",(NEW_528_Forage_Balance!H84))","v":""},{"$f":"IF(A39=0,\"\",(NEW_528_Forage_Balance!L84))","v":""},"","",null,null,null,"",null,null,null,null,null,null,null,""]
[{"$f":"NEW_528_Forage_Balance!G85","v":0},{"$f":"IF(A40=0,\"\",(NEW_528_Forage_Balance!I85))","v":""},{"$f":"IF(A40=0,\"\",(NEW_528_Forage_Balance!H85))","v":""},{"$f":"IF(A40=0,\"\",(NEW_528_Forage_Balance!L85))","v":""},"","",null,null,null,"",null,null,null,null,null,null,null,""]
[{"$f":"NEW_528_Forage_Balance!G86","v":0},{"$f":"IF(A41=0,\"\",(NEW_528_Forage_Balance!I86))","v":""},{"$f":"IF(A41=0,\"\",(NEW_528_Forage_Balance!H86))","v":""},{"$f":"IF(A41=0,\"\",(NEW_528_Forage_Balance!L86))","v":""},"","",null,null,null,"",null,null,null,null,null,null,null,""]
[{"$f":"NEW_528_Forage_Balance!G87","v":0},{"$f":"IF(A42=0,\"\",(NEW_528_Forage_Balance!I87))","v":""},{"$f":"IF(A42=0,\"\",(NEW_528_Forage_Balance!H87))","v":""},{"$f":"IF(A42=0,\"\",(NEW_528_Forage_Balance!L87))","v":""},"","",null,null,null,"",null,null,null,null,null,null,null,""]
[{"$f":"NEW_528_Forage_Balance!G88","v":0},{"$f":"IF(A43=0,\"\",(NEW_528_Forage_Balance!I88))","v":""},{"$f":"IF(A43=0,\"\",(NEW_528_Forage_Balance!H88))","v":""},{"$f":"IF(A43=0,\"\",(NEW_528_Forage_Balance!L88))","v":""},"","",null,null,null,"",null,null,null,null,null,null,null,""]
[{"$f":"NEW_528_Forage_Balance!G89","v":0},{"$f":"IF(A44=0,\"\",(NEW_528_Forage_Balance!I89))","v":""},{"$f":"IF(A44=0,\"\",(NEW_528_Forage_Balance!H89))","v":""},{"$f":"IF(A44=0,\"\",(NEW_528_Forage_Balance!L89))","v":""},"","",null,null,null,"",null,null,null,null,null,null,null,""]
[{"$f":"NEW_528_Forage_Balance!G90","v":0},{"$f":"IF(A45=0,\"\",(NEW_528_Forage_Balance!I90))","v":""},{"$f":"IF(A45=0,\"\",(NEW_528_Forage_Balance!H90))","v":""},{"$f":"IF(A45=0,\"\",(NEW_528_Forage_Balance!L90))","v":""},"","",null,null,null,"",null,null,null,null,null,null,null,""]
[{"$f":"NEW_528_Forage_Balance!G91","v":0},{"$f":"IF(A46=0,\"\",(NEW_528_Forage_Balance!I91))","v":""},{"$f":"IF(A46=0,\"\",(NEW_528_Forage_Balance!H91))","v":""},{"$f":"IF(A46=0,\"\",(NEW_528_Forage_Balance!L91))","v":""},"","",null,null,null,"",null,null,null,null,null,null,null,""]
[{"$f":"NEW_528_Forage_Balance!G92","v":0},{"$f":"IF(A47=0,\"\",(NEW_528_Forage_Balance!I92))","v":""},{"$f":"IF(A47=0,\"\",(NEW_528_Forage_Balance!H92))","v":""},{"$f":"IF(A47=0,\"\",(NEW_528_Forage_Balance!L92))","v":""},"","",null,null,null,"",null,null,null,null,null,null,null,""]
[{"$f":"NEW_528_Forage_Balance!G93","v":0},{"$f":"IF(A48=0,\"\",(NEW_528_Forage_Balance!I93))","v":""},{"$f":"IF(A48=0,\"\",(NEW_528_Forage_Balance!H93))","v":""},{"$f":"IF(A48=0,\"\",(NEW_528_Forage_Balance!L93))","v":""},"","",null,null,null,"",null,null,null,null,null,null,null,""]
[{"$f":"NEW_528_Forage_Balance!G94","v":0},{"$f":"IF(A49=0,\"\",(NEW_528_Forage_Balance!I94))","v":""},{"$f":"IF(A49=0,\"\",(NEW_528_Forage_Balance!H94))","v":""},{"$f":"IF(A49=0,\"\",(NEW_528_Forage_Balance!L94))","v":""},"","",null,null,null,"",null,null,null,null,null,null,null,""]
[{"$f":"NEW_528_Forage_Balance!G95","v":0},{"$f":"IF(A50=0,\"\",(NEW_528_Forage_Balance!I95))","v":""},{"$f":"IF(A50=0,\"\",(NEW_528_Forage_Balance!H95))","v":""},{"$f":"IF(A50=0,\"\",(NEW_528_Forage_Balance!L95))","v":""},"","",null,null,null,"",null,null,null,null,null,null,null,""]
[{"$f":"NEW_528_Forage_Balance!G96","v":0},{"$f":"IF(A51=0,\"\",(NEW_528_Forage_Balance!I96))","v":""},{"$f":"IF(A51=0,\"\",(NEW_528_Forage_Balance!H96))","v":""},{"$f":"IF(A51=0,\"\",(NEW_528_Forage_Balance!L96))","v":""},"","",null,null,null,"",null,null,null,null,null,null,null,""]
[{"$f":"NEW_528_Forage_Balance!G97","v":0},{"$f":"IF(A52=0,\"\",(NEW_528_Forage_Balance!I97))","v":""},{"$f":"IF(A52=0,\"\",(NEW_528_Forage_Balance!H97))","v":""},{"$f":"IF(A52=0,\"\",(NEW_528_Forage_Balance!L97))","v":""},"","",null,null,null,"",null,null,null,null,null,null,null,""]
[{"$f":"NEW_528_Forage_Balance!G98","v":0},{"$f":"IF(A53=0,\"\",(NEW_528_Forage_Balance!I98))","v":""},{"$f":"IF(A53=0,\"\",(NEW_528_Forage_Balance!H98))","v":""},{"$f":"IF(A53=0,\"\",(NEW_528_Forage_Balance!L98))","v":""},"","",null,null,null,"",null,null,null,null,null,null,null,""]
[{"$f":"NEW_528_Forage_Balance!G99","v":0},{"$f":"IF(A54=0,\"\",(NEW_528_Forage_Balance!I99))","v":""},{"$f":"IF(A54=0,\"\",(NEW_528_Forage_Balance!H99))","v":""},{"$f":"IF(A54=0,\"\",(NEW_528_Forage_Balance!L99))","v":""},"","",null,null,null,"",null,null,null,null,null,null,null,""]
[{"$f":"NEW_528_Forage_Balance!G100","v":0},{"$f":"IF(A55=0,\"\",(NEW_528_Forage_Balance!I100))","v":""},{"$f":"IF(A55=0,\"\",(NEW_528_Forage_Balance!H100))","v":""},{"$f":"IF(A55=0,\"\",(NEW_528_Forage_Balance!L100))","v":""},"","",null,null,null,"",null,null,null,null,null,null,null,""]
[{"$f":"NEW_528_Forage_Balance!G101","v":0},{"$f":"IF(A56=0,\"\",(NEW_528_Forage_Balance!I101))","v":""},{"$f":"IF(A56=0,\"\",(NEW_528_Forage_Balance!H101))","v":""},{"$f":"IF(A56=0,\"\",(NEW_528_Forage_Balance!L101))","v":""},{"$f":"IF(A56=0,\"\",D56/$D$77*100)","v":""},"",null,null,null,"",null,null,null,null,null,null,null,""]
[{"$f":"NEW_528_Forage_Balance!G102","v":0},{"$f":"IF(A57=0,\"\",(NEW_528_Forage_Balance!I102))","v":""},{"$f":"IF(A57=0,\"\",(NEW_528_Forage_Balance!H102))","v":""},{"$f":"IF(A57=0,\"\",(NEW_528_Forage_Balance!L102))","v":""},"","",null,null,null,"",null,null,null,null,null,null,null,""]
[{"$f":"NEW_528_Forage_Balance!G103","v":0},{"$f":"IF(A58=0,\"\",(NEW_528_Forage_Balance!I103))","v":""},{"$f":"IF(A58=0,\"\",(NEW_528_Forage_Balance!H103))","v":""},{"$f":"IF(A58=0,\"\",(NEW_528_Forage_Balance!L103))","v":""},"","",null,null,null,"",null,null,null,null,null,null,null,""]
[{"$f":"NEW_528_Forage_Balance!G104","v":0},{"$f":"IF(A59=0,\"\",(NEW_528_Forage_Balance!I104))","v":""},{"$f":"IF(A59=0,\"\",(NEW_528_Forage_Balance!H104))","v":""},{"$f":"IF(A59=0,\"\",(NEW_528_Forage_Balance!L104))","v":""},"","",null,null,null,"",null,null,null,null,null,null,null,""]
[{"$f":"NEW_528_Forage_Balance!G105","v":0},{"$f":"IF(A60=0,\"\",(NEW_528_Forage_Balance!I105))","v":""},{"$f":"IF(A60=0,\"\",(NEW_528_Forage_Balance!H105))","v":""},{"$f":"IF(A60=0,\"\",(NEW_528_Forage_Balance!L105))","v":""},"","",null,null,null,"",null,null,null,null,null,null,null,""]
[{"$f":"NEW_528_Forage_Balance!G106","v":0},{"$f":"IF(A61=0,\"\",(NEW_528_Forage_Balance!I106))","v":""},{"$f":"IF(A61=0,\"\",(NEW_528_Forage_Balance!H106))","v":""},{"$f":"IF(A61=0,\"\",(NEW_528_Forage_Balance!L106))","v":""},"","",null,null,null,"",null,null,null,null,null,null,null,""]
[{"$f":"NEW_528_Forage_Balance!G107","v":0},{"$f":"IF(A62=0,\"\",(NEW_528_Forage_Balance!I107))","v":""},{"$f":"IF(A62=0,\"\",(NEW_528_Forage_Balance!H107))","v":""},{"$f":"IF(A62=0,\"\",(NEW_528_Forage_Balance!L107))","v":""},"","",null,null,null,"",null,null,null,null,null,null,null,""]
[{"$f":"NEW_528_Forage_Balance!G108","v":0},{"$f":"IF(A63=0,\"\",(NEW_528_Forage_Balance!I108))","v":""},{"$f":"IF(A63=0,\"\",(NEW_528_Forage_Balance!H108))","v":""},{"$f":"IF(A63=0,\"\",(NEW_528_Forage_Balance!L108))","v":""},"","",null,null,null,"",null,null,null,null,null,null,null,""]
[{"$f":"NEW_528_Forage_Balance!G109","v":0},{"$f":"IF(A64=0,\"\",(NEW_528_Forage_Balance!I109))","v":""},{"$f":"IF(A64=0,\"\",(NEW_528_Forage_Balance!H109))","v":""},{"$f":"IF(A64=0,\"\",(NEW_528_Forage_Balance!L109))","v":""},"","",null,null,null,"",null,null,null,null,null,null,null,""]
[{"$f":"NEW_528_Forage_Balance!G110","v":0},{"$f":"IF(A65=0,\"\",(NEW_528_Forage_Balance!I110))","v":""},{"$f":"IF(A65=0,\"\",(NEW_528_Forage_Balance!H110))","v":""},{"$f":"IF(A65=0,\"\",(NEW_528_Forage_Balance!L110))","v":""},"","",null,null,null,"",null,null,null,null,null,null,null,""]
[{"$f":"NEW_528_Forage_Balance!G111","v":0},{"$f":"IF(A66=0,\"\",(NEW_528_Forage_Balance!I111))","v":""},{"$f":"IF(A66=0,\"\",(NEW_528_Forage_Balance!H111))","v":""},{"$f":"IF(A66=0,\"\",(NEW_528_Forage_Balance!L111))","v":""},"","",null,null,null,"",null,null,null,null,null,null,null,""]
[{"$f":"NEW_528_Forage_Balance!G112","v":0},{"$f":"IF(A67=0,\"\",(NEW_528_Forage_Balance!I112))","v":""},{"$f":"IF(A67=0,\"\",(NEW_528_Forage_Balance!H112))","v":""},{"$f":"IF(A67=0,\"\",(NEW_528_Forage_Balance!L112))","v":""},"","",null,null,null,"",null,null,null,null,null,null,null,""]
[{"$f":"NEW_528_Forage_Balance!G113","v":0},{"$f":"IF(A68=0,\"\",(NEW_528_Forage_Balance!I113))","v":""},{"$f":"IF(A68=0,\"\",(NEW_528_Forage_Balance!H113))","v":""},{"$f":"IF(A68=0,\"\",(NEW_528_Forage_Balance!L113))","v":""},"","",null,null,null,"",null,null,null,null,null,null,null,""]
[{"$f":"NEW_528_Forage_Balance!G114","v":0},{"$f":"IF(A69=0,\"\",(NEW_528_Forage_Balance!I114))","v":""},{"$f":"IF(A69=0,\"\",(NEW_528_Forage_Balance!H114))","v":""},{"$f":"IF(A69=0,\"\",(NEW_528_Forage_Balance!L114))","v":""},"","",null,null,null,"",null,null,null,null,null,null,null,""]
[{"$f":"NEW_528_Forage_Balance!G115","v":0},{"$f":"IF(A70=0,\"\",(NEW_528_Forage_Balance!I115))","v":""},{"$f":"IF(A70=0,\"\",(NEW_528_Forage_Balance!H115))","v":""},{"$f":"IF(A70=0,\"\",(NEW_528_Forage_Balance!L115))","v":""},"","",null,null,null,"",null,null,null,null,null,null,null,""]
[{"$f":"NEW_528_Forage_Balance!G116","v":0},{"$f":"IF(A71=0,\"\",(NEW_528_Forage_Balance!I116))","v":""},{"$f":"IF(A71=0,\"\",(NEW_528_Forage_Balance!H116))","v":""},{"$f":"IF(A71=0,\"\",(NEW_528_Forage_Balance!L116))","v":""},"","",null,null,null,"",null,null,null,null,null,null,null,""]
[{"$f":"NEW_528_Forage_Balance!G117","v":0},{"$f":"IF(A72=0,\"\",(NEW_528_Forage_Balance!I117))","v":""},{"$f":"IF(A72=0,\"\",(NEW_528_Forage_Balance!H117))","v":""},{"$f":"IF(A72=0,\"\",(NEW_528_Forage_Balance!L117))","v":""},"","",null,null,null,"",null,null,null,null,null,null,null,""]
[{"$f":"NEW_528_Forage_Balance!G118","v":0},{"$f":"IF(A73=0,\"\",(NEW_528_Forage_Balance!I118))","v":""},{"$f":"IF(A73=0,\"\",(NEW_528_Forage_Balance!H118))","v":""},{"$f":"IF(A73=0,\"\",(NEW_528_Forage_Balance!L118))","v":""},"","",null,null,null,"",null,null,null,null,null,null,null,""]
[{"$f":"NEW_528_Forage_Balance!G119","v":0},{"$f":"IF(A74=0,\"\",(NEW_528_Forage_Balance!I119))","v":""},{"$f":"IF(A74=0,\"\",(NEW_528_Forage_Balance!H119))","v":""},{"$f":"IF(A74=0,\"\",(NEW_528_Forage_Balance!L119))","v":""},"","",null,null,null,"",null,null,null,null,null,null,null,""]
[{"$f":"NEW_528_Forage_Balance!G120","v":0},{"$f":"IF(A75=0,\"\",(NEW_528_Forage_Balance!I120))","v":""},{"$f":"IF(A75=0,\"\",(NEW_528_Forage_Balance!H120))","v":""},{"$f":"IF(A75=0,\"\",(NEW_528_Forage_Balance!L120))","v":""},"","",null,null,null,"",null,null,null,null,null,null,null,""]
[{"$f":"NEW_528_Forage_Balance!G121","v":0},{"$f":"IF(A76=0,\"\",(NEW_528_Forage_Balance!I121))","v":""},{"$f":"IF(A76=0,\"\",(NEW_528_Forage_Balance!H121))","v":""},{"$f":"IF(A76=0,\"\",(NEW_528_Forage_Balance!L121))","v":""},"",{"$f":"IF(A76=0,\"\",$E$19*E76/100)","v":""},null,null,null,{"$f":"IF(H76=0,\"\",(H76+F76))","v":""},null,null,null,null,null,null,null,""]
[null,null,{"$f":"SUM(C24:C76)","v":2000},{"$f":"SUM(D24:D76)","v":713},{"$f":"SUM(E24:E76)","v":100},{"$f":"SUM(F24:F76)","v":195.00000000000003}]
["COMMENTS:"]

{"sheet":"528 JS - Schedule Option #3","index":8,"n_rows":78,"n_cols":24,"rows_kept":78,"cut":false,"hidden":false,"merged":[[75,7,75,8],[75,9,75,10],[75,11,75,12],[75,13,75,14],[75,15,75,16],[75,17,75,18],[75,19,75,20],[75,21,75,22],[6,0,6,22],[7,0,7,22],[8,2,8,21],[9,2,9,21],[10,2,10,22],[11,2,11,22],[20,0,22,0],[20,1,22,1],[20,2,22,2],[20,3,21,5],[22,7,22,8],[22,9,22,10],[22,11,22,12],[22,13,22,14],[22,15,22,16],[22,17,22,18],[0,0,0,22],[1,0,1,22],[2,0,2,22],[3,0,3,22],[4,0,4,22],[5,0,5,22],[18,0,18,3],[18,4,18,6],[18,9,18,15],[18,16,18,22],[12,2,12,22],[13,2,13,22],[14,2,14,22],[15,2,15,22],[16,2,16,22],[17,0,17,1],[17,2,17,7],[17,9,17,10],[17,11,17,14],[17,15,17,17],[22,19,22,20],[22,21,22,22],[17,19,17,22],[23,19,23,20],[23,21,23,22],[24,7,24,8],[24,9,24,10],[24,11,24,12],[24,13,24,14],[24,15,24,16],[24,17,24,18],[24,19,24,20],[24,21,24,22],[23,7,23,8],[23,9,23,10],[23,11,23,12],[23,13,23,14],[23,15,23,16],[23,17,23,18],[25,19,25,20],[25,21,25,22],[26,7,26,8],[26,9,26,10],[26,11,26,12],[26,13,26,14],[26,15,26,16],[26,17,26,18],[26,19,26,20],[26,21,26,22],[25,7,25,8],[25,9,25,10],[25,11,25,12],[25,13,25,14],[25,15,25,16],[25,17,25,18],[27,19,27,20],[27,21,27,22],[28,7,28,8],[28,9,28,10],[28,11,28,12],[28,13,28,14],[28,15,28,16],[28,17,28,18],[28,19,28,20],[28,21,28,22],[27,7,27,8],[27,9,27,10],[27,11,27,12],[27,13,27,14],[27,15,27,16],[27,17,27,18],[29,19,29,20],[29,21,29,22],[30,7,30,8],[30,9,30,10],[30,11,30,12],[30,13,30,14],[30,15,30,16],[30,17,30,18],[30,19,30,20],[30,21,30,22],[29,7,29,8],[29,9,29,10],[29,11,29,12],[29,13,29,14],[29,15,29,16],[29,17,29,18],[33,17,33,18],[31,19,31,20],[31,21,31,22],[32,7,32,8],[32,9,32,10],[32,11,32,12],[32,13,32,14],[32,15,32,16],[32,17,32,18],[32,19,32,20],[32,21,32,22],[31,7,31,8],[31,9,31,10],[31,11,31,12],[31,13,31,14],[31,15,31,16],[31,17,31,18],[33,15,33,16],[35,19,35,20],[35,21,35,22],[36,7,36,8],[36,9,36,10],[36,11,36,12],[36,13,36,14],[36,15,36,16],[36,17,36,18],[36,19,36,20],[36,21,36,22],[35,7,35,8],[35,9,35,10],[35,11,35,12],[35,13,35,14],[35,15,35,16],[35,17,35,18],[37,19,37,20],[37,21,37,22],[38,7,38,8],[38,9,38,10],[38,11,38,12],[38,13,38,14],[38,15,38,16],[38,17,38,18],[38,19,38,20],[38,21,38,22],[37,7,37,8],[37,9,37,10],[37,11,37,12],[37,13,37,14],[37,15,37,16],[37,17,37,18],[39,19,39,20],[39,21,39,22],[40,7,40,8],[40,9,40,10],[40,11,40,12],[40,13,40,14],[40,15,40,16],[40,17,40,18],[40,19,40,20],[40,21,40,22],[39,7,39,8],[39,9,39,10],[39,11,39,12],[39,13,39,14],[39,15,39,16],[39,17,39,18],[41,19,41,20],[41,21,41,22],[42,7,42,8],[42,9,42,10],[42,11,42,12],[42,13,42,14],[42,15,42,16],[42,17,42,18],[42,19,42,20],[42,21,42,22],[41,7,41,8],[41,9,41,10],[41,11,41,12],[41,13,41,14],[41,15,41,16],[41,17,41,18],[43,19,43,20],[43,21,43,22],[44,7,44,8],[44,9,44,10],[44,11,44,12],[44,13,44,14],[44,15,44,16],[44,17,44,18],[44,19,44,20],[44,21,44,22],[43,7,43,8],[43,9,43,10],[43,11,43,12],[43,13,43,14],[43,15,43,16],[43,17,43,18],[45,19,45,20],[45,21,45,22],[46,7,46,8],[46,9,46,10],[46,11,46,12],[46,13,46,14],[46,15,46,16],[46,17,46,18],[46,19,46,20],[46,21,46,22],[45,7,45,8],[45,9,45,10],[45,11,45,12],[45,13,45,14],[45,15,45,16],[45,17,45,18],[47,19,47,20],[47,21,47,22],[48,7,48,8],[48,9,48,10],[48,11,48,12],[48,13,48,14],[48,15,48,16],[48,17,48,18],[48,19,48,20],[48,21,48,22],[47,7,47,8],[47,9,47,10],[47,11,47,12],[47,13,47,14],[47,15,47,16],[47,17,47,18],[49,19,49,20],[49,21,49,22],[50,7,50,8],[50,9,50,10],[50,11,50,12],[50,13,50,14],[50,15,50,16],[50,17,50,18],[50,19,50,20],[50,21,50,22],[49,7,49,8],[49,9,49,10],[49,11,49,12],[49,13,49,14],[49,15,49,16],[49,17,49,18],[51,19,51,20],[51,21,51,22],[52,7,52,8],[52,9,52,10],[52,11,52,12],[52,13,52,14],[52,15,52,16],[52,17,52,18],[52,19,52,20],[52,21,52,22],[51,7,51,8],[51,9,51,10],[51,11,51,12],[51,13,51,14],[51,15,51,16],[51,17,51,18],[53,19,53,20],[53,21,53,22],[54,7,54,8],[54,9,54,10],[54,11,54,12],[54,13,54,14],[54,15,54,16],[54,17,54,18],[54,19,54,20],[54,21,54,22],[53,7,53,8],[53,9,53,10],[53,11,53,12],[53,13,53,14],[53,15,53,16],[53,17,53,18],[55,19,55,20],[55,21,55,22],[56,7,56,8],[56,9,56,10],[56,11,56,12],[56,13,56,14],[56,15,56,16],[56,17,56,18],[56,19,56,20],[56,21,56,22],[55,7,55,8],[55,9,55,10],[55,11,55,12],[55,13,55,14],[55,15,55,16],[55,17,55,18],[57,19,57,20],[57,21,57,22],[58,7,58,8],[58,9,58,10],[58,11,58,12],[58,13,58,14],[58,15,58,16],[58,17,58,18],[58,19,58,20],[58,21,58,22],[57,7,57,8],[57,9,57,10],[57,11,57,12],[57,13,57,14],[57,15,57,16],[57,17,57,18],[59,19,59,20],[59,21,59,22],[60,7,60,8],[60,9,60,10],[60,11,60,12],[60,13,60,14],[60,15,60,16],[60,17,60,18],[60,19,60,20],[60,21,60,22],[59,7,59,8],[59,9,59,10],[59,11,59,12],[59,13,59,14],[59,15,59,16],[59,17,59,18],[61,19,61,20],[61,21,61,22],[62,7,62,8],[62,9,62,10],[62,11,62,12],[62,13,62,14],[62,15,62,16],[62,17,62,18],[62,19,62,20],[62,21,62,22],[61,7,61,8],[61,9,61,10],[61,11,61,12],[61,13,61,14],[61,15,61,16],[61,17,61,18],[63,19,63,20],[63,21,63,22],[64,7,64,8],[64,9,64,10],[64,11,64,12],[64,13,64,14],[64,15,64,16],[64,17,64,18],[64,19,64,20],[64,21,64,22],[63,7,63,8],[63,9,63,10],[63,11,63,12],[63,13,63,14],[63,15,63,16],[63,17,63,18],[65,19,65,20],[65,21,65,22],[66,7,66,8],[66,9,66,10],[66,11,66,12],[66,13,66,14],[66,15,66,16],[66,17,66,18],[66,19,66,20],[66,21,66,22],[65,7,65,8],[65,9,65,10],[65,11,65,12],[65,13,65,14],[65,15,65,16],[65,17,65,18],[67,19,67,20],[67,21,67,22],[68,7,68,8],[68,9,68,10],[68,11,68,12],[68,13,68,14],[68,15,68,16],[68,17,68,18],[68,19,68,20],[68,21,68,22],[67,7,67,8],[67,9,67,10],[67,11,67,12],[67,13,67,14],[67,15,67,16],[67,17,67,18],[69,19,69,20],[69,21,69,22],[70,7,70,8],[70,9,70,10],[70,11,70,12],[70,13,70,14],[70,15,70,16],[70,17,70,18],[70,19,70,20],[70,21,70,22],[69,7,69,8],[69,9,69,10],[69,11,69,12],[69,13,69,14],[69,15,69,16],[69,17,69,18],[72,11,72,12],[72,13,72,14],[72,15,72,16],[72,17,72,18],[72,19,72,20],[72,21,72,22],[71,7,71,8],[71,9,71,10],[71,11,71,12],[71,13,71,14],[71,15,71,16],[71,17,71,18],[76,0,76,1],[77,0,80,1],[77,2,80,22],[21,7,21,10],[73,19,73,20],[73,21,73,22],[74,7,74,8],[74,9,74,10],[74,11,74,12],[74,13,74,14],[74,15,74,16],[74,17,74,18],[74,19,74,20],[74,21,74,22],[73,7,73,8],[73,9,73,10],[73,11,73,12],[73,13,73,14],[73,15,73,16],[73,17,73,18],[71,19,71,20],[71,21,71,22],[72,7,72,8],[72,9,72,10],[20,23,21,28],[26,23,29,27],[31,23,34,27],[24,23,25,29],[20,7,20,14],[20,15,20,22],[21,11,21,14],[21,15,21,18],[21,19,21,22],[22,23,23,29],[33,19,33,20],[33,21,33,22],[34,7,34,8],[34,9,34,10],[34,11,34,12],[34,13,34,14],[34,15,34,16],[34,17,34,18],[34,19,34,20],[34,21,34,22],[33,7,33,8],[33,9,33,10],[33,11,33,12],[33,13,33,14]]}
["Grazing Management Strategies"]
["Grazing management systems are planned forage and livestock management programs designed to accomplish range improvement.  A grazing system is developed to maintain or improve range similarity index, productivity, health and vigor while simultaneously achieving a high, sustainable level of livestock production.  "]
["Types of Grazing Systems:  Prescribed grazing is a grazing system which is tailored to the individual operation and designed to achieve the specific objectives of the operation.  To be effective a grazing strategy should be flexible and modified with changes in weather, plant growth and disturbances.  Which every grazing management strategy is implemented, it should allow for adequate recovery time of the primary forage grasses before the pasture, paddock, or grazing unit is grazed again.  Recovery should be based upon the growth of key forage species, and not based solely on the days of rest or the calendar.  There are several general types of grazing management systems:"]
["1.  Rest Rotation:  In a rest rotation grazing management system, one or more pastures are left ungrazed for the entire growing season.  Each year a different pasture(s) is ungrazed; in other words, the rest is rotated.  Incorporating rest so that each pasture is ungrazed once every 5-7 years builds in resilience, aids in drought recovery and provides wildlife habitat.  Stocking rates should be adjusted to account for the forage that is unavailable each year.  Often times, a rest rotation is coupled with a deferred rotation rather than grazed pastures being grazed season long."]
["2.  Deferred Rotation:  In a deferred rotation grazing management system, a herd is rotated through three or more pastures.  While one pasture is being grazed, the remaining pastures are not grazed (deferred).  The pastures are grazed in a planned sequence.  The sequence of grazing is changed each year to make certain that the grasses are not being grazed during the same time in the growing season in consecutive years.  "]
["3.  High Intensity/Low Frequency Rotation:  In a high intensity/low frequency rotation grazing management system, one herd of livestock grazes eight or more pastures in a planned sequence. Livestock are moved into one pasture and the other pastures are rested. When the forage is grazed to the desired intensity, livestock are moved to the next pasture in the rotation. Livestock typically stay in a pasture 10 to 25 days. The frequent moves allow long rest periods for each pasture.  The sequence of grazing is changed each year.  Depending upon production and precipitation, pastures may be grazed once per growing season, or more than once per growing season.  "]
["4.  Short-duration. (Management Intensive Grazing.) This is similar to the high intensity/low frequency system, except the speed of the rotation is adjusted according to the growth rate and the required rest period of the plants. During the peak of the growing season, livestock are moved rapidly with slower moves when pasture growth rate slow down.  In some systems, livestock are moved every 3-5 days or more frequently.  Mob grazing is a variation of this type of grazing strategy.  With mob grazing, stock density is very high and moves may be as often as 3 or more times per day and paddocks are temporary and are in different locations each time the unit is grazed.  Usually, each paddock is grazed only one time per year."]
["Purpose of prescribed grazing management systems:  Prescribed grazing systems are implemented in order to achieve any number of objectives, which include but are not limited to:"]
[null,"¨","Maintain or increase improvement in plant cover while properly using the forage in all pastures."]
[null,"¨","Improve efficiency of grazing by uniformly using all parts of each grazed pasture."]
[null,"¨","Permit a higher level of livestock production."]
[null,"¨","Insure a supply of forage throughout the grazing season."]
[null,"¨","Insure that an adequate feed and forage balance is maintained for the unit."]
[null,"¨","Improve control of undesirable plants."]
[null,"¨","Allow easier handling and observation of livestock."]
[null,"¨","Enhance wildlife habitat."]
[null,"¨","Enhance watershed protection."]
["CLIENT NAME:",null,{"$f":"NEW_528_Forage_Balance!C2","v":"Mary Rancher - Sunnyvale Ranch"},null,null,null,null,null,null,"YEAR:",null,2021,null,null,null,"CONTRACT NO:",null,null,null,{"$f":"NEW_528_Forage_Balance!R2","v":"12345K"}]
["LENGTH GRAZING SEASON (DAYS):",null,null,null,{"$f":"NEW_528_Forage_Balance!Q68","v":195},null,null,null,null,"Planned Grazing Dates:",null,null,null,null,null,null,"May 1 - November 15"]
[]
["Field Number ","Forage Type","Acres","Planned/Estimated Days",null,null,null,"Planned Dates",null,null,null,null,null,null,null,"Actual Dates",null,null,null,null,null,null,null,"You can create a copy of  this sheet for each future year that you would like to develop a grazing schedule."]
[null,null,null,null,null,null,null,"1st Grazing Period",null,null,null,"2nd Grazing Period",null,null,null,"1st Grazing Period",null,null,null,"2nd Grazing Period"]
[null,null,null,"Estimated Available AUM or AUD","% of AUM or AUD per field","Estimated Days per Field",null,"Planned In Date",null,"Planned Out Date",null,"Planned In Date",null,"Planned Out Date",null,"Actual In Date",null,"Actual Out Date",null,"Actual In Date",null,"Actual Out Date",null,"This schedule can be used when multiple grazing periods are planned in the same grazing season."]
[{"$f":"NEW_528_Forage_Balance!G69","v":"R1A"},{"$f":"IF(A24=0,\"\",(NEW_528_Forage_Balance!I69))","v":"Range"},{"$f":"IF(A24=0,\"\",(NEW_528_Forage_Balance!H69))","v":305},{"$f":"IF(A24=0,\"\",(NEW_528_Forage_Balance!L69))","v":115},{"$f":"IF(A24=0,\"\",D24/$D$77*100)","v":16.129032258064516},{"$f":"IF(A24=0,\"\",$E$19*E24/100)","v":31.451612903225804},null,"2020-05-01",null,"2020-05-08",null,"2020-08-31",null,"2020-09-23"]
[{"$f":"NEW_528_Forage_Balance!G70","v":"R1B"},{"$f":"IF(A25=0,\"\",(NEW_528_Forage_Balance!I70))","v":"Range"},{"$f":"IF(A25=0,\"\",(NEW_528_Forage_Balance!H70))","v":335},{"$f":"IF(A25=0,\"\",(NEW_528_Forage_Balance!L70))","v":92},12.903225806451612,{"$f":"IF(A25=0,\"\",$E$19*E25/100)","v":25.161290322580644},null,"2020-05-09",null,"2020-05-16",null,"2020-09-24",null,"2020-10-12"]
[{"$f":"NEW_528_Forage_Balance!G71","v":"R2"},{"$f":"IF(A26=0,\"\",(NEW_528_Forage_Balance!I71))","v":"Range"},{"$f":"IF(A26=0,\"\",(NEW_528_Forage_Balance!H71))","v":320},{"$f":"IF(A26=0,\"\",(NEW_528_Forage_Balance!L71))","v":122},17.110799438990181,33.366058906030851,null,"2020-05-17",null,"2020-05-24",null,"2020-10-13",null,"2020-11-08"]
[{"$f":"NEW_528_Forage_Balance!G72","v":"R3"},{"$f":"IF(A27=0,\"\",(NEW_528_Forage_Balance!I72))","v":"Range"},{"$f":"IF(A27=0,\"\",(NEW_528_Forage_Balance!H72))","v":80},{"$f":"IF(A27=0,\"\",(NEW_528_Forage_Balance!L72))","v":35},4.9088359046283312,9.5722300140252461,null,"2020-05-25",null,"2020-06-01",null,"2020-11-09",null,"2020-11-11",null,null,null,null,null,null,null,null,null,"This scheduler is set up for 40 pastures; hide unused rows and set page breaks before printing. To view print layout and page breaks, go to view, page break preview and drag page breaks to desired location(s)."]
[{"$f":"NEW_528_Forage_Balance!G73","v":"R4"},{"$f":"IF(A28=0,\"\",(NEW_528_Forage_Balance!I73))","v":"Range"},{"$f":"IF(A28=0,\"\",(NEW_528_Forage_Balance!H73))","v":160},{"$f":"IF(A28=0,\"\",(NEW_528_Forage_Balance!L73))","v":58},8.1346423562412333,15.862552594670406,null,"2020-06-02",null,"2020-06-09",null,"2020-11-12",null,"2020-11-15"]
[{"$f":"NEW_528_Forage_Balance!G74","v":"R5A"},{"$f":"IF(A29=0,\"\",(NEW_528_Forage_Balance!I74))","v":"Range"},{"$f":"IF(A29=0,\"\",(NEW_528_Forage_Balance!H74))","v":240},{"$f":"IF(A29=0,\"\",(NEW_528_Forage_Balance!L74))","v":66},9.2566619915848527,18.050490883590463,null,"2020-06-10",null,"2020-06-28"]
[{"$f":"NEW_528_Forage_Balance!G75","v":"R5B"},{"$f":"IF(A30=0,\"\",(NEW_528_Forage_Balance!I75))","v":"Range"},{"$f":"IF(A30=0,\"\",(NEW_528_Forage_Balance!H75))","v":263},{"$f":"IF(A30=0,\"\",(NEW_528_Forage_Balance!L75))","v":106},14.866760168302944,28.990182328190741,null,"2020-06-29",null,"2020-07-28"]
[{"$f":"NEW_528_Forage_Balance!G76","v":"R5C"},{"$f":"IF(A31=0,\"\",(NEW_528_Forage_Balance!I76))","v":"Range"},{"$f":"IF(A31=0,\"\",(NEW_528_Forage_Balance!H76))","v":137},{"$f":"IF(A31=0,\"\",(NEW_528_Forage_Balance!L76))","v":29},4.0673211781206167,7.9312762973352031,null,"2020-07-29",null,"2020-08-06"]
[{"$f":"NEW_528_Forage_Balance!G77","v":"R6"},{"$f":"IF(A32=0,\"\",(NEW_528_Forage_Balance!I77))","v":"Range"},{"$f":"IF(A32=0,\"\",(NEW_528_Forage_Balance!H77))","v":160},{"$f":"IF(A32=0,\"\",(NEW_528_Forage_Balance!L77))","v":90},12.622720897615707,24.614305750350628,null,"2020-08-06",null,"2020-08-30"]
[{"$f":"NEW_528_Forage_Balance!G78","v":0},{"$f":"IF(A33=0,\"\",(NEW_528_Forage_Balance!I78))","v":""},{"$f":"IF(A33=0,\"\",(NEW_528_Forage_Balance!H78))","v":""},{"$f":"IF(A33=0,\"\",(NEW_528_Forage_Balance!L78))","v":""},"",""]
[{"$f":"NEW_528_Forage_Balance!G79","v":0},{"$f":"IF(A34=0,\"\",(NEW_528_Forage_Balance!I79))","v":""},{"$f":"IF(A34=0,\"\",(NEW_528_Forage_Balance!H79))","v":""},{"$f":"IF(A34=0,\"\",(NEW_528_Forage_Balance!L79))","v":""},"",""]
[{"$f":"NEW_528_Forage_Balance!G80","v":0},{"$f":"IF(A35=0,\"\",(NEW_528_Forage_Balance!I80))","v":""},{"$f":"IF(A35=0,\"\",(NEW_528_Forage_Balance!H80))","v":""},{"$f":"IF(A35=0,\"\",(NEW_528_Forage_Balance!L80))","v":""},"",""]
[{"$f":"NEW_528_Forage_Balance!G81","v":0},{"$f":"IF(A36=0,\"\",(NEW_528_Forage_Balance!I81))","v":""},{"$f":"IF(A36=0,\"\",(NEW_528_Forage_Balance!H81))","v":""},{"$f":"IF(A36=0,\"\",(NEW_528_Forage_Balance!L81))","v":""},"",""]
[{"$f":"NEW_528_Forage_Balance!G82","v":0},{"$f":"IF(A37=0,\"\",(NEW_528_Forage_Balance!I82))","v":""},{"$f":"IF(A37=0,\"\",(NEW_528_Forage_Balance!H82))","v":""},{"$f":"IF(A37=0,\"\",(NEW_528_Forage_Balance!L82))","v":""},"",""]
[{"$f":"NEW_528_Forage_Balance!G83","v":0},{"$f":"IF(A38=0,\"\",(NEW_528_Forage_Balance!I83))","v":""},{"$f":"IF(A38=0,\"\",(NEW_528_Forage_Balance!H83))","v":""},{"$f":"IF(A38=0,\"\",(NEW_528_Forage_Balance!L83))","v":""},"",""]
[{"$f":"NEW_528_Forage_Balance!G84","v":0},{"$f":"IF(A39=0,\"\",(NEW_528_Forage_Balance!I84))","v":""},{"$f":"IF(A39=0,\"\",(NEW_528_Forage_Balance!H84))","v":""},{"$f":"IF(A39=0,\"\",(NEW_528_Forage_Balance!L84))","v":""},"",""]
[{"$f":"NEW_528_Forage_Balance!G85","v":0},{"$f":"IF(A40=0,\"\",(NEW_528_Forage_Balance!I85))","v":""},{"$f":"IF(A40=0,\"\",(NEW_528_Forage_Balance!H85))","v":""},{"$f":"IF(A40=0,\"\",(NEW_528_Forage_Balance!L85))","v":""},"",""]
[{"$f":"NEW_528_Forage_Balance!G86","v":0},{"$f":"IF(A41=0,\"\",(NEW_528_Forage_Balance!I86))","v":""},{"$f":"IF(A41=0,\"\",(NEW_528_Forage_Balance!H86))","v":""},{"$f":"IF(A41=0,\"\",(NEW_528_Forage_Balance!L86))","v":""},"",""]
[{"$f":"NEW_528_Forage_Balance!G87","v":0},{"$f":"IF(A42=0,\"\",(NEW_528_Forage_Balance!I87))","v":""},{"$f":"IF(A42=0,\"\",(NEW_528_Forage_Balance!H87))","v":""},{"$f":"IF(A42=0,\"\",(NEW_528_Forage_Balance!L87))","v":""},"",""]
[{"$f":"NEW_528_Forage_Balance!G88","v":0},{"$f":"IF(A43=0,\"\",(NEW_528_Forage_Balance!I88))","v":""},{"$f":"IF(A43=0,\"\",(NEW_528_Forage_Balance!H88))","v":""},{"$f":"IF(A43=0,\"\",(NEW_528_Forage_Balance!L88))","v":""},"",""]
[{"$f":"NEW_528_Forage_Balance!G89","v":0},{"$f":"IF(A44=0,\"\",(NEW_528_Forage_Balance!I89))","v":""},{"$f":"IF(A44=0,\"\",(NEW_528_Forage_Balance!H89))","v":""},{"$f":"IF(A44=0,\"\",(NEW_528_Forage_Balance!L89))","v":""},"",""]
[{"$f":"NEW_528_Forage_Balance!G90","v":0},{"$f":"IF(A45=0,\"\",(NEW_528_Forage_Balance!I90))","v":""},{"$f":"IF(A45=0,\"\",(NEW_528_Forage_Balance!H90))","v":""},{"$f":"IF(A45=0,\"\",(NEW_528_Forage_Balance!L90))","v":""},"",""]
[{"$f":"NEW_528_Forage_Balance!G91","v":0},{"$f":"IF(A46=0,\"\",(NEW_528_Forage_Balance!I91))","v":""},{"$f":"IF(A46=0,\"\",(NEW_528_Forage_Balance!H91))","v":""},{"$f":"IF(A46=0,\"\",(NEW_528_Forage_Balance!L91))","v":""},"",""]
[{"$f":"NEW_528_Forage_Balance!G92","v":0},{"$f":"IF(A47=0,\"\",(NEW_528_Forage_Balance!I92))","v":""},{"$f":"IF(A47=0,\"\",(NEW_528_Forage_Balance!H92))","v":""},{"$f":"IF(A47=0,\"\",(NEW_528_Forage_Balance!L92))","v":""},"",""]
[{"$f":"NEW_528_Forage_Balance!G93","v":0},{"$f":"IF(A48=0,\"\",(NEW_528_Forage_Balance!I93))","v":""},{"$f":"IF(A48=0,\"\",(NEW_528_Forage_Balance!H93))","v":""},{"$f":"IF(A48=0,\"\",(NEW_528_Forage_Balance!L93))","v":""},"",""]
[{"$f":"NEW_528_Forage_Balance!G94","v":0},{"$f":"IF(A49=0,\"\",(NEW_528_Forage_Balance!I94))","v":""},{"$f":"IF(A49=0,\"\",(NEW_528_Forage_Balance!H94))","v":""},{"$f":"IF(A49=0,\"\",(NEW_528_Forage_Balance!L94))","v":""},"",""]
[{"$f":"NEW_528_Forage_Balance!G95","v":0},{"$f":"IF(A50=0,\"\",(NEW_528_Forage_Balance!I95))","v":""},{"$f":"IF(A50=0,\"\",(NEW_528_Forage_Balance!H95))","v":""},{"$f":"IF(A50=0,\"\",(NEW_528_Forage_Balance!L95))","v":""},"",""]
[{"$f":"NEW_528_Forage_Balance!G96","v":0},{"$f":"IF(A51=0,\"\",(NEW_528_Forage_Balance!I96))","v":""},{"$f":"IF(A51=0,\"\",(NEW_528_Forage_Balance!H96))","v":""},{"$f":"IF(A51=0,\"\",(NEW_528_Forage_Balance!L96))","v":""},"",""]
[{"$f":"NEW_528_Forage_Balance!G97","v":0},{"$f":"IF(A52=0,\"\",(NEW_528_Forage_Balance!I97))","v":""},{"$f":"IF(A52=0,\"\",(NEW_528_Forage_Balance!H97))","v":""},{"$f":"IF(A52=0,\"\",(NEW_528_Forage_Balance!L97))","v":""},"",""]
[{"$f":"NEW_528_Forage_Balance!G98","v":0},{"$f":"IF(A53=0,\"\",(NEW_528_Forage_Balance!I98))","v":""},{"$f":"IF(A53=0,\"\",(NEW_528_Forage_Balance!H98))","v":""},{"$f":"IF(A53=0,\"\",(NEW_528_Forage_Balance!L98))","v":""},"",""]
[{"$f":"NEW_528_Forage_Balance!G99","v":0},{"$f":"IF(A54=0,\"\",(NEW_528_Forage_Balance!I99))","v":""},{"$f":"IF(A54=0,\"\",(NEW_528_Forage_Balance!H99))","v":""},{"$f":"IF(A54=0,\"\",(NEW_528_Forage_Balance!L99))","v":""},"",""]
[{"$f":"NEW_528_Forage_Balance!G100","v":0},{"$f":"IF(A55=0,\"\",(NEW_528_Forage_Balance!I100))","v":""},{"$f":"IF(A55=0,\"\",(NEW_528_Forage_Balance!H100))","v":""},{"$f":"IF(A55=0,\"\",(NEW_528_Forage_Balance!L100))","v":""},"",""]
[{"$f":"NEW_528_Forage_Balance!G101","v":0},{"$f":"IF(A56=0,\"\",(NEW_528_Forage_Balance!I101))","v":""},{"$f":"IF(A56=0,\"\",(NEW_528_Forage_Balance!H101))","v":""},{"$f":"IF(A56=0,\"\",(NEW_528_Forage_Balance!L101))","v":""},{"$f":"IF(A56=0,\"\",D56/$D$77*100)","v":""},""]
[{"$f":"NEW_528_Forage_Balance!G102","v":0},{"$f":"IF(A57=0,\"\",(NEW_528_Forage_Balance!I102))","v":""},{"$f":"IF(A57=0,\"\",(NEW_528_Forage_Balance!H102))","v":""},{"$f":"IF(A57=0,\"\",(NEW_528_Forage_Balance!L102))","v":""},"",""]
[{"$f":"NEW_528_Forage_Balance!G103","v":0},{"$f":"IF(A58=0,\"\",(NEW_528_Forage_Balance!I103))","v":""},{"$f":"IF(A58=0,\"\",(NEW_528_Forage_Balance!H103))","v":""},{"$f":"IF(A58=0,\"\",(NEW_528_Forage_Balance!L103))","v":""},"",""]
[{"$f":"NEW_528_Forage_Balance!G104","v":0},{"$f":"IF(A59=0,\"\",(NEW_528_Forage_Balance!I104))","v":""},{"$f":"IF(A59=0,\"\",(NEW_528_Forage_Balance!H104))","v":""},{"$f":"IF(A59=0,\"\",(NEW_528_Forage_Balance!L104))","v":""},"",""]
[{"$f":"NEW_528_Forage_Balance!G105","v":0},{"$f":"IF(A60=0,\"\",(NEW_528_Forage_Balance!I105))","v":""},{"$f":"IF(A60=0,\"\",(NEW_528_Forage_Balance!H105))","v":""},{"$f":"IF(A60=0,\"\",(NEW_528_Forage_Balance!L105))","v":""},"",""]
[{"$f":"NEW_528_Forage_Balance!G106","v":0},{"$f":"IF(A61=0,\"\",(NEW_528_Forage_Balance!I106))","v":""},{"$f":"IF(A61=0,\"\",(NEW_528_Forage_Balance!H106))","v":""},{"$f":"IF(A61=0,\"\",(NEW_528_Forage_Balance!L106))","v":""},"",""]
[{"$f":"NEW_528_Forage_Balance!G107","v":0},{"$f":"IF(A62=0,\"\",(NEW_528_Forage_Balance!I107))","v":""},{"$f":"IF(A62=0,\"\",(NEW_528_Forage_Balance!H107))","v":""},{"$f":"IF(A62=0,\"\",(NEW_528_Forage_Balance!L107))","v":""},"",""]
[{"$f":"NEW_528_Forage_Balance!G108","v":0},{"$f":"IF(A63=0,\"\",(NEW_528_Forage_Balance!I108))","v":""},{"$f":"IF(A63=0,\"\",(NEW_528_Forage_Balance!H108))","v":""},{"$f":"IF(A63=0,\"\",(NEW_528_Forage_Balance!L108))","v":""},"",""]
[{"$f":"NEW_528_Forage_Balance!G109","v":0},{"$f":"IF(A64=0,\"\",(NEW_528_Forage_Balance!I109))","v":""},{"$f":"IF(A64=0,\"\",(NEW_528_Forage_Balance!H109))","v":""},{"$f":"IF(A64=0,\"\",(NEW_528_Forage_Balance!L109))","v":""},"",""]
[{"$f":"NEW_528_Forage_Balance!G110","v":0},{"$f":"IF(A65=0,\"\",(NEW_528_Forage_Balance!I110))","v":""},{"$f":"IF(A65=0,\"\",(NEW_528_Forage_Balance!H110))","v":""},{"$f":"IF(A65=0,\"\",(NEW_528_Forage_Balance!L110))","v":""},"",""]
[{"$f":"NEW_528_Forage_Balance!G111","v":0},{"$f":"IF(A66=0,\"\",(NEW_528_Forage_Balance!I111))","v":""},{"$f":"IF(A66=0,\"\",(NEW_528_Forage_Balance!H111))","v":""},{"$f":"IF(A66=0,\"\",(NEW_528_Forage_Balance!L111))","v":""},"",""]
[{"$f":"NEW_528_Forage_Balance!G112","v":0},{"$f":"IF(A67=0,\"\",(NEW_528_Forage_Balance!I112))","v":""},{"$f":"IF(A67=0,\"\",(NEW_528_Forage_Balance!H112))","v":""},{"$f":"IF(A67=0,\"\",(NEW_528_Forage_Balance!L112))","v":""},"",""]
[{"$f":"NEW_528_Forage_Balance!G113","v":0},{"$f":"IF(A68=0,\"\",(NEW_528_Forage_Balance!I113))","v":""},{"$f":"IF(A68=0,\"\",(NEW_528_Forage_Balance!H113))","v":""},{"$f":"IF(A68=0,\"\",(NEW_528_Forage_Balance!L113))","v":""},"",""]
[{"$f":"NEW_528_Forage_Balance!G114","v":0},{"$f":"IF(A69=0,\"\",(NEW_528_Forage_Balance!I114))","v":""},{"$f":"IF(A69=0,\"\",(NEW_528_Forage_Balance!H114))","v":""},{"$f":"IF(A69=0,\"\",(NEW_528_Forage_Balance!L114))","v":""},"",""]
[{"$f":"NEW_528_Forage_Balance!G115","v":0},{"$f":"IF(A70=0,\"\",(NEW_528_Forage_Balance!I115))","v":""},{"$f":"IF(A70=0,\"\",(NEW_528_Forage_Balance!H115))","v":""},{"$f":"IF(A70=0,\"\",(NEW_528_Forage_Balance!L115))","v":""},"",""]
[{"$f":"NEW_528_Forage_Balance!G116","v":0},{"$f":"IF(A71=0,\"\",(NEW_528_Forage_Balance!I116))","v":""},{"$f":"IF(A71=0,\"\",(NEW_528_Forage_Balance!H116))","v":""},{"$f":"IF(A71=0,\"\",(NEW_528_Forage_Balance!L116))","v":""},"",""]
[{"$f":"NEW_528_Forage_Balance!G117","v":0},{"$f":"IF(A72=0,\"\",(NEW_528_Forage_Balance!I117))","v":""},{"$f":"IF(A72=0,\"\",(NEW_528_Forage_Balance!H117))","v":""},{"$f":"IF(A72=0,\"\",(NEW_528_Forage_Balance!L117))","v":""},"",""]
[{"$f":"NEW_528_Forage_Balance!G118","v":0},{"$f":"IF(A73=0,\"\",(NEW_528_Forage_Balance!I118))","v":""},{"$f":"IF(A73=0,\"\",(NEW_528_Forage_Balance!H118))","v":""},{"$f":"IF(A73=0,\"\",(NEW_528_Forage_Balance!L118))","v":""},"",""]
[{"$f":"NEW_528_Forage_Balance!G119","v":0},{"$f":"IF(A74=0,\"\",(NEW_528_Forage_Balance!I119))","v":""},{"$f":"IF(A74=0,\"\",(NEW_528_Forage_Balance!H119))","v":""},{"$f":"IF(A74=0,\"\",(NEW_528_Forage_Balance!L119))","v":""},"",""]
[{"$f":"NEW_528_Forage_Balance!G120","v":0},{"$f":"IF(A75=0,\"\",(NEW_528_Forage_Balance!I120))","v":""},{"$f":"IF(A75=0,\"\",(NEW_528_Forage_Balance!H120))","v":""},{"$f":"IF(A75=0,\"\",(NEW_528_Forage_Balance!L120))","v":""},"",""]
[{"$f":"NEW_528_Forage_Balance!G121","v":0},{"$f":"IF(A76=0,\"\",(NEW_528_Forage_Balance!I121))","v":""},{"$f":"IF(A76=0,\"\",(NEW_528_Forage_Balance!H121))","v":""},{"$f":"IF(A76=0,\"\",(NEW_528_Forage_Balance!L121))","v":""},"",{"$f":"IF(A76=0,\"\",$E$19*E76/100)","v":""}]
[null,null,{"$f":"SUM(C24:C76)","v":2000},{"$f":"SUM(D24:D76)","v":713},{"$f":"SUM(E24:E76)","v":100},{"$f":"SUM(F24:F76)","v":195.00000000000003}]
["COMMENTS:"]

{"sheet":"Contingency Plan","index":9,"n_rows":103,"n_cols":40,"rows_kept":103,"cut":false,"hidden":false,"merged":[[1,1,3,9]]}
[]
["Forward planning is recommended to address any unpredictable event that reduces the amount of forage available.  Unpredictable events include flood, fire, hail, insects, and most commonly drought.  There is no special prescription for management of grazing lands impacted by unpredictable events. Years of good grazing management prepares grazing land for recovery.  This embodies utilizing a prescribed grazing strategy which manages grazing frequency, grazing intensity and adequate recovery periods after grazing, proper livestock distribution, season of use, and stocking rate.  ","This generic contingency plan should be  used as a starting point for producers to develop a customized plan for their operation.  Encourage producers to identify trigger dates and actions they plan to take when drought conditions reach different levels at different times of the year.  Managing Drought Risk on the Ranch is a publication developed by the National Drought Mitigation Center that can provide helpful ideas to producers in developing their customized drought plan.  While drought is the most common contingency in Nebraska, plans for loss of forage through other means should be addressed in a contingency plan."]
[]
["A basic understanding of the potential capabilities and limitations of all range resources is fundamental to sound management.  High levels of plant vigor and range health are critical for the endurance of and rapid recovery from drought and other natural events which damage plants.  It is equally important to know which practices optimize livestock performance and minimize risk of financial loss.  Drought considerations must be incorporated into each year’s management plan. "]
[]
["A contingency plan should minimize financial hardships and hasten vegetation recovery.  While the remainder of this contingency plan refers primarily to drought, the principles involved are applicable to any natural event (fire, hail, flood, insect infestation) that removes forage beyond the planned level.  Contingency plans identify action to be taken at the first sign of drought as well as with continued indications of pending forage shortages.  Plans for stocking rate adjustments need to be specific in terms of method and date.  A drought contingency plan will include trigger dates, trigger conditions and planned responses to those triggers.  "]
[]
["Past Stocking Rates and Management:"]
["Grazing management during years proceeding drought is a major factor in range vegetation response to drought.  Stocking rates can increase even when livestock numbers are static.  The amount of forage consumed in a pasture depends upon animal size as well as animal numbers and days of grazing.  Inadvertent increases in stocking rates due to larger animal sizes may lead to overgrazing and reduced plant vigor before drought.  All range livestock land managers need to critically evaluate their animal weights and use an appropriate animal unit (AU) equivalent when calculating stocking rates.  Inadvertent overstocking may reduce animal performance and will damage the forage resource. "]
[null,null," "]
["Seasonal Checkpoints:"]
["Seasonal Checkpoints are critical dates when management decisions need to be made to respond to drought conditions.  On critical dates, current and predicted forage production should be evaluated.  This production estimate should be compared to the forage demand.  When current production does not meet current demand, actions must be taken.  "]
[]
["Critical dates should be based on rapid growth windows for the dominant grass species.  Soil moisture and precipitation before and during the rapid growth period of these species are critical to forage production.  In situations where the forage is a mixture of cool-season and warm-season grasses, multiple critical dates are helpful.  "]
[]
["The average total annual precipitation for the two preceding years is a good indicator of the amount of production that will occur during May and June.  Additionally, depth of moist soil in mid-April correlates to the amount of forage produced by early August.  On mixed and short-grass prairie on loamy and silty sites in Nebraska, the amount of production is correlated to precipitation received in May and June."]
["The dates listed below are \"average\" for Nebraska.  The dates will need to be adjusted 1-3 weeks based on green-up dates."]
["April 1:"]
["·   Determine average depth of moist soil and estimate probable stocking rates"]
["·   Evaluate the volume of precipitation received from October through March as compared to normal.   "]
["·   Estimate probable forage production from rangeland."]
["·   Review short-term precipitation and temperature forecasts."]
["·   Assess current standing herbage."]
["·   Assess all residual herbage."]
["·   Assess growth of introduced cool season pastures. "]
["·   Evaluate stand quality and probable forage production of winter and spring small grains."]
["·   Determine if yield of native cool season species on rangeland is above or below average. "]
["·   Alternative forages, stocking rate reductions and modified grazing strategies may be needed if there is a delay in plant green-up and growth."]
["May 1:"]
["·   Monitor green up of native warm season species on rangeland."]
["·   Continue to review short-term precipitation and temperature forecasts."]
["·   Assess current standing herbage."]
["·   Assess all residual herbage."]
["June 1 - 15:"]
["·   Assess establishment and stand quality of summer annual forages and soil moisture conditions. "]
["·   The majority of plant growth in Nebraska will occur by the end of June.  If drought conditions continue into June, forage production will be dramatically reduced for the season even if good moisture occurs after June 30. Serious consideration should be given to stocking rate reductions and herd management."]
["July 1:"]
["·   Determine if yield of native warm season species on rangeland is above or below average. "]
["·   Assess establishment and stand quality of late planted summer annual forages."]
["·   Assess soil moisture conditions."]
["August 1:"]
["·   Estimate or measure yield of summer annuals harvested for feed or grown for late season grazing. "]
["·   Diet quality of annual forages declines dramatically after the soft dough stage.  If high forage quality is the objective, harvest at the late boot to soft dough stage. If maximum tonnage is the objective, then harvesting after the soft dough stage may be desirable.  "]
["September 1:"]
["·   Assess current year and carry-over winter feed inventories.  Purchase hay resources as needed. "]
["·   Make a final assessment of yield of annual forages grown for late season grazing. "]
["·   Inventory other harvested feed and determine the quantity of crop residue on cropland. "]
["·   Estimate amount of forage in winter pastures (if applicable). "]
["October 1:"]
["·   Use September though October precipitation to predict stocking rates for the next summer."]
["Note: Even a small amount of spring or fall green-up can cause a false sense of security and delay of prudent management decisions.  Premature, aggressive restocking can cause serious economic loss because of long-term reductions in the rate of vegetation recovery.  If vegetation recovery is slow or restricted by continued drought, a de-stocking plan will be needed. "]
[]
["Herd Management:"]
["One alternative for drought management is to reduce total forage requirements. Reducing stocking rates during drought pays dividends in terms of: "]
["·    Optimized animal performance "]
["·    Reduced supplemental and winter feeding costs  "]
["·    Minimized damage to forage resources"]
["·    Enhanced range and pasture recovery following drought "]
[]
["Consider removing or relocating livestock as soon as shortages in forage and feed resources are anticipated to take advantage of best market values.  If additional shortages in forage occur, calculate the additional costs associated with keeping livestock on the ranch (feed, interest, labor, etc.) or transporting livestock to another location with adequate feed or forage.  If calculations show an unreasonably high cost of livestock production, it may be prudent to sell or relocate part or all of the livestock. "]
[]
["The following practices can help to minimize liquidation of the breeding herd: "]
["·   Early weaning can extend the forage base "]
["·   Practice early and heavy culling of less productive animals such as late calving cows and older cattle "]
["·   Remove yearlings from summer pastures early "]
["·   Consider curtailing of replacement animals for one year"]
["·   Supplement vulnerable classes of livestock such as heifers earlier than other classes of livestock "]
["·   Maintain a percentage of the livestock as a readily marketable class such as yearlings or stockers"]
[]
["Diverse practices can be used to maintain ownership of cows under drought conditions. Some ranches will liquidate or relocate part or all of their breeding stock.  The value of keeping breeding herds on the ranch must be weighed against the additional costs that are probable when drought continues.  Recovery of additional production costs will depend upon: (1) productivity of livestock, (2) productivity of grazing lands, and (3) livestock market prices during and following drought.  The use of excessive stocking rates during drought can reduce animal performance and cause dramatic reductions in plant vigor.  Overgrazed land in combination with prolonged drought can cause rangelands to shift across transition zones to states that may not recover to pre-drought production levels for decades.  Under severe or prolonged drought conditions the cost of replacement livestock is almost always less that the cost of long-term reductions in grazing land productivity."]
[]
["Additional information may be obtained from the Drought Mitigation Center website:  http://drought.unl.edu/.  In depth information about developing a drought mitigation plan can be found in the handbook “Managing Drought Risk on the Ranch” which is available at: "]
["http://drought.unl.edu/ranchplan/Overview.aspx"]
[]
["1.  The majority of the information in this section was obtained from \"Managing Drought Risk on the Ranch:  A Planning Guide for Great Plains Ranchers\", published by the National Drought Mitigation Center, UN-L and USDA Risk Management Agency."]
[]
[]
[]
[]
[]
[]
[]
[]
[]
[]
[]
[]
[]
[]
[]
[]
[]
[]
[]
[]
[]
[]
[]
[]
[]
[]
[]
[null,null,null,null,null,null,null,null,null,null,null,null,null,null,null,null,null,null,null,null,null,null,null,null,null,null,null,null,null,null,null,null,null,null,null,null,null,null,null,"2.1 Shrubs, Arrowhead, Knotweed-PFP107B"]

{"sheet":"NE-ECS-414A-% use","index":10,"n_rows":135,"n_cols":36,"rows_kept":135,"cut":false,"hidden":false,"merged":[[6,12,10,15],[59,0,60,1],[3,3,3,11],[0,0,0,1],[0,10,0,11],[3,1,5,1],[3,2,5,2],[4,3,5,3],[4,4,5,4],[4,5,5,5],[4,6,4,11],[3,0,5,0],[0,2,0,8],[1,0,1,1],[1,2,1,8],[1,12,5,15],[59,2,60,11],[61,0,61,2],[61,3,61,7],[61,8,61,9],[61,10,61,11]]}
["CLIENT NAME:",null,{"$f":"NEW_528_Forage_Balance!C2","v":"Mary Rancher - Sunnyvale Ranch"},null,null,null,null,null,null,"DATE:",{"$f":"NEW_528_Forage_Balance!R1","v":"2020-11-12"}]
["Contract Number:",null,{"$f":"NEW_528_Forage_Balance!R2","v":"12345K"},null,null,null,null,null,null,null,null,null,"Use this form or 414B minimum height to document utilization.  Prescribed Grazing Plans must have either this form or 414B minimum height included with the grazing plan.  "]
[]
["Pasture Name or Number","ACRES","Season of Use","KEY GRAZING AREA INFORMATION - See Plan map for location of Key Areas"]
[null,null,null,"Key Area #","Key Plant","Planned Degree of Use (%)","Estimated Use Key Plant Species by Weight"]
[null,null,null,null,null,null,2021,{"$f":"G6+1","v":2022},{"$f":"H6+1","v":2023},2024,2025,2026]
[{"$f":"NEW_528_Forage_Balance!G69","v":"R1A"},{"$f":"IF(A7=0,\"\",(NEW_528_Forage_Balance!H69))","v":305},"Spr/Su/Fall",1,"Little Bluestem",0.6,null,null,null,null,null,null,"This form is set up for up to 40 pastures.  Hide extra rows and adjust your page breaks before printing for a better final product.  (For page breaks, go to view, page break preview and add, move, or remove page breaks."]
[{"$f":"NEW_528_Forage_Balance!G70","v":"R1B"},{"$f":"IF(A8=0,\"\",(NEW_528_Forage_Balance!H70))","v":335},"Spr/Su/Fall",2,"Little Bluestem",0.6]
[{"$f":"NEW_528_Forage_Balance!G71","v":"R2"},{"$f":"IF(A9=0,\"\",(NEW_528_Forage_Balance!H71))","v":320},"Spr/Su/Fall",3,"Little Bluestem",0.6]
[{"$f":"NEW_528_Forage_Balance!G72","v":"R3"},{"$f":"IF(A10=0,\"\",(NEW_528_Forage_Balance!H72))","v":80},"Spr/Su/Fall",4,"Prairie Sandreed",0.6]
[{"$f":"NEW_528_Forage_Balance!G73","v":"R4"},{"$f":"IF(A11=0,\"\",(NEW_528_Forage_Balance!H73))","v":160},"Spr/Su/Fall",5,"Prairie Sandreed",0.6]
[{"$f":"NEW_528_Forage_Balance!G74","v":"R5A"},{"$f":"IF(A12=0,\"\",(NEW_528_Forage_Balance!H74))","v":240},"Spr/Su/Fall",6,"Prairie Sandreed",0.6]
[{"$f":"NEW_528_Forage_Balance!G75","v":"R5B"},{"$f":"IF(A13=0,\"\",(NEW_528_Forage_Balance!H75))","v":263},"Spr/Su/Fall",7,"Little Bluestem",0.6]
[{"$f":"NEW_528_Forage_Balance!G76","v":"R5C"},{"$f":"IF(A14=0,\"\",(NEW_528_Forage_Balance!H76))","v":137},"Spr/Su/Fall",8,"Blue Grama",0.6]
[{"$f":"NEW_528_Forage_Balance!G77","v":"R6"},{"$f":"IF(A15=0,\"\",(NEW_528_Forage_Balance!H77))","v":160},"Spr/Su/Fall",9,"Big Bluestem",0.6]
[{"$f":"NEW_528_Forage_Balance!G78","v":0},{"$f":"IF(A16=0,\"\",(NEW_528_Forage_Balance!H78))","v":""}]
[{"$f":"NEW_528_Forage_Balance!G79","v":0},{"$f":"IF(A17=0,\"\",(NEW_528_Forage_Balance!H79))","v":""}]
[{"$f":"NEW_528_Forage_Balance!G80","v":0},{"$f":"IF(A18=0,\"\",(NEW_528_Forage_Balance!H80))","v":""}]
[{"$f":"NEW_528_Forage_Balance!G81","v":0},{"$f":"IF(A19=0,\"\",(NEW_528_Forage_Balance!H81))","v":""}]
[{"$f":"NEW_528_Forage_Balance!G82","v":0},{"$f":"IF(A20=0,\"\",(NEW_528_Forage_Balance!H82))","v":""}]
[{"$f":"NEW_528_Forage_Balance!G83","v":0},{"$f":"IF(A21=0,\"\",(NEW_528_Forage_Balance!H83))","v":""}]
[{"$f":"NEW_528_Forage_Balance!G84","v":0},{"$f":"IF(A22=0,\"\",(NEW_528_Forage_Balance!H84))","v":""}]
[{"$f":"NEW_528_Forage_Balance!G85","v":0},{"$f":"IF(A23=0,\"\",(NEW_528_Forage_Balance!H85))","v":""}]
[{"$f":"NEW_528_Forage_Balance!G86","v":0},{"$f":"IF(A24=0,\"\",(NEW_528_Forage_Balance!H86))","v":""}]
[{"$f":"NEW_528_Forage_Balance!G87","v":0},{"$f":"IF(A25=0,\"\",(NEW_528_Forage_Balance!H87))","v":""}]
[{"$f":"NEW_528_Forage_Balance!G88","v":0},{"$f":"IF(A26=0,\"\",(NEW_528_Forage_Balance!H88))","v":""}]
[{"$f":"NEW_528_Forage_Balance!G89","v":0},{"$f":"IF(A27=0,\"\",(NEW_528_Forage_Balance!H89))","v":""}]
[{"$f":"NEW_528_Forage_Balance!G90","v":0},{"$f":"IF(A28=0,\"\",(NEW_528_Forage_Balance!H90))","v":""}]
[{"$f":"NEW_528_Forage_Balance!G91","v":0},{"$f":"IF(A29=0,\"\",(NEW_528_Forage_Balance!H91))","v":""}]
[{"$f":"NEW_528_Forage_Balance!G92","v":0},{"$f":"IF(A30=0,\"\",(NEW_528_Forage_Balance!H92))","v":""}]
[{"$f":"NEW_528_Forage_Balance!G93","v":0},{"$f":"IF(A31=0,\"\",(NEW_528_Forage_Balance!H93))","v":""}]
[{"$f":"NEW_528_Forage_Balance!G94","v":0},{"$f":"IF(A32=0,\"\",(NEW_528_Forage_Balance!H94))","v":""}]
[{"$f":"NEW_528_Forage_Balance!G95","v":0},{"$f":"IF(A33=0,\"\",(NEW_528_Forage_Balance!H95))","v":""}]
[{"$f":"NEW_528_Forage_Balance!G96","v":0},{"$f":"IF(A34=0,\"\",(NEW_528_Forage_Balance!H96))","v":""}]
[{"$f":"NEW_528_Forage_Balance!G97","v":0},{"$f":"IF(A35=0,\"\",(NEW_528_Forage_Balance!H97))","v":""}]
[{"$f":"NEW_528_Forage_Balance!G98","v":0},{"$f":"IF(A36=0,\"\",(NEW_528_Forage_Balance!H98))","v":""}]
[{"$f":"NEW_528_Forage_Balance!G99","v":0},{"$f":"IF(A37=0,\"\",(NEW_528_Forage_Balance!H99))","v":""}]
[{"$f":"NEW_528_Forage_Balance!G100","v":0},{"$f":"IF(A38=0,\"\",(NEW_528_Forage_Balance!H100))","v":""}]
[{"$f":"NEW_528_Forage_Balance!G101","v":0},{"$f":"IF(A39=0,\"\",(NEW_528_Forage_Balance!H101))","v":""}]
[{"$f":"NEW_528_Forage_Balance!G102","v":0},{"$f":"IF(A40=0,\"\",(NEW_528_Forage_Balance!H102))","v":""}]
[{"$f":"NEW_528_Forage_Balance!G103","v":0},{"$f":"IF(A41=0,\"\",(NEW_528_Forage_Balance!H103))","v":""}]
[{"$f":"NEW_528_Forage_Balance!G104","v":0},{"$f":"IF(A42=0,\"\",(NEW_528_Forage_Balance!H104))","v":""}]
[{"$f":"NEW_528_Forage_Balance!G105","v":0},{"$f":"IF(A43=0,\"\",(NEW_528_Forage_Balance!H105))","v":""}]
[{"$f":"NEW_528_Forage_Balance!G106","v":0},{"$f":"IF(A44=0,\"\",(NEW_528_Forage_Balance!H106))","v":""}]
[{"$f":"NEW_528_Forage_Balance!G107","v":0},{"$f":"IF(A45=0,\"\",(NEW_528_Forage_Balance!H107))","v":""}]
[{"$f":"NEW_528_Forage_Balance!G108","v":0},{"$f":"IF(A46=0,\"\",(NEW_528_Forage_Balance!H108))","v":""}]
[{"$f":"NEW_528_Forage_Balance!G109","v":0},{"$f":"IF(A47=0,\"\",(NEW_528_Forage_Balance!H109))","v":""}]
[{"$f":"NEW_528_Forage_Balance!G110","v":0},{"$f":"IF(A48=0,\"\",(NEW_528_Forage_Balance!H110))","v":""}]
[{"$f":"NEW_528_Forage_Balance!G111","v":0},{"$f":"IF(A49=0,\"\",(NEW_528_Forage_Balance!H111))","v":""}]
[{"$f":"NEW_528_Forage_Balance!G112","v":0},{"$f":"IF(A50=0,\"\",(NEW_528_Forage_Balance!H112))","v":""}]
[{"$f":"NEW_528_Forage_Balance!G113","v":0},{"$f":"IF(A51=0,\"\",(NEW_528_Forage_Balance!H113))","v":""}]
[{"$f":"NEW_528_Forage_Balance!G114","v":0},{"$f":"IF(A52=0,\"\",(NEW_528_Forage_Balance!H114))","v":""}]
[{"$f":"NEW_528_Forage_Balance!G115","v":0},{"$f":"IF(A53=0,\"\",(NEW_528_Forage_Balance!H115))","v":""}]
[{"$f":"NEW_528_Forage_Balance!G116","v":0},{"$f":"IF(A54=0,\"\",(NEW_528_Forage_Balance!H116))","v":""}]
[{"$f":"NEW_528_Forage_Balance!G117","v":0},{"$f":"IF(A55=0,\"\",(NEW_528_Forage_Balance!H117))","v":""}]
[{"$f":"NEW_528_Forage_Balance!G118","v":0},{"$f":"IF(A56=0,\"\",(NEW_528_Forage_Balance!H118))","v":""}]
[{"$f":"NEW_528_Forage_Balance!G119","v":0},{"$f":"IF(A57=0,\"\",(NEW_528_Forage_Balance!H119))","v":""}]
[{"$f":"NEW_528_Forage_Balance!G120","v":0},{"$f":"IF(A58=0,\"\",(NEW_528_Forage_Balance!H120))","v":""}]
[{"$f":"NEW_528_Forage_Balance!G121","v":0},{"$f":"IF(A59=0,\"\",(NEW_528_Forage_Balance!H121))","v":""}]
["COMMENTS:"]
[]
["Planned by:",null,null,null,null,null,null,null,"Date:"]
[]
[]
[]
[]
[]
[]
[]
[]
[]
[]
[]
[]
[]
[]
[]
[]
[]
[]
[]
[]
[]
[]
[]
[]
[]
[]
[]
[]
[]
[]
[]
[]
[]
[]
[]
[]
[]
[]
[]
[]
[]
[]
[]
[]
[]
[]
[]
[]
[]
[]
[]
[]
[]
[]
[]
[]
[]
[]
[]
[]
[]
[]
[]
[]
[]
[]
[]
[]
[]
[]
[]
[]
[null,null,null,null,null,null,null,null,null,null,null,null,null,null,null,null,null,null,null,null,null,null,null,null,null,null,null,null,null,null,null,null,null,null,null,"2.1 Shrubs, Arrowhead, Knotweed-PFP107B"]

{"sheet":"NE-ECS-414B-min height","index":11,"n_rows":135,"n_cols":38,"rows_kept":135,"cut":false,"hidden":false,"merged":[[4,2,5,2],[2,0,2,3],[4,6,4,12],[4,0,5,0],[4,1,5,1],[2,5,2,6],[4,3,4,5],[62,0,62,12],[59,3,59,5],[60,3,60,5],[61,0,61,12],[59,0,60,2],[0,0,0,1],[0,2,0,6],[0,8,0,9],[0,10,0,11],[1,0,1,1],[1,2,1,6],[0,13,3,16],[14,13,20,16],[5,13,13,16],[4,13,4,18],[2,8,2,9]]}
["CLIENT NAME:",null,{"$f":"NEW_528_Forage_Balance!C2","v":"Mary Rancher - Sunnyvale Ranch"},null,null,null,null,null,"DATE:",null,{"$f":"NEW_528_Forage_Balance!S1","v":"00:00:00"},null,null,"Use this form or 414A % use to document utilization.  Prescribed Grazing Plans must have either this form or 414A % use included with the grazing plan.  "]
["CONTRACT NUMBER:",null,{"$f":"NEW_528_Forage_Balance!R2","v":"12345K"}]
["Residual Plant Height Measured:  ",null,null,null,null,"Before Killing Frost",null,null,"After Killing Frost"]
[]
["Field Number","Acres","Key Species","Recommended minimum heights",null,null,"Record average plant  height at end of grazing period or after killing frost.",null,null,null,null,null,null,"Check box in front of the appropriate killing frost option"]
[null,null,null,"Begin Grazing","End Grazing","Before Killing Frost",2020,{"$f":"G6+1","v":2021},{"$f":"H6+1","v":2022},2023,2024,2025,2026,"Select the predominant key species for each pasture by using the drop down  menu.  This will populate the begin, end, and before killing frost minimum heights for the key species.  Change the year in cell G6 to current year which will autopopulate the rest of the year boxes.  The blank cells below the year boxes are for recording observed plant height during field reviews."]
[{"$f":"NEW_528_Forage_Balance!G69","v":"R1A"},{"$f":"NEW_528_Forage_Balance!H69","v":305},"Mid Warm Season Native",{"$f":"IF($C7=0,\"\",(VLOOKUP($C7,DATA!$E$2:$H$26,2,FALSE)))","v":6},{"$f":"IF($C7=0,\"\",(VLOOKUP($C7,DATA!$E$2:$H$26,3,FALSE)))","v":4},{"$f":"IF($C7=0,\"\",(VLOOKUP($C7,DATA!$E$2:$H$26,4,FALSE)))","v":5}]
[{"$f":"NEW_528_Forage_Balance!G70","v":"R1B"},{"$f":"NEW_528_Forage_Balance!H70","v":335},"Mid Warm Season Native",{"$f":"IF($C8=0,\"\",(VLOOKUP($C8,DATA!$E$2:$H$26,2,FALSE)))","v":6},{"$f":"IF($C8=0,\"\",(VLOOKUP($C8,DATA!$E$2:$H$26,3,FALSE)))","v":4},{"$f":"IF($C8=0,\"\",(VLOOKUP($C8,DATA!$E$2:$H$26,4,FALSE)))","v":5}]
[{"$f":"NEW_528_Forage_Balance!G71","v":"R2"},{"$f":"NEW_528_Forage_Balance!H71","v":320},"Mid Warm Season Native",{"$f":"IF($C9=0,\"\",(VLOOKUP($C9,DATA!$E$2:$H$26,2,FALSE)))","v":6},{"$f":"IF($C9=0,\"\",(VLOOKUP($C9,DATA!$E$2:$H$26,3,FALSE)))","v":4},{"$f":"IF($C9=0,\"\",(VLOOKUP($C9,DATA!$E$2:$H$26,4,FALSE)))","v":5}]
[{"$f":"NEW_528_Forage_Balance!G72","v":"R3"},{"$f":"NEW_528_Forage_Balance!H72","v":80},"Tall Warm Season Native",{"$f":"IF($C10=0,\"\",(VLOOKUP($C10,DATA!$E$2:$H$26,2,FALSE)))","v":10},{"$f":"IF($C10=0,\"\",(VLOOKUP($C10,DATA!$E$2:$H$26,3,FALSE)))","v":6},{"$f":"IF($C10=0,\"\",(VLOOKUP($C10,DATA!$E$2:$H$26,4,FALSE)))","v":10}]
[{"$f":"NEW_528_Forage_Balance!G73","v":"R4"},{"$f":"NEW_528_Forage_Balance!H73","v":160},"Tall Warm Season Native",{"$f":"IF($C11=0,\"\",(VLOOKUP($C11,DATA!$E$2:$H$26,2,FALSE)))","v":10},{"$f":"IF($C11=0,\"\",(VLOOKUP($C11,DATA!$E$2:$H$26,3,FALSE)))","v":6},{"$f":"IF($C11=0,\"\",(VLOOKUP($C11,DATA!$E$2:$H$26,4,FALSE)))","v":10}]
[{"$f":"NEW_528_Forage_Balance!G74","v":"R5A"},{"$f":"NEW_528_Forage_Balance!H74","v":240},"Tall Warm Season Native",{"$f":"IF($C12=0,\"\",(VLOOKUP($C12,DATA!$E$2:$H$26,2,FALSE)))","v":10},{"$f":"IF($C12=0,\"\",(VLOOKUP($C12,DATA!$E$2:$H$26,3,FALSE)))","v":6},{"$f":"IF($C12=0,\"\",(VLOOKUP($C12,DATA!$E$2:$H$26,4,FALSE)))","v":10}]
[{"$f":"NEW_528_Forage_Balance!G75","v":"R5B"},{"$f":"NEW_528_Forage_Balance!H75","v":263},"Mid Warm Season Native",{"$f":"IF($C13=0,\"\",(VLOOKUP($C13,DATA!$E$2:$H$26,2,FALSE)))","v":6},{"$f":"IF($C13=0,\"\",(VLOOKUP($C13,DATA!$E$2:$H$26,3,FALSE)))","v":4},{"$f":"IF($C13=0,\"\",(VLOOKUP($C13,DATA!$E$2:$H$26,4,FALSE)))","v":5}]
[{"$f":"NEW_528_Forage_Balance!G76","v":"R5C"},{"$f":"NEW_528_Forage_Balance!H76","v":137},"Mid Warm Season Native",{"$f":"IF($C14=0,\"\",(VLOOKUP($C14,DATA!$E$2:$H$26,2,FALSE)))","v":6},{"$f":"IF($C14=0,\"\",(VLOOKUP($C14,DATA!$E$2:$H$26,3,FALSE)))","v":4},{"$f":"IF($C14=0,\"\",(VLOOKUP($C14,DATA!$E$2:$H$26,4,FALSE)))","v":5}]
[{"$f":"NEW_528_Forage_Balance!G77","v":"R6"},{"$f":"NEW_528_Forage_Balance!H77","v":160},"Big / Sand bluestem",{"$f":"IF($C15=0,\"\",(VLOOKUP($C15,DATA!$E$2:$H$26,2,FALSE)))","v":10},{"$f":"IF($C15=0,\"\",(VLOOKUP($C15,DATA!$E$2:$H$26,3,FALSE)))","v":6},{"$f":"IF($C15=0,\"\",(VLOOKUP($C15,DATA!$E$2:$H$26,4,FALSE)))","v":10},null,null,null,null,null,null,null,"This form is set up for up to 40 pastures.  Hide extra rows and adjust your page breaks before printing for a better final product.  (For page breaks, go to view, page break preview and add, move, or remove page breaks."]
[{"$f":"NEW_528_Forage_Balance!G78","v":0},{"$f":"NEW_528_Forage_Balance!H78","v":0},null,{"$f":"IF($C16=0,\"\",(VLOOKUP($C16,DATA!$E$2:$H$26,2,FALSE)))","v":""},{"$f":"IF($C16=0,\"\",(VLOOKUP($C16,DATA!$E$2:$H$26,3,FALSE)))","v":""},{"$f":"IF($C16=0,\"\",(VLOOKUP($C16,DATA!$E$2:$H$26,4,FALSE)))","v":""}]
[{"$f":"NEW_528_Forage_Balance!G79","v":0},{"$f":"NEW_528_Forage_Balance!H79","v":0},null,{"$f":"IF($C17=0,\"\",(VLOOKUP($C17,DATA!$E$2:$H$26,2,FALSE)))","v":""},{"$f":"IF($C17=0,\"\",(VLOOKUP($C17,DATA!$E$2:$H$26,3,FALSE)))","v":""},{"$f":"IF($C17=0,\"\",(VLOOKUP($C17,DATA!$E$2:$H$26,4,FALSE)))","v":""}]
[{"$f":"NEW_528_Forage_Balance!G80","v":0},{"$f":"NEW_528_Forage_Balance!H80","v":0},null,{"$f":"IF($C18=0,\"\",(VLOOKUP($C18,DATA!$E$2:$H$26,2,FALSE)))","v":""},{"$f":"IF($C18=0,\"\",(VLOOKUP($C18,DATA!$E$2:$H$26,3,FALSE)))","v":""},{"$f":"IF($C18=0,\"\",(VLOOKUP($C18,DATA!$E$2:$H$26,4,FALSE)))","v":""}]
[{"$f":"NEW_528_Forage_Balance!G81","v":0},{"$f":"NEW_528_Forage_Balance!H81","v":0},null,{"$f":"IF($C19=0,\"\",(VLOOKUP($C19,DATA!$E$2:$H$26,2,FALSE)))","v":""},{"$f":"IF($C19=0,\"\",(VLOOKUP($C19,DATA!$E$2:$H$26,3,FALSE)))","v":""},{"$f":"IF($C19=0,\"\",(VLOOKUP($C19,DATA!$E$2:$H$26,4,FALSE)))","v":""}]
[{"$f":"NEW_528_Forage_Balance!G82","v":0},{"$f":"NEW_528_Forage_Balance!H82","v":0},null,{"$f":"IF($C20=0,\"\",(VLOOKUP($C20,DATA!$E$2:$H$26,2,FALSE)))","v":""},{"$f":"IF($C20=0,\"\",(VLOOKUP($C20,DATA!$E$2:$H$26,3,FALSE)))","v":""},{"$f":"IF($C20=0,\"\",(VLOOKUP($C20,DATA!$E$2:$H$26,4,FALSE)))","v":""}]
[{"$f":"NEW_528_Forage_Balance!G83","v":0},{"$f":"NEW_528_Forage_Balance!H83","v":0},null,{"$f":"IF($C21=0,\"\",(VLOOKUP($C21,DATA!$E$2:$H$26,2,FALSE)))","v":""},{"$f":"IF($C21=0,\"\",(VLOOKUP($C21,DATA!$E$2:$H$26,3,FALSE)))","v":""},{"$f":"IF($C21=0,\"\",(VLOOKUP($C21,DATA!$E$2:$H$26,4,FALSE)))","v":""}]
[{"$f":"NEW_528_Forage_Balance!G84","v":0},{"$f":"NEW_528_Forage_Balance!H84","v":0},null,{"$f":"IF($C22=0,\"\",(VLOOKUP($C22,DATA!$E$2:$H$26,2,FALSE)))","v":""},{"$f":"IF($C22=0,\"\",(VLOOKUP($C22,DATA!$E$2:$H$26,3,FALSE)))","v":""},{"$f":"IF($C22=0,\"\",(VLOOKUP($C22,DATA!$E$2:$H$26,4,FALSE)))","v":""}]
[{"$f":"NEW_528_Forage_Balance!G85","v":0},{"$f":"NEW_528_Forage_Balance!H85","v":0},null,{"$f":"IF($C23=0,\"\",(VLOOKUP($C23,DATA!$E$2:$H$26,2,FALSE)))","v":""},{"$f":"IF($C23=0,\"\",(VLOOKUP($C23,DATA!$E$2:$H$26,3,FALSE)))","v":""},{"$f":"IF($C23=0,\"\",(VLOOKUP($C23,DATA!$E$2:$H$26,4,FALSE)))","v":""}]
[{"$f":"NEW_528_Forage_Balance!G86","v":0},{"$f":"NEW_528_Forage_Balance!H86","v":0},null,{"$f":"IF($C24=0,\"\",(VLOOKUP($C24,DATA!$E$2:$H$26,2,FALSE)))","v":""},{"$f":"IF($C24=0,\"\",(VLOOKUP($C24,DATA!$E$2:$H$26,3,FALSE)))","v":""},{"$f":"IF($C24=0,\"\",(VLOOKUP($C24,DATA!$E$2:$H$26,4,FALSE)))","v":""}]
[{"$f":"NEW_528_Forage_Balance!G87","v":0},{"$f":"NEW_528_Forage_Balance!H87","v":0},null,{"$f":"IF($C25=0,\"\",(VLOOKUP($C25,DATA!$E$2:$H$26,2,FALSE)))","v":""},{"$f":"IF($C25=0,\"\",(VLOOKUP($C25,DATA!$E$2:$H$26,3,FALSE)))","v":""},{"$f":"IF($C25=0,\"\",(VLOOKUP($C25,DATA!$E$2:$H$26,4,FALSE)))","v":""}]
[{"$f":"NEW_528_Forage_Balance!G88","v":0},{"$f":"NEW_528_Forage_Balance!H88","v":0},null,{"$f":"IF($C26=0,\"\",(VLOOKUP($C26,DATA!$E$2:$H$26,2,FALSE)))","v":""},{"$f":"IF($C26=0,\"\",(VLOOKUP($C26,DATA!$E$2:$H$26,3,FALSE)))","v":""},{"$f":"IF($C26=0,\"\",(VLOOKUP($C26,DATA!$E$2:$H$26,4,FALSE)))","v":""}]
[{"$f":"NEW_528_Forage_Balance!G89","v":0},{"$f":"NEW_528_Forage_Balance!H89","v":0},null,{"$f":"IF($C27=0,\"\",(VLOOKUP($C27,DATA!$E$2:$H$26,2,FALSE)))","v":""},{"$f":"IF($C27=0,\"\",(VLOOKUP($C27,DATA!$E$2:$H$26,3,FALSE)))","v":""},{"$f":"IF($C27=0,\"\",(VLOOKUP($C27,DATA!$E$2:$H$26,4,FALSE)))","v":""}]
[{"$f":"NEW_528_Forage_Balance!G90","v":0},{"$f":"NEW_528_Forage_Balance!H90","v":0},null,{"$f":"IF($C28=0,\"\",(VLOOKUP($C28,DATA!$E$2:$H$26,2,FALSE)))","v":""},{"$f":"IF($C28=0,\"\",(VLOOKUP($C28,DATA!$E$2:$H$26,3,FALSE)))","v":""},{"$f":"IF($C28=0,\"\",(VLOOKUP($C28,DATA!$E$2:$H$26,4,FALSE)))","v":""}]
[{"$f":"NEW_528_Forage_Balance!G91","v":0},{"$f":"NEW_528_Forage_Balance!H91","v":0},null,{"$f":"IF($C29=0,\"\",(VLOOKUP($C29,DATA!$E$2:$H$26,2,FALSE)))","v":""},{"$f":"IF($C29=0,\"\",(VLOOKUP($C29,DATA!$E$2:$H$26,3,FALSE)))","v":""},{"$f":"IF($C29=0,\"\",(VLOOKUP($C29,DATA!$E$2:$H$26,4,FALSE)))","v":""}]
[{"$f":"NEW_528_Forage_Balance!G92","v":0},{"$f":"NEW_528_Forage_Balance!H92","v":0},null,{"$f":"IF($C30=0,\"\",(VLOOKUP($C30,DATA!$E$2:$H$26,2,FALSE)))","v":""},{"$f":"IF($C30=0,\"\",(VLOOKUP($C30,DATA!$E$2:$H$26,3,FALSE)))","v":""},{"$f":"IF($C30=0,\"\",(VLOOKUP($C30,DATA!$E$2:$H$26,4,FALSE)))","v":""}]
[{"$f":"NEW_528_Forage_Balance!G93","v":0},{"$f":"NEW_528_Forage_Balance!H93","v":0},null,{"$f":"IF($C31=0,\"\",(VLOOKUP($C31,DATA!$E$2:$H$26,2,FALSE)))","v":""},{"$f":"IF($C31=0,\"\",(VLOOKUP($C31,DATA!$E$2:$H$26,3,FALSE)))","v":""},{"$f":"IF($C31=0,\"\",(VLOOKUP($C31,DATA!$E$2:$H$26,4,FALSE)))","v":""}]
[{"$f":"NEW_528_Forage_Balance!G94","v":0},{"$f":"NEW_528_Forage_Balance!H94","v":0},null,{"$f":"IF($C32=0,\"\",(VLOOKUP($C32,DATA!$E$2:$H$26,2,FALSE)))","v":""},{"$f":"IF($C32=0,\"\",(VLOOKUP($C32,DATA!$E$2:$H$26,3,FALSE)))","v":""},{"$f":"IF($C32=0,\"\",(VLOOKUP($C32,DATA!$E$2:$H$26,4,FALSE)))","v":""}]
[{"$f":"NEW_528_Forage_Balance!G95","v":0},{"$f":"NEW_528_Forage_Balance!H95","v":0},null,{"$f":"IF($C33=0,\"\",(VLOOKUP($C33,DATA!$E$2:$H$26,2,FALSE)))","v":""},{"$f":"IF($C33=0,\"\",(VLOOKUP($C33,DATA!$E$2:$H$26,3,FALSE)))","v":""},{"$f":"IF($C33=0,\"\",(VLOOKUP($C33,DATA!$E$2:$H$26,4,FALSE)))","v":""}]
[{"$f":"NEW_528_Forage_Balance!G96","v":0},{"$f":"NEW_528_Forage_Balance!H96","v":0},null,{"$f":"IF($C34=0,\"\",(VLOOKUP($C34,DATA!$E$2:$H$26,2,FALSE)))","v":""},{"$f":"IF($C34=0,\"\",(VLOOKUP($C34,DATA!$E$2:$H$26,3,FALSE)))","v":""},{"$f":"IF($C34=0,\"\",(VLOOKUP($C34,DATA!$E$2:$H$26,4,FALSE)))","v":""}]
[{"$f":"NEW_528_Forage_Balance!G97","v":0},{"$f":"NEW_528_Forage_Balance!H97","v":0},null,{"$f":"IF($C35=0,\"\",(VLOOKUP($C35,DATA!$E$2:$H$26,2,FALSE)))","v":""},{"$f":"IF($C35=0,\"\",(VLOOKUP($C35,DATA!$E$2:$H$26,3,FALSE)))","v":""},{"$f":"IF($C35=0,\"\",(VLOOKUP($C35,DATA!$E$2:$H$26,4,FALSE)))","v":""}]
[{"$f":"NEW_528_Forage_Balance!G98","v":0},{"$f":"NEW_528_Forage_Balance!H98","v":0},null,{"$f":"IF($C36=0,\"\",(VLOOKUP($C36,DATA!$E$2:$H$26,2,FALSE)))","v":""},{"$f":"IF($C36=0,\"\",(VLOOKUP($C36,DATA!$E$2:$H$26,3,FALSE)))","v":""},{"$f":"IF($C36=0,\"\",(VLOOKUP($C36,DATA!$E$2:$H$26,4,FALSE)))","v":""}]
[{"$f":"NEW_528_Forage_Balance!G99","v":0},{"$f":"NEW_528_Forage_Balance!H99","v":0},null,{"$f":"IF($C37=0,\"\",(VLOOKUP($C37,DATA!$E$2:$H$26,2,FALSE)))","v":""},{"$f":"IF($C37=0,\"\",(VLOOKUP($C37,DATA!$E$2:$H$26,3,FALSE)))","v":""},{"$f":"IF($C37=0,\"\",(VLOOKUP($C37,DATA!$E$2:$H$26,4,FALSE)))","v":""}]
[{"$f":"NEW_528_Forage_Balance!G100","v":0},{"$f":"NEW_528_Forage_Balance!H100","v":0},null,{"$f":"IF($C38=0,\"\",(VLOOKUP($C38,DATA!$E$2:$H$26,2,FALSE)))","v":""},{"$f":"IF($C38=0,\"\",(VLOOKUP($C38,DATA!$E$2:$H$26,3,FALSE)))","v":""},{"$f":"IF($C38=0,\"\",(VLOOKUP($C38,DATA!$E$2:$H$26,4,FALSE)))","v":""}]
[{"$f":"NEW_528_Forage_Balance!G101","v":0},{"$f":"NEW_528_Forage_Balance!H101","v":0},null,{"$f":"IF($C39=0,\"\",(VLOOKUP($C39,DATA!$E$2:$H$26,2,FALSE)))","v":""},{"$f":"IF($C39=0,\"\",(VLOOKUP($C39,DATA!$E$2:$H$26,3,FALSE)))","v":""},{"$f":"IF($C39=0,\"\",(VLOOKUP($C39,DATA!$E$2:$H$26,4,FALSE)))","v":""}]
[{"$f":"NEW_528_Forage_Balance!G102","v":0},{"$f":"NEW_528_Forage_Balance!H102","v":0},null,{"$f":"IF($C40=0,\"\",(VLOOKUP($C40,DATA!$E$2:$H$26,2,FALSE)))","v":""},{"$f":"IF($C40=0,\"\",(VLOOKUP($C40,DATA!$E$2:$H$26,3,FALSE)))","v":""},{"$f":"IF($C40=0,\"\",(VLOOKUP($C40,DATA!$E$2:$H$26,4,FALSE)))","v":""}]
[{"$f":"NEW_528_Forage_Balance!G103","v":0},{"$f":"NEW_528_Forage_Balance!H103","v":0},null,{"$f":"IF($C41=0,\"\",(VLOOKUP($C41,DATA!$E$2:$H$26,2,FALSE)))","v":""},{"$f":"IF($C41=0,\"\",(VLOOKUP($C41,DATA!$E$2:$H$26,3,FALSE)))","v":""},{"$f":"IF($C41=0,\"\",(VLOOKUP($C41,DATA!$E$2:$H$26,4,FALSE)))","v":""}]
[{"$f":"NEW_528_Forage_Balance!G104","v":0},{"$f":"NEW_528_Forage_Balance!H104","v":0},null,{"$f":"IF($C42=0,\"\",(VLOOKUP($C42,DATA!$E$2:$H$26,2,FALSE)))","v":""},{"$f":"IF($C42=0,\"\",(VLOOKUP($C42,DATA!$E$2:$H$26,3,FALSE)))","v":""},{"$f":"IF($C42=0,\"\",(VLOOKUP($C42,DATA!$E$2:$H$26,4,FALSE)))","v":""}]
[{"$f":"NEW_528_Forage_Balance!G105","v":0},{"$f":"NEW_528_Forage_Balance!H105","v":0},null,{"$f":"IF($C43=0,\"\",(VLOOKUP($C43,DATA!$E$2:$H$26,2,FALSE)))","v":""},{"$f":"IF($C43=0,\"\",(VLOOKUP($C43,DATA!$E$2:$H$26,3,FALSE)))","v":""},{"$f":"IF($C43=0,\"\",(VLOOKUP($C43,DATA!$E$2:$H$26,4,FALSE)))","v":""}]
[{"$f":"NEW_528_Forage_Balance!G106","v":0},{"$f":"NEW_528_Forage_Balance!H106","v":0},null,{"$f":"IF($C44=0,\"\",(VLOOKUP($C44,DATA!$E$2:$H$26,2,FALSE)))","v":""},{"$f":"IF($C44=0,\"\",(VLOOKUP($C44,DATA!$E$2:$H$26,3,FALSE)))","v":""},{"$f":"IF($C44=0,\"\",(VLOOKUP($C44,DATA!$E$2:$H$26,4,FALSE)))","v":""}]
[{"$f":"NEW_528_Forage_Balance!G107","v":0},{"$f":"NEW_528_Forage_Balance!H107","v":0},null,{"$f":"IF($C45=0,\"\",(VLOOKUP($C45,DATA!$E$2:$H$26,2,FALSE)))","v":""},{"$f":"IF($C45=0,\"\",(VLOOKUP($C45,DATA!$E$2:$H$26,3,FALSE)))","v":""},{"$f":"IF($C45=0,\"\",(VLOOKUP($C45,DATA!$E$2:$H$26,4,FALSE)))","v":""}]
[{"$f":"NEW_528_Forage_Balance!G108","v":0},{"$f":"NEW_528_Forage_Balance!H108","v":0},null,{"$f":"IF($C46=0,\"\",(VLOOKUP($C46,DATA!$E$2:$H$26,2,FALSE)))","v":""},{"$f":"IF($C46=0,\"\",(VLOOKUP($C46,DATA!$E$2:$H$26,3,FALSE)))","v":""},{"$f":"IF($C46=0,\"\",(VLOOKUP($C46,DATA!$E$2:$H$26,4,FALSE)))","v":""}]
[{"$f":"NEW_528_Forage_Balance!G109","v":0},{"$f":"NEW_528_Forage_Balance!H109","v":0},null,{"$f":"IF($C47=0,\"\",(VLOOKUP($C47,DATA!$E$2:$H$26,2,FALSE)))","v":""},{"$f":"IF($C47=0,\"\",(VLOOKUP($C47,DATA!$E$2:$H$26,3,FALSE)))","v":""},{"$f":"IF($C47=0,\"\",(VLOOKUP($C47,DATA!$E$2:$H$26,4,FALSE)))","v":""}]
[{"$f":"NEW_528_Forage_Balance!G110","v":0},{"$f":"NEW_528_Forage_Balance!H110","v":0},null,{"$f":"IF($C48=0,\"\",(VLOOKUP($C48,DATA!$E$2:$H$26,2,FALSE)))","v":""},{"$f":"IF($C48=0,\"\",(VLOOKUP($C48,DATA!$E$2:$H$26,3,FALSE)))","v":""},{"$f":"IF($C48=0,\"\",(VLOOKUP($C48,DATA!$E$2:$H$26,4,FALSE)))","v":""}]
[{"$f":"NEW_528_Forage_Balance!G111","v":0},{"$f":"NEW_528_Forage_Balance!H111","v":0},null,{"$f":"IF($C49=0,\"\",(VLOOKUP($C49,DATA!$E$2:$H$26,2,FALSE)))","v":""},{"$f":"IF($C49=0,\"\",(VLOOKUP($C49,DATA!$E$2:$H$26,3,FALSE)))","v":""},{"$f":"IF($C49=0,\"\",(VLOOKUP($C49,DATA!$E$2:$H$26,4,FALSE)))","v":""}]
[{"$f":"NEW_528_Forage_Balance!G112","v":0},{"$f":"NEW_528_Forage_Balance!H112","v":0},null,{"$f":"IF($C50=0,\"\",(VLOOKUP($C50,DATA!$E$2:$H$26,2,FALSE)))","v":""},{"$f":"IF($C50=0,\"\",(VLOOKUP($C50,DATA!$E$2:$H$26,3,FALSE)))","v":""},{"$f":"IF($C50=0,\"\",(VLOOKUP($C50,DATA!$E$2:$H$26,4,FALSE)))","v":""}]
[{"$f":"NEW_528_Forage_Balance!G113","v":0},{"$f":"NEW_528_Forage_Balance!H113","v":0},null,{"$f":"IF($C51=0,\"\",(VLOOKUP($C51,DATA!$E$2:$H$26,2,FALSE)))","v":""},{"$f":"IF($C51=0,\"\",(VLOOKUP($C51,DATA!$E$2:$H$26,3,FALSE)))","v":""},{"$f":"IF($C51=0,\"\",(VLOOKUP($C51,DATA!$E$2:$H$26,4,FALSE)))","v":""}]
[{"$f":"NEW_528_Forage_Balance!G114","v":0},{"$f":"NEW_528_Forage_Balance!H114","v":0},null,{"$f":"IF($C52=0,\"\",(VLOOKUP($C52,DATA!$E$2:$H$26,2,FALSE)))","v":""},{"$f":"IF($C52=0,\"\",(VLOOKUP($C52,DATA!$E$2:$H$26,3,FALSE)))","v":""},{"$f":"IF($C52=0,\"\",(VLOOKUP($C52,DATA!$E$2:$H$26,4,FALSE)))","v":""}]
[{"$f":"NEW_528_Forage_Balance!G115","v":0},{"$f":"NEW_528_Forage_Balance!H115","v":0},null,{"$f":"IF($C53=0,\"\",(VLOOKUP($C53,DATA!$E$2:$H$26,2,FALSE)))","v":""},{"$f":"IF($C53=0,\"\",(VLOOKUP($C53,DATA!$E$2:$H$26,3,FALSE)))","v":""},{"$f":"IF($C53=0,\"\",(VLOOKUP($C53,DATA!$E$2:$H$26,4,FALSE)))","v":""}]
[{"$f":"NEW_528_Forage_Balance!G116","v":0},{"$f":"NEW_528_Forage_Balance!H116","v":0},null,{"$f":"IF($C54=0,\"\",(VLOOKUP($C54,DATA!$E$2:$H$26,2,FALSE)))","v":""},{"$f":"IF($C54=0,\"\",(VLOOKUP($C54,DATA!$E$2:$H$26,3,FALSE)))","v":""},{"$f":"IF($C54=0,\"\",(VLOOKUP($C54,DATA!$E$2:$H$26,4,FALSE)))","v":""}]
[{"$f":"NEW_528_Forage_Balance!G117","v":0},{"$f":"NEW_528_Forage_Balance!H117","v":0},null,{"$f":"IF($C55=0,\"\",(VLOOKUP($C55,DATA!$E$2:$H$26,2,FALSE)))","v":""},{"$f":"IF($C55=0,\"\",(VLOOKUP($C55,DATA!$E$2:$H$26,3,FALSE)))","v":""},{"$f":"IF($C55=0,\"\",(VLOOKUP($C55,DATA!$E$2:$H$26,4,FALSE)))","v":""}]
[{"$f":"NEW_528_Forage_Balance!G118","v":0},{"$f":"NEW_528_Forage_Balance!H118","v":0},null,{"$f":"IF($C56=0,\"\",(VLOOKUP($C56,DATA!$E$2:$H$26,2,FALSE)))","v":""},{"$f":"IF($C56=0,\"\",(VLOOKUP($C56,DATA!$E$2:$H$26,3,FALSE)))","v":""},{"$f":"IF($C56=0,\"\",(VLOOKUP($C56,DATA!$E$2:$H$26,4,FALSE)))","v":""}]
[{"$f":"NEW_528_Forage_Balance!G119","v":0},{"$f":"NEW_528_Forage_Balance!H119","v":0},null,{"$f":"IF($C57=0,\"\",(VLOOKUP($C57,DATA!$E$2:$H$26,2,FALSE)))","v":""},{"$f":"IF($C57=0,\"\",(VLOOKUP($C57,DATA!$E$2:$H$26,3,FALSE)))","v":""},{"$f":"IF($C57=0,\"\",(VLOOKUP($C57,DATA!$E$2:$H$26,4,FALSE)))","v":""}]
[{"$f":"NEW_528_Forage_Balance!G120","v":0},{"$f":"NEW_528_Forage_Balance!H120","v":0},null,{"$f":"IF($C58=0,\"\",(VLOOKUP($C58,DATA!$E$2:$H$26,2,FALSE)))","v":""},{"$f":"IF($C58=0,\"\",(VLOOKUP($C58,DATA!$E$2:$H$26,3,FALSE)))","v":""},{"$f":"IF($C58=0,\"\",(VLOOKUP($C58,DATA!$E$2:$H$26,4,FALSE)))","v":""}]
[{"$f":"NEW_528_Forage_Balance!G121","v":0},{"$f":"NEW_528_Forage_Balance!H121","v":0},null,{"$f":"IF($C59=0,\"\",(VLOOKUP($C59,DATA!$E$2:$H$26,2,FALSE)))","v":""},{"$f":"IF($C59=0,\"\",(VLOOKUP($C59,DATA!$E$2:$H$26,3,FALSE)))","v":""},{"$f":"IF($C59=0,\"\",(VLOOKUP($C59,DATA!$E$2:$H$26,4,FALSE)))","v":""}]
[null,null,null,"Date of Field Visit: "]
[null,null,null,"Observer (Initials):  "]
["*  See NE Field Office Technical Guide, Section IV, 528 - Prescribed Grazing Specifications, Table 4."]
["** A killing frost can be defined as \"when temperatures drop below 32 degrees F. for an extended period of time (usually several  hours) such that will kill vegetation.\"  Temperature and duration will vary with plant species, as some plant species are more frost tolerant."]
[]
[]
[]
[]
[]
[]
[]
[]
[]
[]
[]
[]
[]
[]
[]
[]
[]
[]
[]
[]
[]
[]
[]
[]
[]
[]
[]
[]
[]
[]
[]
[]
[]
[]
[]
[]
[]
[]
[]
[]
[]
[]
[]
[]
[]
[]
[]
[]
[]
[]
[]
[]
[]
[]
[]
[]
[]
[]
[]
[]
[]
[]
[]
[]
[]
[]
[]
[]
[]
[]
[]
[null,null,null,null,null,null,null,null,null,null,null,null,null,null,null,null,null,null,null,null,null,null,null,null,null,null,null,null,null,null,null,null,null,null,null,null,null,"2.1 Shrubs, Arrowhead, Knotweed-PFP107B"]

{"sheet":"NE-ECS-12_App_Trend_Range","index":12,"n_rows":96,"n_cols":39,"rows_kept":96,"cut":false,"hidden":false,"merged":[[18,0,18,5],[19,0,19,4],[20,0,20,6],[19,5,19,6],[6,1,6,5],[0,1,0,2],[9,0,10,0],[9,5,10,5],[9,2,10,2],[9,3,10,3],[9,4,10,4],[9,1,10,1],[5,0,5,6],[6,6,7,6],[1,1,1,2],[2,4,2,6],[3,0,3,1],[3,3,3,4],[2,1,2,2]]}
["Client Name:",null,null,"Contract Number:",null,"Date:"]
["Ecological Site:",null,null,"Pasture/Field Number:",null,"MLRA:"]
["Reference  Plant Community:",null,null,"GPS Coordinates:"]
["Current Precipitation (Normal, Above, Below):",null,null,"Trend Type (Range or Planned):"]
[]
["When making trend estimates, always compare present conditions to what can be expected to be found in the plant community that you are comparing present conditions to; either the historic or interpretive plant community (Rangeland Trend) or one of the other plant communities (Planned Trend) described in the ecological site description.  Take into consideration current weather conditions and the impact on plant growth and other plant related attributes."]
["INDICATOR","Description of Indicator and Appropriate Point Values",null,null,null,null,"ASSIGNED SCORE"]
["Composition Changes","2 Points","1 point","0 Points","  - 1 Point","  -2 Points"]
["Evaluate the composition of the plant community and compare it to ESD communities.","No invading undesirable plants present, desirable key species very abundant.","Slight presence of invading undesirables, desirable key species abundant.","Moderate presence of invading undesirables, average abundance of desirable key species.","Numerous invading undesirables, few desirable key species present.","Extreme presence of invading undesirables, very few desirable key species."]
["Abundance of Seedlings and Young Plants","2 Points","1 point","0 Points","  - 1 Point","  -2 Points"]
[]
["Evaluate the number of new seedlings and tillers of desirable species present.","Seedlings & young desired plants very abundant.","Seedlings & young desired plants abundant.","Average abundance of seedlings & young desired plants.","Few seedlings & young desired plants.","Very few seedlings and young desired plants."]
["Plant Residue & Litter","2 Points","1 point","0 Points","  - 1 Point","  -2 Points"]
["Evaluate the amount of litter and plant residues and how well they are decomposing as compared to what is expected for the site.","Litter present in amounts considered normal for the site.","Litter present in amounts slightly less or slightly more than considered normal.","Litter present in amounts moderately less or moderately more than considered normal.","Litter present or absent in moderate to extreme amounts when compared to what is considered normal.","Litter not present or present in extreme amounts when compared to what is considered normal."]
["Plant Vigor","2 Points","1 point","0 Points","  - 1 Point","  -2 Points"]
["Evaluate plant decadence, plant spacing, reproduction, plant stature, leaf size, productivity, etc., of desirable species.","Vigor of desirable species is very high.","Vigor of desirable species is high.","Vigor of desirable species is average.","Vigor of desirable species is poor.","Vigor of desirable species is extremely poor."]
["Condition of the Soil Surface","2 Points","1 point","0 Points","  - 1 Point","  -2 Points"]
["Evaluate wind, sheet, rill, gully and streambank erosion as well as the amount of exposed soil surface.  Compare to what is expected for the site.","No apparent erosion, percent bare ground is what is expected for the site.","Erosion is slight, percent bare ground is slightly higher than what is expected for the site.","Erosion is moderate, percent bare ground is moderately higher than what is expected for the site.","Erosion is moderate to extreme, percent bare ground is moderately to extremely higher than what is expected for the site.","Erosion is extreme, percent bare ground is extreme when compared to what is expected for the site."]
["TOTAL SCORE - Sum of all columns indicates apparent trend:",null,null,null,null,null,{"$f":"IF(G18=0,\"\",(SUM(G9:G18)))","v":""}]
["Range Trend Rating:  "]
["Range Trend Ratings:  If total score is < 3, then rating is toward the reference community; if total score is 0-3, then rating is not apparent, and if total score is > 0 rating is away from the reference community."]
[]
[]
[]
[]
[]
[]
[]
[]
[]
[]
[]
[]
[]
[]
[]
[]
[]
[]
[]
[]
[]
[]
[]
[]
[]
[]
[]
[]
[]
[]
[]
[]
[]
[]
[]
[]
[]
[]
[]
[]
[]
[]
[]
[]
[]
[]
[]
[]
[]
[]
[]
[]
[]
[]
[]
[]
[]
[]
[]
[]
[]
[]
[]
[]
[]
[]
[]
[]
[]
[]
[]
[]
[]
[]
[null,null,null,null,null,null,null,null,null,null,null,null,null,null,null,null,null,null,null,null,null,null,null,null,null,null,null,null,null,null,null,null,null,null,null,null,null,null,"2.1 Shrubs, Arrowhead, Knotweed-PFP107B"]

{"sheet":"NE-ECS-13_Past Score","index":13,"n_rows":113,"n_cols":25,"rows_kept":113,"cut":false,"hidden":false,"merged":[[19,0,19,6],[0,5,0,6],[1,5,1,6],[2,0,2,2],[3,0,3,3],[3,4,3,6],[1,1,1,3],[0,1,0,3],[4,0,4,3],[11,0,14,0],[11,6,14,6],[15,0,16,0],[15,6,16,6],[5,0,5,6],[6,0,6,6],[20,0,20,6],[21,0,24,0],[21,6,24,6],[26,0,29,0],[26,6,29,6],[41,1,45,6],[41,0,45,0],[4,4,4,6],[36,2,36,4],[37,2,37,4],[38,2,38,4],[39,2,39,4],[32,0,32,6],[33,0,34,0],[33,1,34,1],[33,2,34,4],[35,2,35,4],[31,0,31,4],[30,0,30,4],[30,5,31,5],[30,6,31,6]]}
["Client Name:",null,null,null,"Date of Evaluation:"]
["Evaluator:",null,null,null,"Pasture ID:"]
["Soil Map Unit, Ecological Site and/or Forage Suitability Group:",null,null,null,"Livestock Type:"]
["Current Season Precipitation (Above Normal, Normal, Below Normal):"]
["Seasonal Temperature Trend (Above Normal, Normal, Below Normal):"]
[]
["Evaluate the present plant community and rate each indicator based on your observations.  Ratings for each category may range from 1 to 5  Sum the indicator scores to determine overall pasture condition."]
["Indicator","1 Point","2 Points","3 Points","4 Points","5 Points","Score"]
["Percent desirable plants*                 Dry weight.  Desirable based on livestock type.","Desirable species <20% of stand.","Desirable species 20 - 40% of stand.","Desirable species 41-60% of stand.","Desirable species 61-80% of stand.","Desirable species exceed 80% of stand."]
["Percent Legume by Dry Weight","<5% legumes                         OR                                     > 50% bloating legumes","5 - 10% legumes                            OR                                     > 40% bloating legumes","11-20% legumes","21-30% legumes","31-40% legumes.  No grass loss; grass may be increasing."]
["Live Plant Cover (includes dormant)","Less than 40% is live leaf canopy.  Remaining is either dead standing material or bare ground.","40-65% is live leaf canopy.  Remaining is either dead standing material or bare ground.","66-80% is live leaf canopy.  Remaining is either dead standing material or bare ground.","81-95% is live leaf canopy.  Remaining is either dead standing material or bare ground.","More than 95% is live leaf canopy.  Remaining is either dead standing material or bare ground."]
["Plant Diversity by Dry Weight         (*See footnote at bottom of page)","Diversity:  Very Low","Diversity: Low","Diversity: Moderate","Diversity: High","Diversity:  Very High"]
[null,"< 50% desirable species OR","2 dominant desirable species in 1 functional group OR","3 dominant desirable species in 1 functional group OR","4 dominant desirable species in 2 functional groups OR","4 dominant desirable species in 3 functional groups OR"]
[null,"1 dominant desirable species in 1 functional group OR","2 functional groups each represented by minor species totaling > 15%.","2-3 dominant desirable species in 2 functional groups OR","3 dominant desirable species in 3 functional groups OR","4 dominant desirable species in 2 functional groups AND"]
[null,"No dominant desirable species and all  minor species in each functional group totaling <15%,",null,"3 functional groups each represented by minor species totaling > 15%.","3 dominant desirable species in 2 functional groups AND 1 additional functional group represented by minor species totaling > 15%.","1 additional functional group represented by minor species totaling > 15%."]
["Plant Residue and Litter as Soil Cover                                (pull back canopy)","Bare soil is very easily seen;","Openings of bare soil can be seen fairly easily;","Small openings of bare soil can be seen, but minimal;","No bare soil is easily seen;","No bare soil is seen;"]
[null,"There is <20% cover on the soil surface or it is excessive and slow to break down.","Soil cover is 21-40%","Soil cover is 41-60%","Soil cover is 61-80%","Soil cover is >80% with good biological activity and decomposition of older residue."]
["Grazing Utilization and Severity","Pasture is overgrazed throughout.","Pasture consists primarily of overgrazed and/or refused areas (former dung areas, older plants, undesired plants).","Pastures show uneven grazing throughout with heavier grazing near water or feeding areas, or distinct zone grazing.","Pasture grazed evenly throughout with minimal overgrazing with some under grazed small areas and heavier use near water sources.","Pasture grazed evenly throughout with no overgrazing."]
["Livestock Concentration Areas                         (if field is <1 acre see ** footnote)","Livestock concentration areas are within 100 feet of, or are  a direct conveyance to surface water, and cover more than 0.1 acre (including trails).","Livestock concentration areas are within 100 feet of, or are a direct conveyance to surface water, and cover less than 0.1 acre (including trails).","Livestock concentration areas are farther than 100 feet from and are not a direct conveyance to surface water, and cover more than 0.1 acre (including trails).","Livestock concentration areas are farther than 100 feet from and are not a direct conveyance to surface water, and cover less than 0.1 acre (including trails).","Livestock concentration areas, including trails are not present."]
["*Use NRCS Nebraska desirable plant list for livestock species (FOTG>Section II> Pasture Condition Score). Functional groups are as appropriate for our state (rhizomatous, cool-season grasses, cool-season bunch grasses, legumes, warm-season grasses, non-leguminous forbs)."]
["Any time there are more undesirables than desirables, the answer will be 1 point.  Desirable species must total more than 50% of the total biomass.  Dominant species are > 15%.  Functional groups must be > 15% of stand to be counted."]
["Soil Compaction and Soil Regenerative Features  ***See footnote at bottom of page.","Compaction:  Dense or thick platy layer very distinct;","Compaction:   Dense or moderate platy layer noticeable;","Compaction:  Thin dense or platy layer still present;","Compaction:  Minor dense or platy layer; good aggregates common (crumbly soil);","Compaction:  No dense or platy layers; crumbly soil throughout;"]
[null,"Roots:  Dominantly horizontal; most shallow and/or sparse;","Roots:  Numerous horizontal; moderate amount, shallow and/or sparse;","Roots:  Some horizontal with increasing downward; ","Roots:  Few horizontal, more downward through the soil profile;","Roots:  Abundant growth primarily downward through the soil profile;"]
[null,"Color:  Surface horizon same as subsoil;",null,"Color:  Surface horizon moderately darker than subsoil;",null,"Color:  Surface horizon dramatically darker than subsoil;"]
[null,"Soil Life:  Few or no signs.","Soil Life:  Signs scattered in surface layer.","Soil Life:  Signs scattered throughout.","Soil Life:  Signs numerous throughout.","Soil Life:  Signs abundant throughout."]
["Plant Vigor","No plant recovery after grazing / harvest. Pale, yellow or brown, or severe stunting of desirable forage.","Some recovery. Yellowish green forage, or  moderately or slight stunting of desirable forage.","Adequate recovery of desirable forage.  Yellowish and dark green areas due to manure and urine patches.","Good recovery of desirable forage.  Light green and dark green forage present.","Rapid recovery of desirable forage.  All healthy green forage."]
["Erosion            (Circle all that apply; the overall indicator score will be the lowest rating indicated).","Sheet and Rill:  Plant density is insufficient to stop runoff, with poor infiltration.  Erosion easily visible throughout pasture;","Sheet and Rill:  Plant density slows runoff.  Erosion present and easily seen on steeper terrain.","Sheet and Rill:  Plant density good and runoff moderate.  If present, erosion concentrated on  heavily used areas;","Sheet and Rill:  Plant density high, runoff low, good infiltration.  May have evidence of past erosion if present;","Sheet and Rill:  Plant density high, no runoff, good infiltration. No evidence of present or past erosion."]
[null,"Wind:  Severe scoured areas and deposition throughout;","Wind:  Scoured areas common, deposition effecting plants;","Wind:  Occasional scoured areas, litter windrolled;","Wind:  Minimal soil exposed, some detached vegetation windrolled, minor plant damage;","Wind:  No exposed soil;"]
[null,"Streambank and/or Shoreline:  Banks bare, major sloughing, no bank vegetation; ","Streambank and/or Shoreline:  More than half the bank vegetation trampled; sloughing.","Streambank and/or Shoreline:  Less than half the bank vegetation trampled; eroding at crossing / entrances.","Streambank and/or Shoreline: Eroding at crossings and entrances; all bank vegetation is intact and banks are stable. ","Streambank and/or Shoreline: Vegetation is intact and banks are stable, hardened crossings and alternative water sources used; "]
[null,"Gully:  Very large mass movement, caving sides.","Gully:  Advancing upslope, increasing fingering extensions.","Gully:  Not all active, but extensions present.","Gully:  Stable with vegetative cover.","Gully:  None, drainage ways vegetative."]
["**If field size is less than 1 acre use 10% of the field size in place of 0.1 acre. ",null,null,null,null,"OVERALL PASTURE CONDITION SCORE:",{"$f":"IF(G9=0,\"\",(SUM(G9:G11,G12,G16,G18,G19,G22,G26,G27)))","v":""}]
["***Use a shovel.  Root and Compaction subindicators are primary and should be considered first.  Soil color and soil life are secondary subindicators which can be considered when applicable."]
[]
["OVERALL PASTURE CONDITION SCORE","INDIVIDUAL INDICATOR SCORE","MANAGEMENT CHANGE SUGGESTED"]
[]
["45 to 50",5,"No changes in management needed at this time."]
["35 to 45",4,"Minor changes would enhance, do most beneficial first."]
["25 to 35",3,"Improvements would benefit productivity and/or environment."]
["15 to 25",2,"Needs immediate management changes, high return likely."]
["10 to 15",1,"Major effort required in time, management, and expense."]
[]
["COMMENTS:"]
[]
[]
[]
[]
[]
[]
[]
[]
[]
[]
[]
[]
[]
[]
[]
[]
[]
[]
[]
[]
[]
[]
[]
[]
[]
[]
[]
[]
[]
[]
[]
[]
[]
[]
[]
[]
[]
[]
[]
[]
[]
[]
[]
[]
[]
[]
[]
[]
[]
[]
[]
[]
[]
[]
[]
[]
[]
[]
[]
[]
[]
[]
[]
[]
[]
[]
[]
[]
[]
[]
[null,null,null,null,null,null,null,null,null,null,null,null,null,null,null,null,null,null,null,null,null,null,null,null,"2.1 Shrubs, Arrowhead, Knotweed-PFP107B"]

{"sheet":"NE-ECS-64_Actual Use Report","index":14,"n_rows":57,"n_cols":14,"rows_kept":57,"cut":false,"hidden":false,"merged":[[0,1,0,3],[0,4,0,6],[0,7,0,9],[0,11,0,12],[1,13,5,18],[17,13,17,24],[24,13,24,24],[25,13,25,24],[26,13,26,24],[6,13,7,20],[8,13,8,20],[18,13,18,24],[19,13,19,24],[20,13,20,24],[21,13,21,24],[22,13,22,24],[23,13,23,24],[9,13,12,17]]}
["CLIENT: ",{"$f":"NEW_528_Forage_Balance!C2","v":"Mary Rancher - Sunnyvale Ranch"},null,null,"CONTRACT NUMBER:",null,null,{"$f":"NEW_528_Forage_Balance!R2","v":"12345K"},null,null,"DATE:"]
[null,null,null,null,null,null,null,null,null,null,null,null,null,"Use this sheet to document actual grazing use; when producer is receiving a payment for prescribed grazing.  This form or an equivalent method of documentation is needed before payment is made"]
[]
["Pasture Number","Pasture Name or Legal Description","Acres","Livestock Class","Number Animals","AU / Animal","Turn in Date","Take out Date","Total Days Grazed","Total Months","AUM or AUD Available","AUM or AUD Removed","Difference"]
[{"$f":"NEW_528_Forage_Balance!G69","v":"R1A"},null,{"$f":"IF(A5=0,\"\",(NEW_528_Forage_Balance!H69))","v":305},null,null,null,null,null,{"$f":"IF(H5=0,\"\",(_xlfn.DAYS(H5,G5)))","v":""},{"$f":"IF(H5=0,\"\",(I5/30.4))","v":""},{"$f":"IF(A5=0,\"\",(NEW_528_Forage_Balance!L69))","v":115},{"$f":"IF(H5=0,\"\",(E5*F5*J5))","v":""},{"$f":"IF(H5=0,\"\",(K5-L5))","v":""}]
[{"$f":"NEW_528_Forage_Balance!G70","v":"R1B"},null,{"$f":"IF(A6=0,\"\",(NEW_528_Forage_Balance!H70))","v":335},null,null,null,null,null,{"$f":"IF(H6=0,\"\",(_xlfn.DAYS(H6,G6)))","v":""},{"$f":"IF(H6=0,\"\",(I6/30.4))","v":""},{"$f":"IF(A6=0,\"\",(NEW_528_Forage_Balance!L70))","v":92},{"$f":"IF(H6=0,\"\",(E6*F6*J6))","v":""},{"$f":"IF(H6=0,\"\",(K6-L6))","v":""}]
[{"$f":"NEW_528_Forage_Balance!G71","v":"R2"},null,{"$f":"IF(A7=0,\"\",(NEW_528_Forage_Balance!H71))","v":320},null,null,null,null,null,"","",{"$f":"IF(A7=0,\"\",(NEW_528_Forage_Balance!L71))","v":122},"",""]
[{"$f":"NEW_528_Forage_Balance!G72","v":"R3"},null,{"$f":"IF(A8=0,\"\",(NEW_528_Forage_Balance!H72))","v":80},null,null,null,null,null,"","",{"$f":"IF(A8=0,\"\",(NEW_528_Forage_Balance!L72))","v":35},"",""]
[{"$f":"NEW_528_Forage_Balance!G73","v":"R4"},null,{"$f":"IF(A9=0,\"\",(NEW_528_Forage_Balance!H73))","v":160},null,null,null,null,null,"","",{"$f":"IF(A9=0,\"\",(NEW_528_Forage_Balance!L73))","v":58},"",""]
[{"$f":"NEW_528_Forage_Balance!G74","v":"R5A"},null,{"$f":"IF(A10=0,\"\",(NEW_528_Forage_Balance!H74))","v":240},null,null,null,null,null,"","",{"$f":"IF(A10=0,\"\",(NEW_528_Forage_Balance!L74))","v":66},"","","This sheet is made for 40 pastures.  Hide unused rows to clean up the printout."]
[{"$f":"NEW_528_Forage_Balance!G75","v":"R5B"},null,{"$f":"IF(A11=0,\"\",(NEW_528_Forage_Balance!H75))","v":263},null,null,null,null,null,"","",{"$f":"IF(A11=0,\"\",(NEW_528_Forage_Balance!L75))","v":106},"",""]
[{"$f":"NEW_528_Forage_Balance!G76","v":"R5C"},null,{"$f":"IF(A12=0,\"\",(NEW_528_Forage_Balance!H76))","v":137},null,null,null,null,null,"","",{"$f":"IF(A12=0,\"\",(NEW_528_Forage_Balance!L76))","v":29},"",""]
[{"$f":"NEW_528_Forage_Balance!G77","v":"R6"},null,{"$f":"IF(A13=0,\"\",(NEW_528_Forage_Balance!H77))","v":160},null,null,null,null,null,"","",{"$f":"IF(A13=0,\"\",(NEW_528_Forage_Balance!L77))","v":90},"",""]
[{"$f":"NEW_528_Forage_Balance!G78","v":0},null,{"$f":"IF(A14=0,\"\",(NEW_528_Forage_Balance!H78))","v":""},null,null,null,null,null,"","",{"$f":"IF(A14=0,\"\",(NEW_528_Forage_Balance!L78))","v":""},"",""]
[{"$f":"NEW_528_Forage_Balance!G79","v":0},null,{"$f":"IF(A15=0,\"\",(NEW_528_Forage_Balance!H79))","v":""},null,null,null,null,null,"","",{"$f":"IF(A15=0,\"\",(NEW_528_Forage_Balance!L79))","v":""},"",""]
[{"$f":"NEW_528_Forage_Balance!G80","v":0},null,{"$f":"IF(A16=0,\"\",(NEW_528_Forage_Balance!H80))","v":""},null,null,null,null,null,"","",{"$f":"IF(A16=0,\"\",(NEW_528_Forage_Balance!L80))","v":""},"",""]
[{"$f":"NEW_528_Forage_Balance!G81","v":0},null,{"$f":"IF(A17=0,\"\",(NEW_528_Forage_Balance!H81))","v":""},null,null,null,null,null,"","",{"$f":"IF(A17=0,\"\",(NEW_528_Forage_Balance!L81))","v":""},"",""]
[{"$f":"NEW_528_Forage_Balance!G82","v":0},null,{"$f":"IF(A18=0,\"\",(NEW_528_Forage_Balance!H82))","v":""},null,null,null,null,null,"","",{"$f":"IF(A18=0,\"\",(NEW_528_Forage_Balance!L82))","v":""},"",""]
[{"$f":"NEW_528_Forage_Balance!G83","v":0},null,{"$f":"IF(A19=0,\"\",(NEW_528_Forage_Balance!H83))","v":""},null,null,null,null,null,"","",{"$f":"IF(A19=0,\"\",(NEW_528_Forage_Balance!L83))","v":""},"",""]
[{"$f":"NEW_528_Forage_Balance!G84","v":0},null,{"$f":"IF(A20=0,\"\",(NEW_528_Forage_Balance!H84))","v":""},null,null,null,null,null,"","",{"$f":"IF(A20=0,\"\",(NEW_528_Forage_Balance!L84))","v":""},"",""]
[{"$f":"NEW_528_Forage_Balance!G85","v":0},null,{"$f":"IF(A21=0,\"\",(NEW_528_Forage_Balance!H85))","v":""},null,null,null,null,null,"","",{"$f":"IF(A21=0,\"\",(NEW_528_Forage_Balance!L85))","v":""},"",""]
[{"$f":"NEW_528_Forage_Balance!G86","v":0},null,{"$f":"IF(A22=0,\"\",(NEW_528_Forage_Balance!H86))","v":""},null,null,null,null,null,"","",{"$f":"IF(A22=0,\"\",(NEW_528_Forage_Balance!L86))","v":""},"",""]
[{"$f":"NEW_528_Forage_Balance!G87","v":0},null,{"$f":"IF(A23=0,\"\",(NEW_528_Forage_Balance!H87))","v":""},null,null,null,null,null,"","",{"$f":"IF(A23=0,\"\",(NEW_528_Forage_Balance!L87))","v":""},"",""]
[{"$f":"NEW_528_Forage_Balance!G88","v":0},null,{"$f":"IF(A24=0,\"\",(NEW_528_Forage_Balance!H88))","v":""},null,null,null,null,null,"","",{"$f":"IF(A24=0,\"\",(NEW_528_Forage_Balance!L88))","v":""},"",""]
[{"$f":"NEW_528_Forage_Balance!G89","v":0},null,{"$f":"IF(A25=0,\"\",(NEW_528_Forage_Balance!H89))","v":""},null,null,null,null,null,"","",{"$f":"IF(A25=0,\"\",(NEW_528_Forage_Balance!L89))","v":""},"",""]
[{"$f":"NEW_528_Forage_Balance!G90","v":0},null,{"$f":"IF(A26=0,\"\",(NEW_528_Forage_Balance!H90))","v":""},null,null,null,null,null,"","",{"$f":"IF(A26=0,\"\",(NEW_528_Forage_Balance!L90))","v":""},"",""]
[{"$f":"NEW_528_Forage_Balance!G91","v":0},null,{"$f":"IF(A27=0,\"\",(NEW_528_Forage_Balance!H91))","v":""},null,null,null,null,null,"","",{"$f":"IF(A27=0,\"\",(NEW_528_Forage_Balance!L91))","v":""},"",""]
[{"$f":"NEW_528_Forage_Balance!G92","v":0},null,{"$f":"IF(A28=0,\"\",(NEW_528_Forage_Balance!H92))","v":""},null,null,null,null,null,"","",{"$f":"IF(A28=0,\"\",(NEW_528_Forage_Balance!L92))","v":""},"",""]
[{"$f":"NEW_528_Forage_Balance!G93","v":0},null,{"$f":"IF(A29=0,\"\",(NEW_528_Forage_Balance!H93))","v":""},null,null,null,null,null,"","",{"$f":"IF(A29=0,\"\",(NEW_528_Forage_Balance!L93))","v":""},"",""]
[{"$f":"NEW_528_Forage_Balance!G94","v":0},null,{"$f":"IF(A30=0,\"\",(NEW_528_Forage_Balance!H94))","v":""},null,null,null,null,null,"","",{"$f":"IF(A30=0,\"\",(NEW_528_Forage_Balance!L94))","v":""},"",""]
[{"$f":"NEW_528_Forage_Balance!G95","v":0},null,{"$f":"IF(A31=0,\"\",(NEW_528_Forage_Balance!H95))","v":""},null,null,null,null,null,"","",{"$f":"IF(A31=0,\"\",(NEW_528_Forage_Balance!L95))","v":""},"",""]
[{"$f":"NEW_528_Forage_Balance!G96","v":0},null,{"$f":"IF(A32=0,\"\",(NEW_528_Forage_Balance!H96))","v":""},null,null,null,null,null,"","",{"$f":"IF(A32=0,\"\",(NEW_528_Forage_Balance!L96))","v":""},"",""]
[{"$f":"NEW_528_Forage_Balance!G97","v":0},null,{"$f":"IF(A33=0,\"\",(NEW_528_Forage_Balance!H97))","v":""},null,null,null,null,null,"","",{"$f":"IF(A33=0,\"\",(NEW_528_Forage_Balance!L97))","v":""},"",""]
[{"$f":"NEW_528_Forage_Balance!G98","v":0},null,{"$f":"IF(A34=0,\"\",(NEW_528_Forage_Balance!H98))","v":""},null,null,null,null,null,"","",{"$f":"IF(A34=0,\"\",(NEW_528_Forage_Balance!L98))","v":""},"",""]
[{"$f":"NEW_528_Forage_Balance!G99","v":0},null,{"$f":"IF(A35=0,\"\",(NEW_528_Forage_Balance!H99))","v":""},null,null,null,null,null,"","",{"$f":"IF(A35=0,\"\",(NEW_528_Forage_Balance!L99))","v":""},"",""]
[{"$f":"NEW_528_Forage_Balance!G100","v":0},null,{"$f":"IF(A36=0,\"\",(NEW_528_Forage_Balance!H100))","v":""},null,null,null,null,null,"","",{"$f":"IF(A36=0,\"\",(NEW_528_Forage_Balance!L100))","v":""},"",""]
[{"$f":"NEW_528_Forage_Balance!G101","v":0},null,{"$f":"IF(A37=0,\"\",(NEW_528_Forage_Balance!H101))","v":""},null,null,null,null,null,"","",{"$f":"IF(A37=0,\"\",(NEW_528_Forage_Balance!L101))","v":""},"",""]
[{"$f":"NEW_528_Forage_Balance!G102","v":0},null,{"$f":"IF(A38=0,\"\",(NEW_528_Forage_Balance!H102))","v":""},null,null,null,null,null,"","",{"$f":"IF(A38=0,\"\",(NEW_528_Forage_Balance!L102))","v":""},"",""]
[{"$f":"NEW_528_Forage_Balance!G103","v":0},null,{"$f":"IF(A39=0,\"\",(NEW_528_Forage_Balance!H103))","v":""},null,null,null,null,null,"","",{"$f":"IF(A39=0,\"\",(NEW_528_Forage_Balance!L103))","v":""},"",""]
[{"$f":"NEW_528_Forage_Balance!G104","v":0},null,{"$f":"IF(A40=0,\"\",(NEW_528_Forage_Balance!H104))","v":""},null,null,null,null,null,"","",{"$f":"IF(A40=0,\"\",(NEW_528_Forage_Balance!L104))","v":""},"",""]
[{"$f":"NEW_528_Forage_Balance!G105","v":0},null,{"$f":"IF(A41=0,\"\",(NEW_528_Forage_Balance!H105))","v":""},null,null,null,null,null,"","",{"$f":"IF(A41=0,\"\",(NEW_528_Forage_Balance!L105))","v":""},"",""]
[{"$f":"NEW_528_Forage_Balance!G106","v":0},null,{"$f":"IF(A42=0,\"\",(NEW_528_Forage_Balance!H106))","v":""},null,null,null,null,null,"","",{"$f":"IF(A42=0,\"\",(NEW_528_Forage_Balance!L106))","v":""},"",""]
[{"$f":"NEW_528_Forage_Balance!G107","v":0},null,{"$f":"IF(A43=0,\"\",(NEW_528_Forage_Balance!H107))","v":""},null,null,null,null,null,"","",{"$f":"IF(A43=0,\"\",(NEW_528_Forage_Balance!L107))","v":""},"",""]
[{"$f":"NEW_528_Forage_Balance!G108","v":0},null,{"$f":"IF(A44=0,\"\",(NEW_528_Forage_Balance!H108))","v":""},null,null,null,null,null,"","",{"$f":"IF(A44=0,\"\",(NEW_528_Forage_Balance!L108))","v":""},"",""]
[{"$f":"NEW_528_Forage_Balance!G109","v":0},null,{"$f":"IF(A45=0,\"\",(NEW_528_Forage_Balance!H109))","v":""},null,null,null,null,null,"","",{"$f":"IF(A45=0,\"\",(NEW_528_Forage_Balance!L109))","v":""},"",""]
[{"$f":"NEW_528_Forage_Balance!G110","v":0},null,{"$f":"IF(A46=0,\"\",(NEW_528_Forage_Balance!H110))","v":""},null,null,null,null,null,"","",{"$f":"IF(A46=0,\"\",(NEW_528_Forage_Balance!L110))","v":""},"",""]
[{"$f":"NEW_528_Forage_Balance!G111","v":0},null,{"$f":"IF(A47=0,\"\",(NEW_528_Forage_Balance!H111))","v":""},null,null,null,null,null,"","",{"$f":"IF(A47=0,\"\",(NEW_528_Forage_Balance!L111))","v":""},"",""]
[{"$f":"NEW_528_Forage_Balance!G112","v":0},null,{"$f":"IF(A48=0,\"\",(NEW_528_Forage_Balance!H112))","v":""},null,null,null,null,null,"","",{"$f":"IF(A48=0,\"\",(NEW_528_Forage_Balance!L112))","v":""},"",""]
[{"$f":"NEW_528_Forage_Balance!G113","v":0},null,{"$f":"IF(A49=0,\"\",(NEW_528_Forage_Balance!H113))","v":""},null,null,null,null,null,"","",{"$f":"IF(A49=0,\"\",(NEW_528_Forage_Balance!L113))","v":""},"",""]
[{"$f":"NEW_528_Forage_Balance!G114","v":0},null,{"$f":"IF(A50=0,\"\",(NEW_528_Forage_Balance!H114))","v":""},null,null,null,null,null,"","",{"$f":"IF(A50=0,\"\",(NEW_528_Forage_Balance!L114))","v":""},"",""]
[{"$f":"NEW_528_Forage_Balance!G115","v":0},null,{"$f":"IF(A51=0,\"\",(NEW_528_Forage_Balance!H115))","v":""},null,null,null,null,null,"","",{"$f":"IF(A51=0,\"\",(NEW_528_Forage_Balance!L115))","v":""},"",""]
[{"$f":"NEW_528_Forage_Balance!G116","v":0},null,{"$f":"IF(A52=0,\"\",(NEW_528_Forage_Balance!H116))","v":""},null,null,null,null,null,"","",{"$f":"IF(A52=0,\"\",(NEW_528_Forage_Balance!L116))","v":""},"",""]
[{"$f":"NEW_528_Forage_Balance!G117","v":0},null,{"$f":"IF(A53=0,\"\",(NEW_528_Forage_Balance!H117))","v":""},null,null,null,null,null,"","",{"$f":"IF(A53=0,\"\",(NEW_528_Forage_Balance!L117))","v":""},"",""]
[{"$f":"NEW_528_Forage_Balance!G118","v":0},null,{"$f":"IF(A54=0,\"\",(NEW_528_Forage_Balance!H118))","v":""},null,null,null,null,null,"","",{"$f":"IF(A54=0,\"\",(NEW_528_Forage_Balance!L118))","v":""},"",""]
[{"$f":"NEW_528_Forage_Balance!G119","v":0},null,{"$f":"IF(A55=0,\"\",(NEW_528_Forage_Balance!H119))","v":""},null,null,null,null,null,"","",{"$f":"IF(A55=0,\"\",(NEW_528_Forage_Balance!L119))","v":""},"",""]
[{"$f":"NEW_528_Forage_Balance!G120","v":0},null,{"$f":"IF(A56=0,\"\",(NEW_528_Forage_Balance!H120))","v":""},null,null,null,null,null,"","",{"$f":"IF(A56=0,\"\",(NEW_528_Forage_Balance!L120))","v":""},"",""]
[{"$f":"NEW_528_Forage_Balance!G121","v":0},null,{"$f":"IF(A57=0,\"\",(NEW_528_Forage_Balance!H121))","v":""},null,null,null,null,null,"","",{"$f":"IF(A57=0,\"\",(NEW_528_Forage_Balance!L121))","v":""},"",""]

{"sheet":"NEW_DATA","index":15,"n_rows":1978,"n_cols":26,"rows_kept":1978,"cut":false,"hidden":false,"merged":[]}
[null,"MLRA","Ecosite","COMMUNITIES","Production","MLRA2","GrowthCurveName","Jan","Feb","Mar","Apr","May","Jun","Jul","Aug","Sept","Oct","Nov","Dec","Total",null,"Livestock Type","AU Value","oven dry","air dry","Monthly "]
[null,"MLRA_60A","Clayey_13_16_60A","1.1 Rhizomatous Wheatgrass, Green Needlegrass, Big Sage-CyLow60A",1800,"M_60A","102C- Introduced Cool Seasons",0,0,5,15,28,30,10,2,5,5,0,0,{"$f":"SUM(H2:S2)","v":100},null,"Cow/calf pair",1,26,30,{"$f":"Y2*30.4","v":912}]
[null,"MLRA_63B","Clayey_16_18_60A","1.2 Big Sage, Rhizomatous Wheatgrass, Green Needlegrass-CyLow60A",1600,"M_63B","102C-Warm Season Natives Dominant",0,0,3,7,17,23,25,17,7,1,0,0,{"$f":"SUM(H3:S3)","v":100},null,"Dry cows",0.92,24,28,{"$f":"Y3*30.4","v":851.19999999999993}]
[null,"MLRA_64","Clayey_Overflow_60A","1.3 Rhizomatous Wheatgrass, Blue grama, Buffalograss, Big Sage-CyLow60A",1600,"M_64","102C-Natives / Co-dom. Invasives",0,0,4,11,22,27,18,8,6,4,0,0,100,null,"Bull",1.35,35,{"$f":"30*1.35","v":40.5},1231.2]
[null,"MLRA_65","Claypan_60A","1.4 Big Sage, Rhizomatous Wheatgrass, Shortgrass-CyLow60A",900,"M_65","106-Clayey soils, Introduced dom or co-dom.",0,0,5,15,25,25,5,5,10,5,5,0,100,null,"Yearling",null,15.6,18,547.19999999999993]
[null,"MLRA_66","Closed_Depression_60A","2.1 Blue Grama, Buffalograss, Pricklypear-CyLow60A",650,"M_66","106-Upland Sites, Native Tall, Mid Grasses Dom.",0,0,0,5,25,35,20,10,5,0,0,0,100,null,"1st calf heifer",0.8,{"$f":"26*0.8","v":20.8},{"$f":"30*0.8","v":24},729.59999999999991]
[null,"MLRA_67A","Dense_Clay_60A","3.1 Annuals, Rhizomatous Wheatgrass, Threeawn-CyLow60A",700,"M_67A","106-Lowland Sites, Warm Season Domin.",0,0,5,5,25,30,20,10,5,0,0,0,100,null,"Horse, mature",1.25,{"$f":"26*1.25","v":32.5},{"$f":"30*1.25","v":37.5},1140]
[null,"MLRA_71","Loamy_13_16_60A","4.1 Rhizomatous Wheatgrass, Green Needlegrass, Non-Native Cool Seasons-CyLow60A",1250,"M_71","106-Lowland Sites, Introduced dominant",0,0,5,15,25,25,5,5,10,5,5,0,100,null,"Sheep, mature",0.2]
[null,"MLRA_72","Loamy_16_18_60A","4.2 Shortgrass, Rhizomatous Wheatgrass, Nonnative Cool Seasons-CyLow60A",650,"M_72","106-Upland Loamy or shallow sites, Short warm season or introduced",0,0,5,15,25,25,5,5,10,5,5,0,100,null,"Lamb, 1 year old",0.15]
[null,"MLRA_73","Loamy_Overflow_60A","5.1 Go-back-CyLow60A",450,"M_73","60A- Western/Grama/Buffalo Dom.",0,0,6,15,20,26,17,9,4,3,0,0,100,null,"Goat, mature",0.15]
[null,"MLRA_75","Loamy_Terrace_60A","1.1 Western Wheatgrass, Green Needlegrass-CyHigh60A",2000,"M_75","60A- Wheatgrass/Alkali Sacaton",0,0,5,13,20,25,18,11,5,3,0,0,100,null,"Kid, 1 year old",0.1]
[null,"MLRA_102C","Lowland_60A","1.2 Wheatgrass, Buffalograss, Blue Grama-CyHigh60A",1800,"M_102C","60A-Cl, Lo, ThCl (13-16) Low Similarity Index",0,0,2,5,15,25,30,15,7,1,0,0,100,null,"Bison",1]
[null,"MLRA_106","Porous_Clay_60A","2.1 Buffalograss Blue Grama Sod-CyHigh60A",700,"M_106","60A-Clay Overflow Sites",0,0,4,11,19,23,20,12,6,5,0,0,100,null,"Deer, white tail",0.15]
[null,"MLRA_107B","Saline_Lowland_60A","2.2 Threeawn, Annuals-CyHigh60A",700,"M_107B","60A-Little Blue with grama/sedge/needlegrass",0,0,3,10,20,28,21,10,5,3,0,0,100,null,"Deer, mule",0.2]
[null,null,"Saline_Subirrigated_60A","3.1 Renovated Western, Green Needlegrass, Short grassesCyHigh60A",2200,null,"60A-Loamy Lowland, loamy terrace and wetland Sites",0,0,4,11,19,23,20,12,6,5,0,0,100,null,"Elk",0.6]
[null,null,"Saline_Upland_60A ","3.2 Renovated Blue Grama-Buffalograss Sod-CyHigh60A",700,null,"60A-Loamy Overflow Sites",0,0,6,15,20,26,17,9,4,3,0,0,100]
[null,null,"Sands_60A","4.1 Western Wheatgrass, Non-Native Cool Seasons-CyHigh60A",1600,null,"60A-Needleandthread/Sandreed",0,0,3,10,20,28,21,10,5,3,0,0,100]
[null,null,"Sandy_60A","5.1. Juniper and/or Ponderosa Pine-CyHigh60A",1500,null,"60A-Pine or Juniper Dominant",0,0,3,10,23,34,15,6,5,4,0,0,100]
[null,null,"Shallow_Clay_60A","6.1 Go-Back-CyHigh60A",800,null,"60A-Sa Blue Grama & Needleandthread or sedge dom.",0,0,3,7,18,25,25,15,7,0,0,0,100]
[null,null,"Shallow_Dense_Clay_60A","6.2A Seeding, Introduced Low Mgmt.-CyHigh60A",1100,null,"60A-Saline and closed depression Sites",0,0,3,10,16,22,23,14,7,5,0,0,100]
[null,null,"Shallow_Loamy_60A","6.2B Seeding, Introduced Med Mgmt.-CyHigh60A",2000,null,"60A-Sandreed, Bluestem and/or Sideoats Dom.",0,0,3,7,18,25,25,15,7,0,0,0,100]
[null,null,"Shallow_Porous_Clay_60A","6.2C Seeding, Introduced High Mgmt.-CyHigh60A",3000,null,"60A-Sb Cool Season Dominant",0,0,5,13,20,25,18,11,5,3,0,0,100]
[null,null,"Shallow_Sandy_60A","1.1 Rhizomatous Wheatgrass, Green Needlegrass, Tall Warm Seasons-CO60A",2100,null,"60A-Sb, Sa High Similarity Index",0,0,2,8,15,21,26,15,8,5,0,0,100]
[null,null,"Subirrigated_60A","1.2 Rhizomatous Wheatgrass, Needlegrass-CO60A",2500,null,"60A-Shallow Clay,Porous Clay, Shallow Sandy Sites",0,0,3,10,23,34,15,6,5,4,0,0,100]
[null,null,"Thin_Claypan_60A","1.3 Rhizomatous Wheatgrass-CO60A",1500,null,"60A-Threeawn/annuals/dropseed",0,0,3,10,20,28,21,10,5,3,0,0,100]
[null,null,"Thin_Upland_60A","2.1 Western Wheatgrass, Annuals-CO60A",900,null,"63B - Upland Blue Grama/Buffalograss Sod",0,0,2,5,15,25,20,15,17,1,0,0,100]
[null,null,"Very_Shallow_60A","3.1A Tame Pasture, Low Mgt-CO60A",2000,null,"63B-Bluestems dom or co-dom",0,0,3,7,17,25,25,15,7,1,0,0,100]
[null,null,"Wetland_60A","3.1B Tame Pasture, Mod Mgt-CO60A",3000,null,"63B-Bromegrass/Bluegrass&/or Wheatgrass Dom",0,0,4,12,25,36,10,5,4,4,0,0,100]
[null,null,"Clayey_63B","3.1C Tame Pasture, High Mgt-CO60A",4000,null,"63B-CD Invaded or saltgrass domin.",0,0,3,10,20,28,21,10,5,3,0,0,100]
[null,null,"Clayey_Overflow_63B","3.1D Irrigated Pasture-CO60A",7000,null,"63B-Clay and Clay Upland Low Sim. Index",0,0,3,10,20,28,21,10,5,3,0,0,100]
[null,null,"Claypan_63B","1.1 Rhizomatous Wheatgrass, Needlegrass, Blue Grama-CP60A",1400,null,"63B-LoO and Very Shallow sites",0,0,3,10,23,34,15,6,5,4,0,0,100]
[null,null,"Closed_Depression_63B","1.2 Blue Grama, Rhizomatous Wheatgrass-CP60A",1000,null,"63B-Lowlands, Shallow Clay Western/Grama Dominant",0,0,3,10,20,28,21,10,5,3,0,0,100]
[null,null,"Dense_Clay_63B","2.1 Blue Grama, Sedge, Cactus-CP60A",650,null,"63B-SaLo Cordgrass/Wheatgr/Alkaligr",0,0,5,13,20,25,18,11,5,3,0,0,100]
[null,null,"Loamy_63B","2.2 Threeawn, Annuals-CP60A",450,null,"63B-SaLo Low Sim. Index",0,0,4,11,19,23,20,12,6,5,0,0,100]
[null,null,"Loamy_Overflow_63B","3.1A Tame Pasture, Low Mgt-CP60A",1100,null,"63B-SaLo Wheatgr./Foxtail Barley/Saltgr",0,0,5,13,20,25,18,11,5,3,0,0,100]
[null,null,"Saline_Lowland_63B","3.1B Tame Pasture, Med Mgt-CP60A",1500,null,"63B-SaLo Wheatgrass/Alkaligrass",0,0,6,15,20,26,17,9,4,3,0,0,100]
[null,null,"Shallow_63B","3.1C Tame Pasture, High Mgt-CP60A",2000,null,"63B-Sedges, Blue Grama &/or saltgrass",0,0,3,7,17,25,25,15,7,1,0,0,100]
[null,null,"Shallow_Clay_63B","1.1a Rhizomatous Wheatgrass, Grasslikes, Forbs-CD60A",3500,null,"63B-SwCl Tree Encroachment",1,3,7,11,24,27,12,5,4,3,2,1,100]
[null,null,"Thin_Claypan_63B","1.1b Forb dominated-CD60A",2500,null,"63B-Uplands Western/Blue Grama Dominant",0,0,3,10,23,34,15,6,5,4,0,0,100]
[null,null,"Thin_Upland_63B","1.2 Rhizomatous Wheatgrass, Inland Saltgrass-CD60A",1800,null,"64 Clayey, Loamy, Warm Season Short Grass",0,0,3,7,15,20,30,15,5,5,0,0,100]
[null,null,"Very_Shallow_63B","2.1 Foxtail Barley, Inland Saltgrass-CD60A",800,null,"64 L Juniper/Pine/Shrubs Dominant",1,3,7,10,20,28,15,5,4,4,2,1,100]
[null,null,"Badlands_Overflow_64","3.1 Go-Back, Disturbance-CD60A",500,null,"64 Lo,LoTe, Cl, Thin Claypan Lower Similarity Index",0,0,5,10,20,25,20,10,5,5,0,0,100]
[null,null,"Badlands_Terrace_64","1.1 Rhizomatous Wheatgrass, Green Needlegrass-DC60A",1300,null,"64 Lowland, Overflow, Sb Sites High Similarity Index",0,0,5,12,20,25,19,11,5,3,0,0,100]
[null,null,"Clayey_14_17_64","1.2 Rhizomatous Wheatgrass, Bare Ground-DC60A",600,null,"64 Overflow, Sb -Western/Needlegrass",0,0,5,8,25,30,15,10,2,5,0,0,100]
[null,null,"Clayey_17_20_64","1.1 Rhizomatous Wheatgrass, Needlegrass, Big Sage-Lo-LowPZ60A",1900,null,"64 Sa, Sy, Thin Up High Similarity Index",0,0,3,7,15,20,30,15,5,5,0,0,100]
[null,null,"Clayey_Overflow_64","1.2 Big Sage, Rhizomatous Wheatgrass,Needlegrass-Lo-LowPZ60A",1600,null,"64 Shallow sites, cool season dominated",0,0,5,10,20,25,20,10,5,5,0,0,100]
[null,null,"Claypan_64","1.3 Shortgrass, Rhizomatous Wheatgrass, Big Sage-Lo-LowPZ60A",1100,null,"64 Shallow sites, warm season dom.",0,0,5,8,15,24,23,15,5,5,0,0,100]
[null,null,"Closed_Depression_64","1.4 Big Sage, Rhizomatous Wheatgrass, Shortgrass-Lo-LowPZ60A",900,null,"64 Upland Sites Mid & Lower Similarity Index",0,0,5,8,15,24,23,15,5,5,0,0,100]
[null,null,"Dense_Clay_64","2.1 Warm Season Shortgrass, Prickly Pear-Lo-LowPZ60A",600,null,"64 Uplands Cool season dominant",0,0,5,15,28,25,15,2,5,5,0,0,100]
[null,null,"Loamy_14_17_64","3.1 Annuals, Rhizomatous Wheatgrass, Threeawn-Lo-LowPZ60A",700,null,"64-Badlands and Saline Sites",0,0,3,8,18,27,23,12,6,3,0,0,100]
[null,null,"Loamy_17_20_64","4.1 Renovated Rhizomatous Wheatgrass, Needlegrass, Non-Native Cool Seasons-Lo-LowPZ60A",1800,null,"64-Overflow sites Low Similarity Index",0,0,5,13,28,28,12,5,6,3,0,0,100]
[null,null,"Loamy_Overflow_64","4.2 Renovated Shortgrass, Rhizomatous Wheatgrass, Nonnative Cool Seasons-Lo-LowPZ",800,null,"64-Sb Higher Similarity Index",0,0,3,7,15,25,25,17,6,2,0,0,100]
[null,null,"Loamy_Terrace_64","5.1 Go-back-Lo-LowPZ60A",500,null,null,null,null,null,null,null,null,null,null,null,null,null,null,0]
[null,null,"Saline_Lowland_64","5.2A Re-Seeded Natives Excellent Stand-Lo-LowPZ60A",2200,null,"64-Sb Low Similarity Index",0,0,5,8,25,30,15,10,2,5,0,0,100]
[null,null,"Saline_Subirrigated_64","5.2B Re-Seeded Natives Good Stand-Lo-LowPZ60A",1800,null,"64-Wetland sites",0,0,5,12,20,25,19,11,5,3,0,0,100]
[null,null,"Sands_64","5.2C Re-Seeded Natives Fair Stand-Lo-LowPZ60A",1250,null,"64-WSb Cool Season Dominant",0,0,5,13,28,28,12,5,6,3,0,0,100]
[null,null,"Sandy_14_17_64","5.2D Re-Seeded Introduced Low Mgt-Lo-LowPZ60A",1400,null,"65-CS Blowoutgrass/sandhill muhly",0,0,5,15,20,20,20,10,7,3,0,0,100]
[null,null,"Sandy_17_20_64","5.2E Re-Seeded Introduced Med Mgt-Lo-LowPZ60A",1850,null,"65-CS Tall Grass Dominant",0,0,5,5,15,25,30,10,7,3,0,0,100]
[null,null,"Sandy_Lowland_64","5.2F Re-Seeded Introduced High Mgt-Lo-LowPZ60A",2300,null,"65-Sa Short Grass Dominant",0,0,0,5,15,30,25,15,10,0,0,0,100]
[null,null,"Shallow_64","1.1 Western Wheatgrass, Needlegrass-LoHighPZ60A",2200,null,"65-Sa Tall Grass Dominant",0,0,5,5,15,25,30,10,7,3,0,0,100]
[null,null,"Shallow_Clay_64","1.2 Blue Grama, Buffalograss, Western Wheatgrass-LoHighPZ60A",1500,null,"65-SaSb Alkali Sacaton Dominant",0,0,5,10,20,30,15,10,5,5,0,0,100]
[null,null,"Subirrigated_64","2.1 Blue Grama, Buffalograss Sod-LoHighPZ60A",800,null,"65-SaSb Inland Saltgrass Dominant",0,0,0,5,10,40,25,15,5,0,0,0,100]
[null,null,"Thin_Breaks_64","2.2 Threeawn, Annuals-LoHighPZ60A",700,null,"65-SB ",0,0,0,10,20,25,20,15,10,0,0,0,100]
[null,null,"Thin_Claypan_64","3.1 Renovated Western Wheatgrass, Needlegrass, Blue Grama, Buffalograss-LoHighPZ60A",2300,null,"65-SwG ",0,0,0,5,15,30,25,15,10,0,0,0,100]
[null,null,"Thin_Upland_64","3.2 Renovated Blue Grama, Buffalograss Sod-LoHighPZ60A",850,null,"65-Sy (18-25) Higher SI",0,0,5,5,15,25,30,10,7,3,0,0,100]
[null,null,"Very_Shallow_64","4.1 Western Wheatgrass, Non-Native, Cool Season-LoHighPZ60A",1600,null,"65-Sy Lower SI",0,0,5,10,20,25,20,15,5,0,0,0,100]
[null,null,"Wetland_64","5.1 Juniper / Ponderosa Pine-LoHighPZ60A",800,null,"66-All Sites Trees Dominant",1,3,7,10,20,28,15,5,5,4,1,1,{"$f":"SUM(H67:S67)","v":100}]
[null,null,"Wet_Subirrigated_64","6.1 Go-Back-LoHighPZ60A",700,null,"66-CD ",0,0,5,15,28,30,10,2,5,5,0,0,100]
[null,null,"Choppy_Sands_14_17_65","6.2A Range Seeding, Excellent Stand-LoHighPZ60A",2300,null,"66-Lo (18-25) Needlegrass/Western/Bluestem",0,0,5,10,25,30,15,5,5,5,0,0,100]
[null,null,"Choppy_Sands_17_22_65","6.2B Range Seeding, Good Stand-LoHighPZ60A",2000,null,"66-Lo / LoT Blue Grama/Cool Season",0,0,5,10,20,25,20,10,5,5,0,0,100]
[null,null,"Choppy_Sands_22_25_65","6.2C Range Seeding, Fair Stand-LoHighPZ60A",1500,null,"66-Lo Threeawn/Forbs Dom.",0,0,5,8,15,24,23,15,5,5,0,0,100]
[null,null,"Deep_Wetland_65","6.2D Tame Pasture, Low Mgt-LoHighPZ60A",1700,null,"66-Lo/LoT (18-25) Cool Season Dom.",0,0,5,15,28,30,10,2,5,5,0,0,100]
[null,null,"Saline_Subirrigated_65","6.2E Tame Pasture, Mod Mgt-LoHighPZ60A",2700,null,"66-LoOv Higher SI",0,0,5,12,20,25,19,11,5,3,0,0,100]
[null,null,"Sands_14_17_65","6.2F Tame Pasture, High Mgt-LoHighPZ60A",3700,null,"66-LoOv Lower SI",0,0,5,12,25,33,12,5,5,3,0,0,100]
[null,null,"Sands_17_22_65","6.2G Tame Pasture, Irrigated, LoHighPZ60A",6900,null,"66-Sa (18-22) Lower SI",0,0,3,8,15,24,25,15,5,5,0,0,100]
[null,null,"Sands_22_25_65","1.1 Big Bluestem, Rhizomatous Wheatgrass, Trees & Shrubs-LoO60A",2800,null,"66-Sa (22-25) Tall or Mid Grass Dom.",0,0,5,5,15,25,30,10,7,3,0,0,100]
[null,null,"Sandy_14_17_65","2.1 Rhizomatous Wheatgrass, Kentucky Bluegrass, Reman. Big Bluestem-LoO60A",2200,null,"66-Sa, SaLo Short grass or club moss dom.",0,0,0,5,15,30,25,15,10,0,0,0,100]
[null,null,"Sandy_17_22_65","2.2 Rhizomatous Wheatgrass, Bluegrass, Mixed Shrubs & trees-LoO60A",1600,null,"66-Sa, Sy, Sw Higher SI",0,0,5,8,15,24,23,15,5,5,0,0,100]
[null,null,"Sandy_22_25_65","3.1 Kentucky Bluegrass, Weedy Annuals, Forbs-LoO60A",1000,null,"66-Saline Subirrigated ",0,0,3,8,18,27,23,12,6,3,0,0,100]
[null,null,"Sandy_Lowland_65","4.1 Cottonwood, Prunus, Snowberry-LoO60A",2500,null,"66-SaLoTall Grass Dom.",0,0,5,5,15,25,30,10,7,3,0,0,100]
[null,null,"Shallow_to_Gravel_65","4.2 Mature Cottonwood, Green Ash, boxelder, Shrubs-LoO60A",2500,null,"66-Sb Bluegrass/Wheatgrass/Brome",0,0,5,15,30,25,10,5,10,0,0,0,100]
[null,null,"Subirrigated_65","4.3 Green Ash, Boxelder, Shrubs-LoO60A",2200,null,"66-Sb Reed Canary/Creeping Foxtail",0,0,0,5,20,35,25,10,5,0,0,0,100]
[null,null,"Wetland_65","5.0 Native Trees, Russian Olive, Salt Cedar-LoO60A",750,null,"66-Sb Tall Grass Dominant",0,0,3,7,15,25,25,17,6,2,0,0,100]
[null,null,"Wet_Subirrigated_65","3.1A Tame Pasture, Low Mgt-LoO60A",2000,null,"66-Shallow Sites Moderate SI",0,0,5,10,20,25,20,10,5,5,0,0,100]
[null,null,"Choppy_Sands_66","3.1B Tame Pasture, Mod Mgt-LoO60A",3000,null,"66-Sy Blue Grama/Western",0,0,5,10,20,25,20,10,5,5,0,0,100]
[null,null,"Closed_Depression_66","3.1C Tame Pasture, High Mgt-LoO60A",4000,null,"66-Sy Bluegrass/Ragweed",0,0,5,10,25,30,15,5,5,5,0,0,100]
[null,null,"Interdunal_Lowland_66","3.1D Irrigated Pasture-LoO60A",7000,null,"66-Wetland",0,0,0,5,20,35,25,10,5,0,0,0,100]
[null,null,"Loamy_18_22_66","1.1 Rhizomatous Wheatgrass, Green Needlegrass, Shrubs-LoTer60A",2500,null,"66-WSb  Warm Season Dominant",0,0,3,8,18,27,23,12,6,3,0,0,100]
[null,null,"Loamy_22_25_66","1.2 Blue Grama, Rhizomatous Wheatgrass, Shrubs-LoTer60A",800,null,"66-WSb Cool Season Dominant",0,0,5,8,25,30,15,10,2,5,0,0,100]
[null,null,"Loamy_Overflow_66","2.1 Pioneer Perennials, Annuals, Shrubs-LoTer60A",600,null,"67A - Threadleaf Sedge Domin.",0,0,0,5,25,40,15,5,10,0,0,0,100]
[null,null,"Loamy_Terrace_66","3.1 Rhizomatous Wheatgrass, Green Needlegrass, Introduced Cool Seasons-LoTer60A",2100,null,"67A-Clay & Gravelly-Blue Grama Dom.",0,0,0,5,20,35,30,5,5,0,0,0,100]
[null,null,"Saline_Subirrigated_66","4.1 Invaded rangeland - Smooth Brome, Kentucky Bluegrass-LoTer60A",1900,null,"67A-CS-Sands/Sandy/CS sites",0,0,0,5,20,35,30,5,5,0,0,0,100]
[null,null,"Sands_18_22_66","5.1 Go-Back-LoTer60A",700,null,"67A-LoOv sites",0,0,0,5,20,25,30,15,5,0,0,0,100]
[null,null,"Sands_22_25_66","5.2A Tame Pasture, Low Mgt-LoT60A",1800,null,"67A-Lowland site-cottonwoods/R.olives",0,0,0,5,20,25,30,15,5,0,0,0,100]
[null,null,"Sandy_18_22_66","5.2B Tame Pasture, Mod Mgt-LoTer60A",2750,null,"67A-Lowland/Overflow sites Western co-dom.",0,0,0,5,25,30,20,15,5,0,0,0,100]
[null,null,"Sandy_22_25_66","5.2C Tame Pasture, High Mgt-LoTer60A",3500,null,"67A-Saline Upland Sites higher SI",0,0,0,5,25,40,15,5,10,0,0,0,100]
[null,null,"Sandy_Lowland_66","5.2D Irrigated Pasture-LoTer60A",6500,null,"67A-Saline Upland Sites lower SI",0,0,0,5,20,35,30,5,5,0,0,0,100]
[null,null,"Shallow_Limy_66","1.1 Rhizomatous Wheatgrass, Green Needlegrass, Cottonwoods-Lowland60A",3000,null,"67A-Sb,SaSb,WL-Lower Sim. Index",0,0,0,5,20,25,25,15,10,0,0,0,100]
[null,null,"Shallow_to_Gravel_66","1.2 Mature Cottonwoods, Cool Season Grasses-Lowland60A",2500,null,"67A-Shallow sites - Higher SI",0,0,0,5,20,35,30,5,5,0,0,0,100]
[null,null,"Steep_Sandy_66","2.0 Cottonwood, Russian Olive, Saltcedar, Cool Season Grasses-Lowland60A",1800,null,"67A-Upland - Western Wheat dom.",0,0,0,5,25,40,15,5,10,0,0,0,100]
[null,null,"Subirrigated_66","3.1 Rhizomatous Wheatgrass-Lowland60A",2000,null,"67A-Upland Sites - Blue grama dom.",0,0,0,5,20,25,30,15,5,0,0,0,100]
[null,null,"Thin_Upland_66","4.1 Kentucky Bluegrass, Weedy Annuals, Perennial Forbs-Lowland60A",1000,null,"67A-Upland-higher SI",0,0,0,5,15,25,30,20,5,0,0,0,100]
[null,null,"Wet_Land_66","1.1 Prairie Sandreed, Little Bluestem, Rhizomatous Wheatgrass-PoCy60A",1500,null,"67A-Wetter Sites - Higher Sim. Index",0,0,0,5,15,20,30,20,10,0,0,0,100]
[null,null,"Choppy_Sands_67A","1.2 Rhizomatous Wheatgrass, Blue Grama, Sedge-PoCy60A",900,null,"71-LB & LiU Higher Similarity Index",0,0,3,7,15,20,30,15,5,5,0,0,100]
[null,null,"Clayey_67A","2.1 Sedge, Bare Ground-PoCy60A",300,null,"71-LiU, LoUp, Sb Lower Similarity Index",0,0,5,13,28,28,12,5,6,3,0,0,100]
[null,null,"Closed_Upland_Depression_67A","1.1 Rhizomatous Wheatgrass, Cordgrass, Alkali Sacaton-SaLo60A",2000,null,"71-LoUp Big Blue / Little Blue / Sideoats",0,0,5,8,25,30,15,10,2,5,0,0,100]
[null,null,"Gravelly_67A","1.2 Inland Saltgrass, Rhizomatous Wheatgrass-SaLo60A",1100,null,"71-Sands Higher Similarity Index",0,0,5,8,15,24,23,15,5,5,0,0,100]
[null,null,"Limy_Upland_67A","2.1 Inland Saltgrass, Foxtail Barley, SaLo60A",900,null,"71-Sb Higher Similarity Index",0,0,3,7,15,25,25,17,6,2,0,0,100]
[null,null,"Loamy_67A","1.1 Alkali Sacaton-SaSub60A",2850,null,"71-Uplands Lower Similarity Index",0,0,5,12,20,25,19,11,5,3,0,0,100]
[null,null,"Loamy_Lowland_67A","1.2 Inland Saltgrass, Alkali Sacaton-SaSub60A",1750,null,"72-(Sb,SaSb, overflow)-Tall Grass domin.",0,0,0,5,15,35,30,10,5,0,0,0,100]
[null,null,"Loamy_Overflow_67A","1.3 Low Plant Diversity, Excessive Litter-SaSub60A",1950,null,"72-Blue Grama/Buffalograss",0,0,0,5,18,25,20,15,12,5,0,0,100]
[null,null,"Saline_Lowland_67A","2.1 Inland Saltgrass Sod-SaSub60A",1050,null,"72-Sandy/Sands/Choppy Sands Sites",0,0,3,7,20,35,20,10,3,2,0,0,100]
[null,null,"Saline_Subirrigated_67A","3.1A Tame Pasture, Low Mgt-SaSub60A",1500,null,"72-Shallow/gravel/loamy/limy-shortgrasses dom.",0,0,0,2,10,45,25,15,3,0,0,0,100]
[null,null,"Saline_Upland_67A","3.1B Tame Pasture, Mod. Mgt-SaSub60A",1900,null,"72-Shallow/Gravelly-mid-grasses dom.",0,0,2,8,19,30,18,15,6,2,0,0,100]
[null,null,"Sands_67A","3.1C Tame Pasture, High Mgt-SaSub60A",2300,null,"72-threeawns/dropseed/cactus domin.",0,0,1,5,20,45,20,7,2,0,0,0,100]
[null,null,"Sandy_67A","1.1 Rhizomatous Wheatgrass, Gardner's Saltbush-SaUp60A",600,null,"72-Uplands:bluestem/sideoats dom.",0,0,2,10,20,30,20,10,5,3,0,0,100]
[null,null,"Sandy_Lowland_67A","1.2 Gardner's Saltbush, Rhizomatous Wheatgrass, Bare Ground-SaUp60A",400,null,"72-Western/Needlegrass/Blue Grama",0,0,2,10,23,25,25,10,5,0,0,0,100]
[null,null,"Shallow_67A","2.1 Bare Ground, Forbs, Shrubs-SaUp60A",250,null,"73-ClT Lower SI",0,0,0,5,15,35,30,10,5,0,0,0,100]
[null,null,"Subirrigated_67A","1.1 Bluestem, Prairie Sandreed-Sa60A",1900,null,"73-ClT, LoLo Higher SI",0,0,2,10,20,30,25,10,3,0,0,0,100]
[null,null,"Very_Shallow_67A","1.2 Prairie Sandreed, Needle and thread, Sagebrush-Sa60A",1300,null,"73-ClUp Lower SI",0,0,2,8,20,30,25,10,5,0,0,0,100]
[null,null,"Wetland_67A","1.3 Needle and Thread, Blue Grama, Sand Dropseed, Sedge, Sagebrush-Sa60A",900,null,"73-ClUp, CUD High SI",0,0,2,5,23,30,25,10,5,0,0,0,100]
[null,null,"Closed_Upland_Depression_71","2.1 Blowout-Sa60A",200,null,"73-CUD Low SI",0,0,0,5,20,35,25,10,5,0,0,0,100]
[null,null,"Limy_Upland_71","3.1 Annual, Pioneer Perennial-Sa60A",400,null,"73-GH, LoUp, LiU & SwLi Low SI",0,0,3,10,25,30,20,8,4,0,0,0,100]
[null,null,"Loamy_Lowland_71","4.1A Re-Seed Excellent Stand-Sa60A",2000,null,"73-GH, SwLi, LiU Sites Higher SI",0,0,5,10,15,30,25,10,5,0,0,0,100]
[null,null,"Loamy_Overflow_71","4.1B Re-Seed Good Stand-Sa60A",1750,null,"73-LiU, SwL Lower SI",0,0,5,10,20,30,20,10,5,0,0,0,100]
[null,null,"Loamy_Upland_71","4.1C Re-Seed Fair Stand-Sa60A",1200,null,"73-LoLo Western/Blue Grama",0,0,0,5,20,35,30,5,5,0,0,0,100]
[null,null,"Loess_Breaks_71","4.2D Tame Pasture, Low Mgt-Sa60A",1400,null,"73-LoLo Western/Tall Dropseed",0,0,5,15,25,25,10,10,5,5,0,0,100]
[null,null,"Saline_Subirrigated_71","4.2E Tame Pasture, Mod Mgt-Sa60A",1750,null,"73-LoTe Blue Grama/Buffalo/Western",0,0,0,5,22,35,25,8,5,0,0,0,100]
[null,null,"Sands_71","4.2F Tame Pasture, High Mgt-Sa60A",2000,null,"73-LoTe Tall Drop/Western/Remnants",0,0,2,13,20,25,25,10,5,0,0,0,100]
[null,null,"Sandy_71","4.2G Tame Pasture, Irrigated-Low Mgt-Sa60A",6900,null,"73-LoTe Tall Grass Dom.",0,0,2,5,20,33,25,10,5,0,0,0,100]
[null,null,"Subirrigated_71","4.2H Tame Pasture, Irrigated-High Mgt-Sa60A",9000,null,"73-LoUp",0,0,0,5,20,30,30,10,5,0,0,0,{"$f":"SUM(H131:S131)","v":100}]
[null,null,"Wetland_71","1.1 Prairie Sandreed, Needle and Thread, Bluestem-Sy60A",1800,null,"73-Sands & Sandy Sites",0,0,3,7,20,35,20,10,3,2,0,0,100]
[null,null,"Choppy_Sands_72","1.2 Prairie Sandreed, Needle and Thread, Blue Grama-Sy60A",1200,null,"73-SyLo & LoLo Mid and Tall Grass dom.",0,0,5,15,20,25,20,10,5,0,0,0,100]
[null,null,"Closed_Upland_Depression_72","2.1 Blue Grama, Sand Dropseed, Threadleaf Sedge-Sy60A",900,null,"73-SyLo Tall Grass Domin.",0,0,0,5,20,35,25,10,5,0,0,0,100]
[null,null,"Gravelly_Hills_72","3.1 Threeawn, Sand Dropseed, Annuals-Sy60A",500,null,"73-SyLo Western Wheat Domin.",0,0,10,20,20,25,5,5,10,5,0,0,100]
[null,null,"Limy_Slopes_72","4.1 Go-Back-Sy60A",500,null,"75 Smooth Bromegrass",0,0,2,13,29,19,7,10,13,6,1,0,100]
[null,null,"Loamy_Lowland_72","4.2A Re-Seed Excellent Stand-Sy60A",2000,null,"75-Eastern Red Cedar/Tree Overstory",0,3,8,12,20,25,14,5,8,4,1,0,100]
[null,null,"Loamy_Tableland_72","4.2B Re-Seed Good Stand-Sy60A",1750,null,"75-LoO  & LoLo Mid Grass Dom/ w. Big Blue",0,0,4,9,27,29,15,8,5,2,1,0,100]
[null,null,"Loess_Breaks_72","4.2C Re-Seed Fair Stand-Sy60A",1200,null,"75-LoO & LoLO Tall Grass Dom.",0,0,4,9,27,29,15,8,5,2,1,0,100]
[null,null,"Rolling_Sands_72","4.3D Tame Pasture, Low Mgt-Sy60A",1400,null,"75-LoO,LoO, LoUp, Cy, SwL Short Grass Dom.",0,0,3,9,27,25,12,10,10,3,1,0,100]
[null,null,"Saline_Lowland_72","4.3E Tame Pasture, Mod Mgt-Sy60A",1750,null,"75-LoUp & Cy Mid Grass Dom.",0,0,3,10,21,26,18,10,8,3,1,0,100]
[null,null,"Saline_Subirrigated_72","4.3F Tame Pasture, High Mgt-Sy60A",2000,null,"75-LoUp & Cy Tall Grass  Domin.",0,0,3,7,21,33,18,8,6,3,1,0,100]
[null,null,"Sandy_Lowland_72","4.3G Tame Pasture, Irrigated-Low Mgt-Sy60A",6900,null,"75-SwL Tall & Mid Grass Domin.",0,0,3,7,21,33,18,8,6,3,1,0,{"$f":"SUM(H143:S143)","v":100}]
[null,null,"Sandy_Plains_72","4.3H Tame Pasture, Irrigated-High Mgt-Sy60A",9000,null,"107B-Introduced cool seasons domin or codom",0,0,2,13,29,19,7,10,13,6,1,0,{"$f":"SUM(H144:S144)","v":100}]
[null,null,"Shallow_Limy_72","1.1 Rhizomatous Wheatgrass, sideoats Grama, Needlegrass-SwCl60A",1400,null,"107B-Upland Sites, Native Tall, Mid Grasses Dom.",0,0,4,9,27,29,15,8,5,2,1,0,100]
[null,null,"Subirrigated_72","1.2 Rhizomatous Wheatgrass, Grama, Sedge-SwCl60A",1000,null,"107B-Lowland Sites, Warm Season Domin.",0,0,4,9,27,29,15,8,5,2,1,0,100]
[null,null,"Tableland_Swale_72","2.1 Grama, Sedge-SwCl60A",600,null,"107B-Upland Loamy or shallow sites, Short grass or introduced",0,0,4,9,27,29,15,8,5,2,1,0,100]
[null,null,"Blue_Shale_73","3.1 Juniper, Ponderosa Pine-SwCl60A",1200]
[null,null,"Choppy_Sands_73","1.1 Rhizomatous Wheatgrass-SDC60A",900]
[null,null,"Clay_Terrace_73","1.2 Rhizomatous Wheatgrass, Annuals-SDC60A",500]
[null,null,"Closed_Upland_Depression_73","1.1 Bluestem, Sideoats Grama, Needlegrass, Wheatgrass-SwLo60A",1400]
[null,null,"Gravelly_Hills_73","1.2 Needle and Thread, Little Bluestem, Grama-SwLo60A",1000]
[null,null,"Limy_Slopes_73","2.1 Grama, Sedge, Sagewort-SwLo60A",500]
[null,null,"Loamy_Floodplain_73","3.1 Juniper, Ponderosa Pine-SwLo60A",1200]
[null,null,"Loamy_Plains_73","1.1 Bluestem, Sun Sedge, Shrubs-SPC60A",955]
[null,null,"Loamy_Terrace_73","1.2 Rhizomatous Wheatgrass, Little Bluestem, Sagewort, Shrubs-SPC60A",700]
[null,null,"Loess_Hills_73","2.1 Bur Oak, Ponderosa Pine, Shrubs, Bare Ground-SPC60A",500]
[null,null,"Sandy_Floodplain_73","2.2 Ponderosa Pine, Rocky Mountain Juniper, Bare Ground-SPC60A",500]
[null,null,"Sandy_Plains_73","3.1 Sparse Vegetation, Exposed Shale-SPC60A",150]
[null,null,"Shallow_Limy_73","1.1 Needle and Thread, Prairie Sandreed-SwSy60A",1300]
[null,null,"Subirrigated_73","1.2 Needle and Thread, Blue Grama, Threadleaf Sedge, Yucca-SwSy60A",850]
[null,null,"Clayey_Plains_75","2.1 Threadleaf Sedge, Fringed Sagewort, Yucca-SwSy60A",550]
[null,null,"Closed_Upland_Depression_75","1.1 Prairie cordgrass, Tall Warm Season Grasses, Rhizomatous Wheatgrass-Sub60A",4300]
[null,null,"Gravelly_Hills_75","1.2 Rhizomatous Wheatgrass, Sedges, Rushes-Sub60A",3000]
[null,null,"Limy_Loess_Slopes_75","1.3 Decadent Plants, Excessive Litter-Sub60A",3300]
[null,null,"Loamy_Floodplain_75","2.1 Invaded range - Kentucky Bluegrass Sod-Sub60A",2000]
[null,null,"Loamy_Plains_75","2.2 Invaded range-Kentucky Bluegrass Sod, Invaders-Sub60A",1000]
[null,null,"Loamy_Terrace_75","1.1 Rhizomatous Wheatgrass, Blue Grama-TC60A",900]
[null,null,"Loess_Breaks_75","1.2 Shortgrass, Cactus-TC60A",500]
[null,null,"Saline_Depression_75","1.1 Little Bluestem, Needlegrass, Grama-ThU60A",1400]
[null,null,"Sands_75","1.2 Little Bluestem, Grama-ThU60A",1200]
[null,null,"Sandy_75","1.3 Blue Grama, Sedge-ThU60A",800]
[null,null,"Sandy_Floodplain_75","2.1A Tame Pasture, Low Mgt-ThU60A",1700]
[null,null,"Shallow_Limy_75","2.1B Tame Pasture, Mod Mgt-ThU60A",2300]
[null,null,"Subirrigated_75","2.1C Tame Pasture, High Mgt-ThU60A",3000]
[null,null,"Wet_Subirrigated_75","1.1 Needle and Thread, Little Bluestem, Grama-VSw60A",800]
[null,null,"Clayey_102C","1.2 Grama, Sedge-VSw60A",400]
[null,null,"Clayey_Overflow_102C","1.1 Prairie Cordgrass, Reedgrass, Sedge-WL60A",5500]
[null,null,"Closed_Depression_or_Shallow_Marsh_102C","1.2 Spikerush, Bulrush, Cattails-WL60A",4500]
[null,null,"Limy_Upland_102C","2.1A Tame Pasture, Low Mgt-WL60A",3000]
[null,null,"Loamy_Lowland_102C","2.1B Tame Pasture, Mod Mgt-WL60A",4000]
[null,null,"Loamy_Overflow_102C","2.1C Tame Pasture, High Mgmt-WL60A",5000]
[null,null,"Loamy_Upland_102C","1.1 Western Wheatgrass, Green Needlegrass-Cy63B",2800]
[null,null,"Loess_Breaks_or_Loess_Uplands_102C","2.1 Western Wheatgrass, Green Needlegrass, Introduced Grasses < 15%-Cy63B",2800]
[null,null,"Saline_Lowland_102C","2.2 Western Wheatgrass, Green Needlegrass, Introduced Grasses > 15%-Cy63B",2100]
[null,null,"Saline_Subirrigated_102C","3.1 Buffalograss, Blue Grama-Cy63B",1300]
[null,null,"Sands_102C","4.1 Threeawns, Annuals-Cy63B",800]
[null,null,"Sandy_102C","5.1 Invaded range-Smooth Bromegrass, Kentucky Bluegrass > 30%-Cy63B",2600]
[null,null,"Sandy_Lowland_102C","5.2 Invaded range-Smooth Brome, Kentucky Bluegrass > 80%-Cy63B",1700]
[null,null,"Shallow_Clay_102C","6.1 Go-BackCy63B",500]
[null,null,"Shallow_Limy_102C","7.1A Tame Pasture, Low Mgt-Cy63B",2000]
[null,null,"Shallow_to_Gravel_102C","7.1B  Tame Pasture, Mod. Mgt-Cy63B",3500]
[null,null,"Subirrigated_102C","7.1C Tame Pasture, High Mgt-Cy63B",5000]
[null,null,"Very_Shallow_102C","1.1 Western Wheatgrass, Bluestem, Needlegrass-CyO63B",3000]
[null,null,"Wetland_102C","1.2 Western Wheatgrass-CyO63B",2400]
[null,null,"Wet_Subirrigated_102C","2.1 Western Wheatgrass, Bluestem, Needlegrass, Non-Native Cool Season Grasses-CyO63B",2700]
[null,null,"Clayey_Upland_106","2.2 Western Wheatgrass, Non-Native Cool Season Grasses-CyO63B",2300]
[null,null,"Limy_Upland_106","3.1 Invaded range-Smooth Bromegrass, Kentucky Bluegrass, Forbs-CyO63B",2800]
[null,null,"Loamy_Floodplain_106","4.1 GoBack-CyO63B",1250]
[null,null,"Loamy_Terrace_106","4.2A Range Seeding, Excellent Stand-CyO63B",3250]
[null,null,"Loamy_Upland_106","4.2B Range Seeding, Good Stand-CyO63B",2800]
[null,null,"Saline_Lowland_106","4.2C Range Seeding, Fair Stand-CyO63B",2800]
[null,null,"Saline_Subirrigated_106","4.3D Tame Pasture, Low Mgt-CyO63B",3000]
[null,null,"Sandy_Lowland_106","4.3E Tame Pasture, Mod Mgt-CyO63B",4000]
[null,null,"Savannah_106","4.4F Tame Pasture, High Mgt-CyO63B",5500]
[null,null,"Shallow_Limy_106","1.1 Western Wheatgrass, Grasslikes, Forbs-CD63B",3500]
[null,null,"Shallow_Sandy_106","2.1 Western Wheatgrass, Bluegrass, Grasslikes, Forbs-CD63B",2200]
[null,null,"Shallow_Savannah_106","3.1 Foxtail Barley, Bluegrass-CD63B",1200]
[null,null,"Subirrigated_106","3.2 Introduced Forbs, Foxtail Barley-CD63B",500]
[null,null,"Wet_Subirrigated_106","4.1 Go-back-CD63B",400]
[null,null,null,"1.1 Western Wheatgrass, Green Needlegrass, Blue Grama-CP63B",2000]
[null,null,"Calcareous_Loess_Upland_Prairie_107B","2.1 Western Wheatgrass, Green Needlegrass, Blue Grama, Introduced Grasses < 15%-CP63B",2000]
[null,null,"Calcareous_Loess_Exposed_Backslope_Prairie_107B","2.2 Blue grama, Western Wheatgrass, Introduced Grasses >15%-CP63B",1600]
[null,null,"Calcareous_Loess_Protected_Backslope_Savannah_107B","3.1 Blue Grama, Buffalograss Sod-CP63B",1200]
[null,null,"Calcareous_Till_Upland_Prairie_107B","4.1 Threeawns, Annuals-CP63B",600]
[null,null,"Deep_Loess_Upland_Prairie_107B","5.1 Invaded range-Smooth Bromegrass, Kentucky Bluegrass > 30%-CP63B",2000]
[null,null,"Deep_Loess_Exposed_Backslope_Savannah_107B","5.2 Invaded range-Kentucky Bluegrass-CP63B",1200]
[null,null,"Loamy_Floodplain_Prairie_107B","6.1 Go-Back-CP63B",400]
[null,null,"Loamy_Footslope_Savannah_107B","6.2A Seeded, Low Mgmt-CP63B",1600]
[null,null,"Loamy_Terrace_Savannah_107B","6.2B Seeded, High Mgmt-CP63B",3500]
[null,null,"Loess_Upland_Prairie_107B","1.1 Western Wheatgrass, Green Needlegrass-DCy63B",1800]
[null,null,"Ponded_Floodplain_Prairie_107B","1.2 Western Wheatgrass, Bare Ground-DCy63B",1000]
[null,null,"Sandy_Dune_Prairie_107B","2.1 Western Wheatgrass, Green Needlegrass, Introduced Grasses <15%-DCy63B",1800]
[null,null,"Wet_Floodplain_Prairie_107B","2.2 Western Wheatgrass, invaded, introduced Grasses >15%-DCy63B",1000]
[null,null,"Wet_Upland_Drainageway_107B","1.1 Western Wheatgrass, Needlegrass, Bluestem-Lo63B",3000]
[null,null,null,"2.1 Western Wheatgrass, Needlegrass, Bluestem, Introduced Grasses <15%-Lo63B",3000]
[null,null,null,"2.2 Western Wheatgrass, Needlegrass, Bluestem, Introduced grasses >15%-Lo63B",2300]
[null,null,null,"3.1 Blue Grama, Buffalograss sod-Lo63B",1500]
[null,null,null,"4.1 Threeawn, Annuals-Lo63B",800]
[null,null,null,"5.1 Invaded range-Smooth Brome, Kentucky Bluegrass-Lo63B",2400]
[null,null,null,"5.2 Invaded range-Kentucky Bluegrass-Lo63B",1600]
[null,null,null,"6.1 Go-back-Lo63B",800]
[null,null,null,"6.2A Seeded Natives, Excellent Stand-Lo63B",3200]
[null,null,null,"6.2B Seeded Natives, Good Stand-Lo63B",2300]
[null,null,null,"6.2C Seeded Natives, Fair Stand-Lo63B",1500]
[null,null,null,"6.2D Tame Pasture, Low Mgt-Lo63B",2900]
[null,null,null,"6.2E Tame Pasture, Mod Mgt-Lo63B",4000]
[null,null,null,"6.2F Tame Pasture, High Mgt-Lo63B",5100]
[null,null,null,"1.1 Big Bluestem, Needlegrass, Western Wheatgrass, Scattered Shrubs and Trees-LoO63B",3400]
[null,null,null,"2.1 Big Bluestem, Needlegrass, Western Wheatgrass, Introduced Grasses <15%, Scattered Shrubs and Trees-LoO63B",3400]
[null,null,null,"2.2 Bluegrass, Big Bluestem, Scattered Shrubs and Trees-LoO63B",2800]
[null,null,null,"3.1 Kentucky Bluegrass, Smooth Bromegrass, Scattered Shrubs and Trees-LoO63B",2800]
[null,null,null,"3.2 Kentucky Bluegrass Sod, Remnant Shrubs and Trees, Weedy Annual and Perennial Forbs-LoO63B",1800]
[null,null,null,"4.1 Snowberry, Prunus, Immature Trees, Forbs, Grasses-LoO63B",1600]
[null,null,null,"4.2 Mixed Age Green Ash, Bur Oak, Shrubs-LoO63B",700]
[null,null,null,"4.3 Mature Bur Oak, Green Ash, Shrubs, Sedges-LoO63B",400]
[null,null,null,"5.1 Scattered Mature Native Trees, Juniper, Shrubs, Forbs, Bluegrass-LoO63B",250]
[null,null,null,"5.2 Juniper Dominated-LoO63B",750]
[null,null,null,"1.1 Cordgrass, Wheatgrass, Alkaligrass-SaLo63B",3500]
[null,null,null,"1.2 Wheatgrass, Foxtail Barley, Inland Saltgrass-SaLo63B",2500]
[null,null,null,"1.3 Wheatgrass, Alkaligrass-SaLo63B",3000]
[null,null,null,"2.1 Foxtail Barley, Inland Saltgrass, Bare Ground-SaLo63B",1600]
[null,null,null,"2.2 Annual and Pioneer Perennial, Bare Ground-SaLo63B",700]
[null,null,null,"1.1 Bluestem, Grama, Needlegrass-Sw63B",1800]
[null,null,null,"1.2 Little Bluestem, Needlegrass, Grama-Sw63B",1500]
[null,null,null,"2.1 Sedge, Grama-Sw63B",900]
[null,null,null,"3.1 Juniper, Ponderosa Pine-Sw63B",1200]
[null,null,null,"1.1 Needlegrass, Bluestem, Western Wheatgrass-SwCy63B",2200]
[null,null,null,"1.2 Western Wheatgrass, Buffalograss, Grama-SwCy63B",1500]
[null,null,null,"2.1 Blue Grama, Buffalograss, Sedge-SwCy63B",900]
[null,null,null,"3.1 Deciduous Trees and Shrubs-SwCy63B",750]
[null,null,null,"3.2 Juniper-SwCy63B",1400]
[null,null,null,"4.1 Western Wheatgrass, Needlegrass, Non-Native Cool Season Grasses <15%-SwCy63B",1800]
[null,null,null,"5.1 Smooth Brome, Kentucky Bluegrass-SwCy63B",1000]
[null,null,null,"5.2 Annual, Pioneer Perennials, Bare Ground-SwCy63B",500]
[null,null,null,"1.1 Western Wheatgrass, Blue Grama-TC63B",1500]
[null,null,null,"1.2 Blue Grama, Inland Saltgrass, Western Wheatgrass-TC63B",900]
[null,null,null,"1.3 Cactus, Inland Saltgrass, Blue Grama-TC63B",600]
[null,null,null,"1.1 Bluestem, Sideoats Grama, Needlegrass-TU63B",2400]
[null,null,null,"1.2 Bluestem, Grama-TU63B",1900]
[null,null,null,"2.1 Sedge, Grama-TU63B",1200]
[null,null,null,"3.1 Western Wheatgrass, Sideoats Grama, Introduced Grasses-TU63B",1900]
[null,null,null,"4.1A Seeded Native Excellent Stand-TU63B",2700]
[null,null,null,"4.1B Seeded Native Good Stand-TU63B",2200]
[null,null,null,"4.1C Seeded Native Fair Stand-TU63B",1900]
[null,null,null,"4.1D Tame Pasture, Low Mgt-TU63B",2900]
[null,null,null,"4.1E Tame Pasture, Mod Mgt-TU63B",3500]
[null,null,null,"4.1F Tame Pasture, High Mgt-TU63B",4300]
[null,null,null,"1.1 Needlegrass, Grama, Western Wheatgrass-VS63B",1500]
[null,null,null,"1.2 Sedge, Grama, Needlegrass-VS63B",1000]
[null,null,null,"2.1 Needlegrass, Grama, Western Wheatgrass, Non-Native Cool Season Grasses <15%-VS63B",1500]
[null,null,null,"2.2 Sedge, Grama, Needlegrass, Non-Native Cool Season Grasses >15%-VS63b",700]
[null,null,null,"1.1 Switchgrass, Wheatgrass, Needlegrass, Shrubs-BaO64",2400]
[null,null,null,"1.2 Wheatgrass, Needlegrass, Prairie Sandreed, Shrubs-BaO64",2000]
[null,null,null,"1.3 Wheatgrass, Needlegrass, Indian Ricegrass, Shrubs-BaO64",1000]
[null,null,null,"2.1 Wheatgrass, Inland Saltgrass, Knotweed, 80% Bare Ground-BaO64",600]
[]
[null,null,null,"1.1 Wheatgrass, Little Bluestem, Prairie Sandreed-BaT64",2100]
[null,null,null,"1.2 Prairie Sandreed, Little Bluestem, Inland Saltgrass-BaT64",1800]
[null,null,null,"2.1 Inland Saltgrass, Wheatgrass, Bare Ground-BaT64",1000]
[null,null,null,"2.2 Inland saltgrass, Annuals, Pioneer Perennials-BaT64",700]
[null,null,null,"1.1 Rhizomatous Wheatgrass, Green Needlegrass-CyLow64",1800]
[null,null,null,"1.2 Rhizomatous Wheatgrass, Blue Grama, Buffalograss-CyLow64",1600]
[null,null,null,"2.1 Annuals, Wheatgrass, Threeawn, Pricklypear-CyLow64",700]
[null,null,null,"3.1 Blue Grama, Buffalograss Sod-CyLow64",700]
[null,null,null,"4.1 Western Wheatgrass-Nonnative-Cool Season Grasses-CyLow64",1800]
[null,null,null,"4.2 Shortgrass, Rhizomatous Wheatgrass, Introduced Grasses-CyLow64",1600]
[null,null,null,"5.1 Renovated Rhizomatous Wheatgrass, Green Needlegrass, Blue Grama, Buffalograss-CyLow64",1600]
[null,null,null,"5.2 Renovated Blue Grama, Buffalograss Sod-CyLow64",700]
[null,null,null,"6.1 Go-Back-CyLow64",500]
[null,null,null,"6.2A Seeded Natives, Excellent Stand-CyLow64",2000]
[null,null,null,"6.2B Seeded Natives, Good Stand-CyLow64",1600]
[null,null,null,"6.2C Seeded Natives, Fair Stand-CyLow64",1000]
[null,null,null,"6.2D Tame Pasture, Low Mgt-CyLow64",1200]
[null,null,null,"6.2E Tame Pasture, Mod Mgt-CyLow64",1600]
[null,null,null,"6.2F Tame Pasture, High Mgt-CyLow64",2500]
[null,null,null,"1.1 Western Wheatgrass, Green Needlegrass-CyHigh64",2000]
[null,null,null,"1.2 Western Wheatgrass, Blue Grama, Buffalograss-CyHigh64",1600]
[null,null,null,"2.1 Blue Grama, Buffalograss Sod-CyHigh64",1000]
[null,null,null,"3.1 Threeawns, Annuals-CyHigh64",700]
[null,null,null,"4.1  Western Wheatgrass-Introduced Grasses <15%-CyHigh64",1700]
[null,null,null,"5.1 Invaded Range-Smooth Brome, Kentucky Bluegrass-CyHigh64",1700]
[null,null,null,"6.1 Go-Back-CyHigh64",500]
[null,null,null,"6.2A Seeded Natives, Excellent Stand-CyHigh64",1800]
[null,null,null,"6.2B Seeded Natives, Good Stand-CyHigh64",1600]
[null,null,null,"6.2C Seeded Natives, Fair Stand-CyHigh64",1000]
[null,null,null,"6.2D Tame Pasture, Low Mgt-CyHigh64",1200]
[null,null,null,"6.2E Tame Pasture, Mod Mgt-CyHigh64",1600]
[null,null,null,"6.2F Tame Pasture, High Mgt-CyHigh64",2500]
[null,null,null,"1.1 Rhizomatous Wheatgrass, Green Needlegrass, Scattered Trees, Shrubs-CyO64",2500]
[null,null,null,"2.1 Rhizomatous Wheatgrass-Green Needlegrass-Bluegrass, Scattered Trees, Shrubs-CyO64",2500]
[null,null,null,"2.2 Blue Grama-Rhizomatous Wheatgrass, Kentucky Bluegrass-CyO64",1400]
[null,null,null,"3.1 Invaded Range-Kentucky Bluegrass-Smooth Brome, Scattered Trees, Shrubs-CyO64",1600]
[null,null,null,"3.2 Invaded Range-Kentucky Bluegrass, Remnant Trees, Weedy Forbs-CyO64",1000]
[null,null,null,"4.1 Cottonwood, Prunus, Snowberry, Forbs, Grasses-CyO64",1600]
[null,null,null,"4.2 Mature Cottonwood, Green Ash, Box Elder, Prunus, Snowberry, Forbs, Grasses-CyO64",1000]
[null,null,null,"4.3  Green Ash, Box Elder, Prunus, Snowberry, Forbs, Grasses-CyO64",750]
[null,null,null,"5.1 Scattered Mature Native Trees, Juniper, Russian Olive-CyO64",750]
[null,null,null,"1.1 Rhizomatous Wheatgrass-Needlegrass-Blue Grama-CP64",1600]
[null,null,null,"1.2 Blue Grama, Rhizomatous Wheatgrass-CP6",1400]
[null,null,null,"2.1 Blue grama-Sedge, Pricklypear-CP64",800]
[null,null,null,"3.1 Threeawn-annuals-CP64",500]
[null,null,null,"4.1 Rhizomatous Wheatgrass-Shortgrass-Non-native Cool Seasons-CP64",1400]
[null,null,null,"5.1 Go-back-CP64",500]
[null,null,null,"5.2A Seeded Natives, Fair Stand-CP64",800]
[null,null,null,"5.2B Seeded Natives, Good Stand-CP64",1400]
[null,null,null,"5.2C Seeded Natives, Excellent Stand-CP64",1800]
[null,null,null,"1.1a Wheatgrass-Grasslikes-Forbs-CD64",2200]
[null,null,null,"1.1b Grasslikes-Forbs-CD64",1400]
[null,null,null,"2.1 Wheatgreas-Bluegreass-Grasslikes-Forbs-CD64",1800]
[null,null,null,"3.1 Foxtail Barley-Bluegrass <30%-CD64",800]
[null,null,null,"3.2 Introduced Forbs-Foxtail Barley-CD64",400]
[null,null,null,"4.1 Go-Back-CD64",400]
[null,null,null,"4.2A Seeded Introduced, Low Mgt-CD64",2300]
[null,null,null,"4.2B Seeded Introduced, Medium Mgt-CD64",3300]
[null,null,null,"4.2C Seeded Introduced, High Mgt-CD64",4300]
[null,null,null,"1.1 Western Wheatgrass, Green Needlegrass-DC64",1500]
[null,null,null,"1.2 Western Wheatgrass-Bare Ground-DC64",800]
[null,null,null,"2.1 Rhizomatous Wheatgrass, Green Needlegrass, Introduced Grasses-DC64",1500]
[null,null,null,"2.2 Rhizomatous Wheatgrass, Introduced Grasses,  Bare Ground-DC64",800]
[null,null,null,"1.1 Western Wheatgrass, Needle and Thread, Blue Grama-Lo-LowPZ-64",1800]
[null,null,null,"1.2 Blue Grama-Rhizomatous Wheatgrass-Threadleaf Sedge-Lo-LowPZ64",1200]
[null,null,null,"2.1 Blue Grama-Threadleaf Sedge-Lo-LowPZ64",600]
[null,null,null,"3.1 Threeawn-annuals-Lo-LowPZ64",600]
[null,null,null,"4.1 Rhizomatous Wheatgrass-Needle and Thread-Nonnative Cool Season-Lo-LowPZ64",1800]
[null,null,null,"4.2 Blue Grama-Rhizomatous (No Suggestions) Cool Season-Lo-LowPZ64",1200]
[null,null,null,"5.1 Renovated Rhizomatous Wheatgrass-Needle and Thread-Blue Grama-Buffalograss-Lo-LowPZ64",1800]
[null,null,null,"5.2 Renovated Blue grama-Buffalograss-Threadleaf Sedge - Lo-LowPZ64",600]
[null,null,null,"6.1 Go-Back-Lo-Low PZ64",400]
[null,null,null,"6.2A Seeded, Native Excellent Stand-Lo-LowPZ-64",1800]
[null,null,null,"6.2B Seeded, Native Good Stand-Lo-LowPZ-64",1400]
[null,null,null,"6.2C Seeded, Native Fair Stand-Lo-LowPZ-64",1000]
[null,null,null,"6.2D Tame Pasture, Low Mgt-Lo-LowPZ-64",1700]
[null,null,null,"6.2E Tame Pasture, Mod Mgt-Lo-LowPZ-64",2300]
[null,null,null,"6.2F Tame Pasture, High Mgt-Lo-LowPZ-64",3000]
[null,null,null,"1.1 Western Wheatgrass, Needle and Thread-Lo-HighPZ-64",2400]
[null,null,null,"1.2 Blue Grama, Buffalograss, Western Wheatgrass-Lo-HighPZ-64",1600]
[null,null,null,"2.1 Blue Grama, Buffalograss Sod-Lo-HighPZ-64",1000]
[null,null,null,"3.1 -Threeawn, Annuals-Lo-High PZ-64",700]
[null,null,null,"4.1 Western Wheatgrass-Nonnative-Cool Season Grasses <15%-Lo-High PZ-64",1800]
[null,null,null,"5.1 Invaded Range-Smooth Brome-Kentucky Bluegrass >30%-Lo-High PZ-64",1600]
[null,null,null,"6.1 Go-Back-Lo-High PZ- 64",600]
[null,null,null,"6.2A Seeded, Native Excellent Stand-Lo-High PZ-64",2500]
[null,null,null,"6.2B Seeded, Native Good Stand-Lo-LowPZ-64",2000]
[null,null,null,"6.2C Seeded, Native Fair Stand-Lo-LowPZ-64",1600]
[null,null,null,"6.2D Tame Pasture, Low Mgt-Lo-LowPZ-64",200]
[null,null,null,"6.2E Tame Pasture, Mod Mgt-Lo-LowPZ-64",2800]
[null,null,null,"6.2F Tame Pasture, High Mgt-Lo-LowPZ-64",3700]
[null,null,null,"1.1 Big Bluestem, Rhizomatous Wheatgrass, Scattered Trees, Shrubs-LoO64",3000]
[null,null,null,"2.1 Big Bluestem-Rhizomatous Wheatgrass-Bluegrass, Scattered Trees, Shrubs-LoO64",2500]
[null,null,null,"2.2 Rhizomatous Wheatgrass-Bluegrass-Big Bluestem, Scattered Trees, Shrubs-LoO64",2300]
[null,null,null,"3.1 Invaded Range-Kentucky Bluegrass-Smooth Brome, Scattered Trees, Shrubs - LoO64",1000]
[null,null,null,"3.2 Invaded Range-Kentucky Bluegrass Sod, Remnant Trees, Shrubs - LoO64",800]
[null,null,null,"4.1  Cottonwood, Prunus, Snowberry, Forbs, Grasses-LoO64",3000]
[null,null,null,"4.2  Mature Cottonwood, Green Ash, Box Elder, Prunus, Snowberry, Herbaceous Understory-LoO64",2750]
[null,null,null,"4.3  Green Ash, Boxelder, Prunus, Snowberry, Herbaceous Understory-LoO64",2500]
[null,null,null,"5.1 Scattered Mature Trees, Juniper, Russian Olive-LoO64",1000]
[null,null,null,"1.1 Rhizomatous Wheatgrass, Needle and Thread, Big Bluestem,  Shrubs, Scattered Trees-LoT64",2600]
[null,null,null,"1.2 Blue Grama, Rhizomatous Wheatgrass, Shrubs, Scattered Trees-LoT64",1600]
[null,null,null,"2.1 Pioneer Perennials-Annual-Shrubs-LoT64",900]
[null,null,null,"3.1 Rhizomatous Wheatgrass-Needlegrass-Nonnative Cool seasons, Shrubs, Scattered Trees-LoT64",2400]
[null,null,null,"4.1 Invaded Range-Kentucky Bluegrass, Smooth Brome, >30%-LoT64",1100]
[null,null,null,"5.1 Go-back-LoT64",500]
[null,null,null,"5.2A Range Seeding, Excellent Stand-LoT64",2750]
[null,null,null,"5.2B Range Seeding, Good Stand-LoT64",2000]
[null,null,null,"52C Range Seeding, Fair Stand-LoT64",1750]
[null,null,null,"5.2D Tame Pasture, Low Mgt-LoT64",1700]
[null,null,null,"5.2E Tame Pasture, Mod Mgt-LoT64",2700]
[null,null,null,"5.2F Tame Pasture, High Mgt-LoT64",3700]
[null,null,null,"1.1 Rhizomatous Wheatgrass, Alkali Sacaton, Cordgrass-SalLo64",2800]
[null,null,null,"2.1 Inland Saltgrass, Rhizomatous Wheatgrass-SalLo64",1800]
[null,null,null,"3.1 Inland Saltgrass, Foxtail Barley-SalLo64",1200]
[null,null,null,"1.1 Alkali Sacaton-SalSub64",2800]
[null,null,null,"1.2 Inland Saltgrass, Alkali Sacaton-SalSub64",1700]
[null,null,null,"2.1 Inland Saltgrass Sod-SalSub64",1000]
[null,null,null,"1.1 Sand Bluestem, Prairie Sandreed, Needlegrasses - Sa64",1900]
[null,null,null,"1.2 Prairie Sandreed-Needle and Thread-Sa64",1400]
[null,null,null,"1.3 Needle and Thread, Blue Grama, Sand Dropseed-Sa64",1000]
[null,null,null,"2.1 Blue Grama, Sedge-Sa64",700]
[null,null,null,"3.1 Annuals, Pioneer Perennials-Sa64",400]
[null,null,null,"3.2 Blowout-Sa64",100]
[null,null,null,"4.1A Range Seeding, Excellent Stand-Sa64",2200]
[null,null,null,"4.1B Range Seeding, Good Stand-Sa64",2000]
[null,null,null,"4.1C Range Seeding, Fair Stand-Sa64",1500]
[null,null,null,"4.1D Tame Pasture, Low Mgt-Sa64",1500]
[null,null,null,"4.1E Tame Pasture, Mod Mgt-Sa64",2000]
[null,null,null,"4.1F Tame Pasture, High Mgt-Sa64",2500]
[null,null,null,"4.1G Tame Pasture, Irrigated, Low Mgt-Sa64",7000]
[null,null,null,"4.1H Tame Pasture, Irrigated, High Mgt-Sa64",9000]
[null,null,null,"1.1 Prairie Sandreed, Needle and Thread, Bluestem-Sy-LowPZ-64",1600]
[null,null,null,"1.2 Prairie Sandreed-Needle and Thread-Blue Grama-Sy-LowPZ-64",1400]
[null,null,null,"1.3 Needle and Thread-Blue Grama-Western Wheatgrass-Sy-LowPZ-64",1200]
[null,null,null,"2.1 Blue Grama-Sand Dropseed-Threadleaf Sedge-Sy-LowPZ-64",900]
[null,null,null,"3.1 Sand Dropseed-Threeawn-Field Sagewort-Annuals-Sy-LowPZ-64",500]
[null,null,null,"4.1 Prairie Sandreed-Needle and Thread-Western Wheatgrass-Non-Native Cool Seasons-Sy-LowPZ-64",1400]
[null,null,null,"5.1 Go-Back-Sy-LowPZ-64",400]
[null,null,null,"5.2A Range Seeding, Excellent Stand-Sy-LowPZ-64",1800]
[null,null,null,"5.2B Range Seeding, Good Stand-Sy-LowPZ-64",1500]
[null,null,null,"5.2C Range Seeding, Fair Stand-Sy-LowPZ-64",1200]
[null,null,null,"5.52D Tame Pasture, Low Mgt-Sy-LowPZ-64",1400]
[null,null,null,"5.E Tame Pasture, Mod Mgt-Sy-LowPZ-64",2000]
[null,null,null,"5.2F Tame Pasture, High Mgt-Sy-LowPZ-64",2250]
[null,null,null,"5.2G Tame Pasture, Irrigated, Low Mgt-Sy-LowPZ-64",7000]
[null,null,null,"5.2H Tame Pasture, Irrigated, High Mgt-Sy-LowPZ-64",9000]
[null,null,null,"1.1 Bluestem, Prairie Sandreed-Sy-HighPZ-64",2400]
[null,null,null,"1.2 Prairie Sandreed, Needle and Thread, Blue Grama-Sy-HighPZ-64",2000]
[null,null,null,"2.1 Blue Grama, Sand Dropseed, Threadleaf Sedge-Sy-HighPZ-64",1400]
[null,null,null,"3.1 Sand Dropseed, Threeawn, Blue Grama, Field Sagewort,Annuals-Sy-HighPZ-64",1000]
[null,null,null,"4.1 Prairie Sandreed, Needle and Thread, Western Wheatgrass, Nonnative-Native Cool Seasons-Sy-HighPZ-64",1900]
[null,null,null,"5.1 Ponderosa Pine, Juniper, Shrubs, Herbaceous Understory-Sy-HighPZ-64",1000]
[null,null,null,"5.2 Ponderosa Pine, Juniper, Sedge, Forbs Understory-Sy-HighPZ-64",500]
[null,null,null,"6.1 Go-Back-Sy-HighPZ-64",500]
[null,null,null,"6.2A Range Seeding, Excellent Stand-Sy-HighPZ-64",2500]
[null,null,null,"6.2B Range Seeding, Good Stand-Sy-HighPZ-64",2000]
[null,null,null,"6.2C Range Seeding, Fair Stand-Sy-HighPZ-64",1400]
[null,null,null,"6.2D Tame Pasture, Low Mgt-Sy-HighPZ-64",1500]
[null,null,null,"6.2F Tame Pasture, Mod Mgt-Sy-HighPZ-64",2000]
[null,null,null,"6.2G Tame Pasture, High Mgt-Sy-HighPZ-64",2500]
[null,null,null,"6.2H Tame Pasture, Irrigated, Low Mgt-Sy-HighPZ-64",7000]
[null,null,null,"6.2I Tame Pasture, Irrigated, High Mgt-Sy-HighPZ-64",9000]
[null,null,null,"1.1 Bluestem, Prairie Sandreed, Needle and Thread, Cotttonwood-SyLo64",2600]
[null,null,null,"1.2 Prairie Sandreed, Needle and Thread, Blue Grama, Cottonwood-SyLo64",2000]
[null,null,null,"2.1 Bluestem, Prairie Sandreed, Needle and Thread-SyLo64",2500]
[null,null,null,"2.2 Prairie Sandreed, Needle and Thread, Blue Grama-SaLo64",1800]
[null,null,null,"3.1 Cottonwood, Russian Olive, Non-Native Cool Season Grasses - SaLo64",1700]
[null,null,null,"4.1 Invaded Range-Non-Native Cool Season Grasses, Cottonwood - SaLo64",1600]
[null,null,null,"1.1 Bluestem, Sideoats Grama, Needlegrass, Western Wheatgrass-Sw64",1500]
[null,null,null,"1.2 Needle and Thread, Little Bluestem, Grama-Sw64",1300]
[null,null,null,"2.1  Grama-Sedge-Fringed Sagewort-Sw64",800]
[null,null,null,"3.1 Sand Dropseed, Threeawn, Sagewort,Annuals-Sw64",500]
[null,null,null,"4.1 Ponderosa Pine, Juniper, Herbaceous Understory <15% Trees-Sw64",1000]
[null,null,null,"4.2 Ponderosa Pine, Juniper, Herbaceous Understory > 20% Trees-Sw64",700]
[null,null,null,"1.1 Rhizomatous Wheatgrass, Sideoats Grama, Green Needlegrass-SwCy64",1600]
[null,null,null,"1.2 Rhizomatous Wheatgrass, Blue Grama, Sedge-SwCy64",1200]
[null,null,null,"2.1 Blue Grama, Sedge-SwCy64",900]
[null,null,null,"3.1 Rhizomatous Wheatgrass, Green Needlegrass, Non-native Cool Season grasses-SwCy64",1400]
[null,null,null,"1.1 Big Bluestem, Little Bluestem, Indiangrass, Prairie Cordgrass-Sub64",4300]
[null,null,null,"1.2 Little Bluestem, Rhizomatous Wheatgrass, Sedge-Sub64",3000]
[null,null,null,"1.3 Excessive Litter-Sub64",3600]
[null,null,null,"2.1 Cool Season Grasses-Sedges-Sub64",1600]
[null,null,null,"2.2A Tame Pasture, Low Mgt-Sub64",2500]
[null,null,null,"2.2B Tame Pasture, Mod Mgt-Sub64",4000]
[null,null,null,"2.2C Tame Pasture, High Mgt-Sub64",6000]
[null,null,null,"1.1 Muhly, Bluestem, Shrubs, Green Ash-TB64",2500]
[null,null,null,"1.2  Shrubs, Green Ash, Juniper-TB64",1600]
[null,null,null,"2.1 Juniper, Shrubs-TB64",800]
[null,null,null,"1.1 Rhizomatous Wheatgrass, Blue Grama-TCP64",1000]
[null,null,null,"1.2 Blue Grama, Sandberg Bluegrass, Cactus-TCP64",500]
[null,null,null,"2.1 Slick Spots, Bare Ground, Cactus, Nostoc, Inland Saltgrass, Sandberg Bluegrass-TCP64",125]
[null,null,null,"1.1 Needlegrass-Grama-Little Bluestem-TU64",1800]
[null,null,null,"1.2 Little Bluestem, Grama-TU64",1600]
[null,null,null,"1.3 Blue Grama, Sedge, Needlegrass-TU64",1100]
[null,null,null,"2.1 Grama, Sedge, Threeawn-TU64",900]
[null,null,null,"3.1 Wheatgrass, Little Bluestem, Introduced Cool-Season Grasses-TU64",1500]
[null,null,null,"4.1A Range Seeding, Excellent Stand-TU-64",1800]
[null,null,null,"4.2B Range Seeding, Good Stand-TU64",1400]
[null,null,null,"4.2C Range Seeding, Fair Stand-TU64",1000]
[null,null,null,"4.2D Tame Pasture, Low Mgt-TU64",1700]
[null,null,null,"4.2E Tame Pasture, Mod Mgt-TU-64",2250]
[null,null,null,"4.2F Tame Pasture, High Mgt-TU64",3000]
[null,null,null,"1.1 Needle and Thread, Little Bluestem, Grama-VS64",900]
[null,null,null,"1.2 Blue Grama, Sedge-VS64",500]
[null,null,null,"1.1 Prairie Cordgrass, Nebraska Sedge, Reedgrass-WL64",5500]
[null,null,null,"1.2 Sedge, Smartweed, Spikerush, Baltic Rush, Bulrush-WL64",1800]
[null,null,null,"1.3 Prairie Cordgrass, Excessive Litter-WL64",5000]
[null,null,null,"2.1 Cattail, Reed Canarygrass-WL64",3000]
[null,null,null,"1.1 Big Bluestem, Switchgrass-WSub64",5000]
[null,null,null,"1.2 Switchgrass, Prairie Cordgrass-WSub64",4500]
[null,null,null,"1.3 Reedgrass, Prairie Cordgrass-Sedge-WL64",3700]
[null,null,null,"2.1 Native and Non-native Cool-Season Grasses, Sedges-WL64",3500]
[null,null,null,"1.1 Bluestem, Prairie Sandreed, Sand Lovegrass-CS14-17PZ65",1400]
[null,null,null,"1.2 Sand Bluestem, Prairie Sandreed-CS14-17PZ65",1100]
[null,null,null,"1.3 Blowout Grass, Sandhill Muhly-CS14-17PZ65",600]
[null,null,null,"1.4 Excessive Litter-CS14-17PZ65",1200]
[null,null,null,"2.1 Annual, Pioneer Perennial-CS14-17PZ-65",800]
[null,null,null,"2.2 Active Blowout-CS14-17PZ65",100]
[null,null,null,"1.1 Sand Bluestem -CS17-22PZ65",2100]
[null,null,null,"1.2 Bluestem, Prairie Sandreed CS17-22PZ65",1800]
[null,null,null,"1.3 Blowout Grass, Sandhill Muhly-CS17-22PZ65",400]
[null,null,null,"1.4 Excessive Litter-CS17-22PZ65",1500]
[null,null,null,"2.1 Annual, Pioneer Perennial-CS17-22PZ65",300]
[null,null,null,"2.2 Active Blowout-CS17-22PZ65",200]
[null,null,null,"1.1 Sand Bluestem-CS22-25PZ65",2400]
[null,null,null,"1.2 Little Bluestem, Prairie Sandreed-CS22-25PZ65",2400]
[null,null,null,"1.3 Blowout Grass, Sandhill Muhly-CS22-25PZ65",600]
[null,null,null,"1.4 Excessive Litter-CS22-25PZ65",1800]
[null,null,null,"2.1 Annual, Pioneer Perennial-CS22-25PZ-65",500]
[null,null,null,"2.2 Active Blowout-CS22-25PZ65",100]
[null,null,null,"1.1 Cattail, Bulrush DW65",5000]
[null,null,null,"1.1 Alkali Sacaton-SaSub65",2900]
[null,null,null,"1.2 Inland Saltgrass, Alkali Sacaton-SaSub65",1700]
[null,null,null,"1.3 Excessive Litter-SaSub65",1900]
[null,null,null,"2.1 Inland Saltgrass Sod-SaSub65",1000]
[null,null,null,"1.1 Bluestem, Prairie Sandreed-Sa14-17PZ65",1900]
[null,null,null,"1.2 Bluestem, Prairie Sandreed, Blue Grama-Sa14-17PZ65",1700]
[null,null,null,"1.3 Blue Grama, Sedge Sod-Sa14-17PZ65",1300]
[null,null,null,"1.4 Excessive Litter-Sa14-17PZ65",1400]
[null,null,null,"2.1 Annual, Pioneer Perennial-Sa14-17PZ65",600]
[null,null,null,"2.2 Active Blowout-Sa14-17PZ65",100]
[null,null,null,"3.1 Go-Back-Sa14-17PZ65",600]
[null,null,null,"3.2A Range Seeding, Excellent Stand-Sa14-17PZ65",2000]
[null,null,null,"3.2B Range Seeding, Good Stand-Sa14-17PZ65",1750]
[null,null,null,"3.2C Range Seeding, Fair Stand-Sa14-17PZ65",1400]
[null,null,null,"3.2D Tame Pasture, Low Mgt-Sa14-17PZ65",1200]
[null,null,null,"3.2E Tame Pasture, Mod Mgt-Sa14-17PZ",1700]
[null,null,null,"3.2F Tame Pasture, High Mgt-Sa14-17PZ65",2000]
[null,null,null,"3.2G Tame Pasture, Irrigated, Low Mgt-Sa14-17PZ65",7000]
[null,null,null,"3.2H Tame Pasture, Irrigated, High Mgt-Sa14-17PZ65",11000]
[null,null,null,"1.1 Bluestem, Prairie Sandreed, Needlegrass-Sa17-22PZ65",2300]
[null,null,null,"1.2 Bluestem, Prairie Sandreed Sa17-22PZ65",2000]
[null,null,null,"1.3 Prairie Sandreed, Ragweed-Sa17-22PZ65",1500]
[null,null,null,"1.4 Excessive Litter-Sa17-22PZ65",2100]
[null,null,null,"2.1 Grama, Sedge Sod-Sa17-22PZ65",1000]
[null,null,null,"3.1 Eastern Redcedar-Sa17-22PZ65",800]
[null,null,null,"4.1 Annual, Pioneer Perennial-Sa17-22PZ65",300]
[null,null,null,"4.2 Active Blowout-Sa17-22PZ65",100]
[null,null,null,"5.1 Go-Back-Sa17-22PZSa",700]
[null,null,null,"5.2A Range Seeding, Excellent Stand-Sa17-22PZ65",2500]
[null,null,null,"5.2B Range Seeding, Good Stand-Sa17-22PZ65",2250]
[null,null,null,"5.2C Range Seeding, Fair Stand-Sa17-22PZ65",1750]
[null,null,null,"5.2D Tame Pasture, Low Mgt-Sa22-25PZ65",1500]
[null,null,null,"5.2E Tame Pasture, Mod Mgt-Sa17-22PZ",2000]
[null,null,null,"5.2F Tame Pasture, High Mgt-Sa17-22PZ65",2500]
[null,null,null,"5.2G Tame Pasture, Irrigated, Low Mgt-Sa17-22PZ65",7000]
[null,null,null,"5.2H Tame Pasture, Irrigated, High Mgt-Sa17-22PZ65",11000]
[null,null,null,"1.1 Bluestem, Prairie Sandreed-Sa22-25PZ65",2600]
[null,null,null,"1.2 Bluestem, Prairie Sandreed, Switchgrass-Sa22-25PZ65",2300]
[null,null,null,"1.3 Prairie Sandreed, Ragweed-Sa22-25PZ65",1700]
[null,null,null,"1.4 Excessive Litter-Sa22-25PZ65",2400]
[null,null,null,"2.1 Grama, Sedge Sod-Sa22-25PZ65",1000]
[null,null,null,"3.1 Eastern Redcedar-Sa22-25PZ65",300]
[null,null,null,"4.1 Annual, Pioneer Perennial-Sa22-25PZ65",800]
[null,null,null,"4.2 Active Blowout-Sa22-25PZ65",100]
[null,null,null,"5.1 Go-Back-Sa22-25PZSa",1000]
[null,null,null,"5.2A Range Seeding, Excellent Stand-Sa22-25PZ65",2750]
[null,null,null,"5.2B Range Seeding, Good Stand-Sa2252PZ65",2400]
[null,null,null,"5.2C Range Seeding, Fair Stand-Sa22-25PZ65",2000]
[null,null,null,"5. 2D Tame Pasture, Low Mgt-Sa22-25PZ65",1700]
[null,null,null,"5.2E Tame Pasture, Mod Mgt-Sa22-25PZ",2400]
[null,null,null,"5.2F  Tame Pasture, High Mgt-Sa22-25PZ65",2900]
[null,null,null,"5.2G Tame Pasture, Irrigated, Low Mgt-Sa22-25PZ65",7000]
[null,null,null,"5.2H Tame Pasture, Irrigated, High Mgt-Sa22-25PZ65",11000]
[null,null,null,"1.1 Sand Bluestem, Prairie Sandreed-Sy14-17PZ65",1900]
[null,null,null,"1.2 Prairie Sandreed, Blue Grama, Needle and Thread-Sy14-17PZ65",1600]
[null,null,null,"1.3 Excessive Litter-Sy14-17PZ65",1600]
[null,null,null,"1.4 Blue Grama, Sand Dropseed, Western Ragweed-Sy14-17PZ65",1100]
[null,null,null,"2.1 Go-Back-Sy14-17PZ65",900]
[null,null,null,"2.2A Range Seeding, Excellent Stand-Sa14-17PZ65",2000]
[null,null,null,"2.2B Range Seeding, Good Stand-Sy14-17PZ65",1700]
[null,null,null,"2.2C Range Seeding, Fair Stand-Sy14-17PZ65",1500]
[null,null,null,"2.2D Tame Pasture, Low Mgt-Sy14-17PZ65",1200]
[null,null,null,"2.2E Tame Pasture, Mod Mgt-Sy14-17PZ",1700]
[null,null,null,"2.2F Tame Pasture, High Mgt-Sy14-17PZ65",2000]
[null,null,null,"2.2G Tame Pasture, Irrigated, Low Mgt-Sy14-17PZ65",7000]
[null,null,null,"2.2H Tame Pasture, Irrigated, High Mgt-Sy14-17PZ65",11000]
[null,null,null,"1.1 Bluestem, Prairie Sandreed-Sy17-22PZ65",2400]
[null,null,null,"1.2 Switchgrass, Prairie Sandreed-Sy17-22PZ65",2000]
[null,null,null,"1.3 Blue Grama, Western Wheatgrass-Sy17-22PZ65",1400]
[null,null,null,"2.1 Invaded Range-Kentucky Bluegrass, Ragweed-Sy17-22PZ65",900]
[null,null,null,"3.1 Go-Back-Sy17-22PZ65",700]
[null,null,null,"3.2A Range Seeding, Excellent Stand-Sa17-22PZ65",2500]
[null,null,null,"3.2B Range Seeding, Good Stand-Sy17-22PZ65",2000]
[null,null,null,"3.2C Range Seeding, Fair Stand-Sy17-22PZ65",1600]
[null,null,null,"3.2D Tame Pasture, Low Mgt-Sy17-22PZ65",1500]
[null,null,null,"3.2E Tame Pasture, Mod Mgt-Sy17-22PZ",2000]
[null,null,null,"3.2F Tame Pasture, High Mgt-Sy17-22PZ65",2500]
[null,null,null,"3.2G Tame Pasture, Irrigated, Low Mgt-Sy17-22PZ65",7000]
[null,null,null,"3.2H Tame Pasture, Irrigated, High Mgt-Sy17-22PZ65",11000]
[null,null,null,"1.1 Bluestem, Prairie Sandreed-Sy22-25PZ65",3000]
[null,null,null,"1.2 Switchgrass, Prairie Sandreed-Sy22-25PZ65",2500]
[null,null,null,"2.1 Blue Grama, Western Wheatgrass-Sy22-25PZ65",1700]
[null,null,null,"3.1 Invaded Range-Kentucky Bluegrass, Ragweed-Sa22-25PZ65",1200]
[null,null,null,"4.1 Go-back-Sy22-25PZ65",800]
[null,null,null,"4.2A Range Seeding, Excellent Stand-Sy22-25PZ65",3200]
[null,null,null,"4.2B Range Seeding, Good Stand-Sy2252PZ65",2750]
[null,null,null,"4.2C Range Seeding, Fair Stand-Sy22-25PZ65",2500]
[null,null,null,"4.2D Tame Pasture, Low Mgt-Sy22-25PZ65",1700]
[null,null,null,"4.2E Tame Pasture, Mod Mgt-Sy22-25PZ",2400]
[null,null,null,"4.2F Tame Pasture, High Mgt-Sy22-25PZ65",2900]
[null,null,null,"4.2G Tame Pasture, Irrigated, Low Mgt-Sy22-25PZ65",7000]
[null,null,null,"4.2H Tame Pasture, Irrigated, High Mgt-Sy22-25PZ65",11000]
[null,null,null,"1.1 Warm Season Tall Grasses-SyLo65",2600]
[null,null,null,"1.2 Warm Season Tall Grasses, Cool Season Grasses, Grass-likes-SyLo65",2000]
[null,null,null,"2.1 Warm Season Shortgrass, Cool Season Grasses, Grass-likes-Syo65",1600]
[null,null,null,"3,1 Eastern Redcedar > 15% canopy cover-SyLo65",2000]
[null,null,null,"1.1 Sand Bluestem, Prairie Sandreed-SG65",1000]
[null,null,null,"2.2 Club Moss, Prairie Sandreed-SG65",900]
[null,null,null,"3.3 Club Moss, Grama-SG65",500]
[null,null,null,"1.1 Bluestem, Indiangrass-Sub65",4580]
[null,null,null,"2.2 Bluestem, Switchgrass-Sub65",3980]
[null,null,null,"3.3 Cool Season Dominant-Sub65",3180]
[null,null,null,"4.4 Reed Canarygrass, Creeping Foxtail-Sub65",3000]
[null,null,null,"1.1 Prairie Cordgrass, Reedgrass-WL65",4800]
[null,null,null,"1.1 Big Bluestem, Switchgrass-WSub65",4650]
[null,null,null,"2.2 Switchgrass, Prairie Cordgrass-WSub65",4050]
[null,null,null,"3.3 Reedgrass, Bluegrass, and Other Cool seasons-WSub65",3700]
[null,null,null,"4.4 Reed Canarygrass, Creeping Foxtail-WSub65",3000]
[null,null,null,"1.1 Sand Blue, Little Blue, Prairie Sandreed-CS66",2400]
[null,null,null,"1.2 Little Blue-Prairie Sandreed, Needle and Thread-CS66",1600]
[null,null,null,"1.3 Blowout Grass-Sandhill Muhly, Prairie Sandreed-CS66",600]
[null,null,null,"1.4 Pioneer Plant community-CS66",400]
[null,null,null,"1.5 Active Blowout-CS66",200]
[null,null,null,"2.1 Invasive Woody-CS66",1200]
[null,null,null,"1.1D Western Wheatgrass, Alkaligrass-Slender Wheatgrass-Grass-likes-CD66",3500]
[null,null,null,"1.1W Forbs-Spikerush-Grass-likes-Bluegrass-Foxtail Barley-CD66",2700]
[null,null,null,"1.2 Western Wheatgrass-Inland Saltgrass-Kentucky Bluegrass-CD66",2200]
[null,null,null,"1.3 Low vigor perennial grasses-heavy duff layer-CD66",2000]
[null,null,null,"1.4 Ephemeral Forb Community - CD66",1750]
[null,null,null,"2.1 Foxtail Barley-Inland Saltgrass-CD66",1200]
[null,null,null,"3.1A Seeded, Native, Excellent Stand-CD66",3750]
[null,null,null,"3.1B Seeded, Native, Good Stand, CD66",3000]
[null,null,null,"3.1C Seeded, Native, Fair Stand-CD66",2500]
[null,null,null,"1.1 Sand and Little Bluestem-Prairie Sandreed-Switchgrass ID66",2900]
[null,null,null,"1.2 Little Bluestem-Prairie Sandreed-Needle and Thread-ID66",2500]
[null,null,null,"1.2 Little Bluestem-Prairie Sandreed-Needle and Thread-ID66",700]
[null,null,null,"1.3 Heavy Duff Layer-Low Vigor Perennial Grasses-ID66",2250]
[null,null,null,"2.1 Needle and Thread-Blue/Hairy Grama-Sand Dropseed-Kentucky Bluegrass-ID66",1200]
[null,null,null,"4.1 Eastern Redcedar-Woody Invaded-ID66",1500]
[null,null,null,"3.1 Go-Back-ID66",1000]
[null,null,null,"3.2A Range Seeding, Excellent Stand-Lo-ID66",3200]
[null,null,null,"3.2B Range Seeding, Good Stand-ID66",2750]
[null,null,null,"3.2C Range Seeding, Fair Stand-ID66",2250]
[null,null,null,"3.2D Tame Pasture, Mod Mgt-ID66",2000]
[null,null,null,"3.2E Tame Pasture, High Mgt-ID66",2700]
[null,null,null,"3.2F Tame Pasture, Irrigated, Low Mgt-ID66",2000]
[null,null,null,"3.2G Tame Pasture, Irrigated, High Mgt-ID66",2700]
[]
[null,null,null,"1.1 Bluestem, Prairie Sandreed, Switchgrass-Lo_LowPZ66",2600]
[null,null,null,"1.2 Western Wheatgrass-Blue Grama-Threadleaf Sedge-Lo_LowPZ66",2000]
[null,null,null,"1.3 Bluegrass, Western Wheatgrass, Smooth Bromegrass-Lo_LowPZ66",2500]
[null,null,null,"1.4 Heavy Duff-Low Vigor Perennial Grasses-Lo_LowPZ66",1750]
[null,null,null,"1.5 Ephemeral Forb Community Lo_LowPZ66",1750]
[null,null,null,"2.1 Blue Grama-Bluegrass-Sedge Sod-Lo_LowPZ66",1500]
[null,null,null,"2.2 Threeawn-Forbs Plant Community-Lo_LowPZ66",500]
[null,null,null,"4.1 Conifer, Deciduous Trees-Lo_LowPZ66",1000]
[null,null,null,"3.1 Go-Back-Lo_LowPZ66",700]
[null,null,null,"3.2A Range Seeding, Excellent Stand-Lo_LowPZ66",2750]
[null,null,null,"3.2B Range Seeding, Good Stand-Lo_LowPZ66",2500]
[null,null,null,"3.2C Range Seeding, Fair Stand-Lo_LowPZ66",2000]
[null,null,null,"3.2D Tame Pasture, Low Mgt-Lo_LowPZ66",2300]
[null,null,null,"3.2E Tame Pasture, Mod Mgt-Lo_LowPZ66",3250]
[null,null,null,"3.2 F Tame Pasture, High Mgt-Lo_LowPZ66",4000]
[null,null,null,"3.2G Tame Pasture, Irrigated, Low Mgt-Lo_LowPZ66",6500]
[null,null,null,"3.2 H Tame Pasture, Irrigated, High Mgt-Lo_LowPZ66",11000]
[null,null,null,"1.1 Needlegrass, Bluestem, Western Wheatgrass-Lo-HighPZ66",3100]
[null,null,null,"1.2 Blue Grama, Western Wheatgrass, Bluegrass-Lo-HighPZ66",2400]
[null,null,null,"1.3 Managed Bluestem, Switchgrass, Needle and Thread-Lo-HighPZ66",3600]
[null,null,null,"1.4 Heavy Duff-Low Vigor PerennialsLo-HighPZCD66",2400]
[null,null,null,"1.5 Ephemeral ForbCommunity-Lo-HighPZ66",2000]
[null,null,null,"2.1 Invaded Range-Bluegrass, Western Wheatgrass, Smooth Brome-Lo-HighPZ66",2000]
[null,null,null,"2.2A Invaded Range-Smooth Brome dominant, Kentucky Bluegrass-Lo-HighPZ66",2800]
[null,null,null,"2.2B Invaded Range-Kentucky bluegrass dominant, Smooth Brome-Lo-HighPZ66",1800]
[null,null,null,"2.3 Blue Grama, Bluegrass, Sedge-Lo-HighPZ66",1400]
[null,null,null,"2.4 Threeawns,Forbs-Lo-HighPZ66",700]
[null,null,null,"4.1 Conifer, Deciduous Trees-Lo-HighPZ66",1000]
[null,null,null,"3.1 Go-Back-Lo-HighPZ66",700]
[null,null,null,"3.2A Range Seeding, Excellent Stand-Lo-HighPZ66",3250]
[null,null,null,"3.2B Range Seeding, Good Stand-Lo-HighPZ66",2750]
[null,null,null,"3.2C Range Seeding, Fair Stand-Lo-HighPZ66",2500]
[null,null,null,"3.2D Tame Pasture, Low Mgt-Lo-HighPZ66",2900]
[null,null,null,"3.2E Tame Pasture, Mod Mgt-Lo-HighPZ66",3500]
[null,null,null,"3.2F Tame Pasture, High Mgt-Lo-HighPZ66",5100]
[null,null,null,"3.2G Tame Pasture, Irrigated, Low Mgt-Lo-HighPZ66",8500]
[null,null,null,"3.2H Tame Pasture, Irrigated, High Mgt-Lo22-25PZ66",14000]
[null,null,null,"1.1 Big Bluestem, Needlegrass, Western Wheatgrass-LoO66",3400]
[null,null,null,"1.2 Western Wheatgrass, Kentucky Bluegrass, Remnant Big Blue-LoO66",2700]
[null,null,null,"1.3 Kentucky Bluegrass-Western Wheatgrass-Shrubs-LoO66",2500]
[null,null,null,"1.4  Ephemeral Forbs-LoO66",2000]
[null,null,null,"2.1 Invaded Range-Kentucky Bluegrass, Annuals-LoO66",1700]
[null,null,null,"4.0 Deciduous Woody Encroached-LoO66",1500]
[null,null,null,"5.0 Evergreen Woody Encroached-LoO66",1000]
[null,null,null,"3.1 Go-Back-LoO66",1000]
[null,null,null,"3.2A Range Seeding, Excellent Stand-LoO66",3500]
[null,null,null,"3.2B Range Seeding, Good Stand-LoO66",3000]
[null,null,null,"3.2C Range Seeding, Fair Stand-LoO66",2600]
[null,null,null,"3.2D Tame Pasture, Low Mgt-LoO66",3000]
[null,null,null,"3.2E Tame Pasture, Mod Mgt-LoO66",4200]
[null,null,null,"3.2F Tame Pasture, High Mgt-LoO66",5500]
[null,null,null,"3.2G Tame Pasture, Irrigated, Low Mgt-LoO66",8500]
[null,null,null,"3.2H Tame Pasture, Irrigated, High Mgt-LoO66",14000]
[null,null,null,"1.1 Western Wheatgrass, Green Needlegrass, Big Bluestem, Shrubs, Trees-LT66",2800]
[null,null,null,"1.2 Blue Grama, Western Wheatgrass, Buffalograss-LT66",1800]
[null,null,null,"1.3 Excessive Litter-LT66",1500]
[null,null,null,"1.4 Ephemeral Forb-LT66",1500]
[null,null,null,"2.1 Invaded Cool Season Introduced and Natives-LT66",1000]
[null,null,null,"2.2 Invaded Range-Kentucky Bluegrass and-or Smooth Brome-LT66",2000]
[null,null,null,"3.1 Go-Back-LT66",1000]
[null,null,null,"3.2A Range Seeding, Excellent Stand-LT66",3000]
[null,null,null,"3.2B Range Seeding, Good Stand-LT66",2750]
[null,null,null,"3.2C Range Seeding, Fair Stand-LT66",2500]
[null,null,null,"3.2D Tame Pasture, Low Mgt-LT66",2200]
[null,null,null,"3.2E Tame Pasture, Mod Mgt-LT66",2750]
[null,null,null,"3.2F Tame Pasture, High Mgt-LT66",3500]
[null,null,null,"3.2G Tame Pasture, Irrigated, Low Mgt-LT66",6500]
[null,null,null,"3.2H Tame Pasture, Irrigated, High Mgt-LT66",11000]
[null,null,null,"1.1 Alkali Sacaton-SalSub66",2800]
[null,null,null,"1.2 Inland Saltgrass, Alkali Sacaton-SalSub66",1700]
[null,null,null,"1.3 Excessive Litter-SalSub66",1900]
[null,null,null,"2.1 Inland Saltgrass, Foxtail Barley-SalSub66",1000]
[null,null,null,"3.1 Go-Back-SalSub66",750]
[null,null,null,"3.2A Range Seeding, Excellent Stand-SalSub66",2750]
[null,null,null,"3.2B Range Seeding, Good Stand-SalSub66",2250]
[null,null,null,"3.2C Range Seeding, Fair Stand-SalSub66",1750]
[null,null,null,"1.1 Bluestem, Prairie Sandreed, Needlegrass-Sa-LowPZ66",2300]
[null,null,null,"1.2 Little Bluestem-Prairie Sandreed-Sand Bluestem-Sa-LowPZ66",2000]
[null,null,null,"1.3 Prairie Sandreed-Bluegrass, Sand Dropseed-Sa-LowPZ66",1500]
[null,null,null,"1.4 Excessive Litter-Low Vigor Perennial Grasses-Sa-LowPZ66",2100]
[null,null,null,"1.5 Blowout Recovery, Blowout Grass, Sand Bluestem, Pioneer Perennials, Annuals-Sa-LowPZ66",500]
[null,null,null,"1.6 Active Blowout-SaLowPZ66",250]
[null,null,null,"2.1 Grama, Sedge Sod-SaLowPZ66",700]
[null,null,null,"4.1 Eastern Redcedar and other Trees-SaLowPZ66",1500]
[null,null,null,"3.1 Go-Back--SaLowPZ66",500]
[null,null,null,"3.2A Range Seeding, Excellent Stand--SaLowPZ66",2500]
[null,null,null,"3.2B Range Seeding, Good Stand--SaLowPZ66",2200]
[null,null,null,"3.3C Range Seeding, Fair Stand--SaLowPZ66",1750]
[null,null,null,"3.3D Tame Pasture, Low Mgt--SaLowPZ66",2000]
[null,null,null,"3.3E Tame Pasture, Mod Mgt--SaLowPZ66",2500]
[null,null,null,"3.3F Tame Pasture, High Mgt--SaLowPZ66",3000]
[null,null,null,"3.3G Tame Pasture, Irrigated, -SaLowPZ66",6500]
[null,null,null,"3.3H Tame Pasture, Irrigated, High Mgt--SaLowPZ66",11000]
[null,null,null,"1.1 Bluestem, Prairie Sandreed-SaHighPZ66",2800]
[null,null,null,"1.2 Bluestem-Prairie Sandreed-Switchgrass-SaHighPZ66",2400]
[null,null,null,"1.3 Prairie Sandreed-Ragweed-SaHighPZ66",1900]
[null,null,null,"1.4 Excessive Litter-SaHighPZ66",2300]
[null,null,null,"1.5 Blowout Recovery, Blowout Grass, Sand Bluestem, Pioneer Perennials, Annuals-Sa-HighPZ66",700]
[null,null,null,"1.6 Active Blowout-SaHighPZ66",350]
[null,null,null,"2.1 Blue/Hairy Grama-Sedges-Sand Dropseed-Needle and Thread-SaHighPZ66",900]
[null,null,null,"4.1 Eastern Redcedar and other Trees-SaHighPZ66",1250]
[null,null,null,"3.1 Go-Back-SaHighPZ66",700]
[null,null,null,"3.2A Range Seeding, Excellent Stand-SaHighPZ66",3000]
[null,null,null,"3.2B Range Seeding, Good Stand-SaHighPZ66",2500]
[null,null,null,"3.2C Range Seeding, Fair Stand-SaHighPZ66",2250]
[null,null,null,"3.2D Tame Pasture, Low Mgt-SaHighPZ66",2000]
[null,null,null,"3.2E Tame Pasture, Mod Mgt-SaHighPZ66",2500]
[null,null,null,"3.2F Tame Pasture, High Mgt-SaHighPZ66",3000]
[null,null,null,"3.2G Tame Pasture, Irrigated, SaHighPZ66",6500]
[null,null,null,"3.2H Tame Pasture, Irrigated, High Mgt-SaHighPZ66",11000]
[null,null,null,"1.1 Sand and Little Bluestem-Prairie Sandreed-Sy-LowPZ66",2400]
[null,null,null,"1.2 Little Bluestem, Switchgrass-Prairie Sandreed-Sy-LowPZ66",2000]
[null,null,null,"1.3 Blue Grama-Western Wheatgrass, Scribner's Rosettegrass-Sy-LowPZ66",1400]
[null,null,null,"1.4 Heavy Duff-Low Vigor Perennial Grasses-SyLowPZ66",1750]
[null,null,null,"1.5 Ephemeral Forbs-SyLowPZ",1500]
[null,null,null,"2.1 Invaded Range-Kentucky Bluegrass-Ragweed-Sy-LowPZ66",900]
[null,null,null,"3.1 Eastern Redcedar-Sy-LowPZ66",1200]
[null,null,null,"4.1 Go-Back-Sy-LowPZ66",750]
[null,null,null,"4.2A Range Seeding, Excellent Stand-Sy-LowPZ66",2500]
[null,null,null,"4.2B Range Seeding, Good Stand-Sy-LowPZ66",2250]
[null,null,null,"4.2C Range Seeding, Fair Stand-Sy-LowPZ66",1750]
[null,null,null,"4.2D Tame Pasture, Low Mgt-Sy-LowPZ66",2000]
[null,null,null,"4.2E Tame Pasture, Mod Mgt-Sy-LowPZ66",2500]
[null,null,null,"4.2F Tame Pasture, High Mgt-Sy-LowPZ66",3000]
[null,null,null,"4.2G Tame Pasture, Irrigated, SSy-LowPZ66",6500]
[null,null,null,"4.2H Tame Pasture, Irrigated, High Mgt-Sy-LowPZ66",11000]
[null,null,null,"1.1 Sand and/or Big Bluestem, Prairie Sandreed-Sy-HighPZ-66",3000]
[null,null,null,"1.2 Little Bluestem, Switchgrass, Prairie Sandreed-Sy-HighPZ-66",2500]
[null,null,null,"1.3 Western Wheatgrass, Blue Grama, Needle and Thread-Sy-HighPZ66",1700]
[null,null,null,"1.4 Excessive Duff-Low Vigor Perennials-Sy-HighPZ-66",2250]
[null,null,null,"1.5 Ephemeral Forbs-Sy-HighPZ-66",1500]
[null,null,null,"2.1 Kentucky Bluegrass, Blue Grama, Sand Dropseed, Scribner's Rosettegrass-Sy-HighPZ-66",1200]
[null,null,null,"3.1 Eastern Redcedar-Sy-HighPZ-66",1300]
[null,null,null,"4.1 Go-Back-Sy-HighPZ-66",1000]
[null,null,null,"4.2A Range Seeding, Excellent Stand-Sy-HighPZ-66",3200]
[null,null,null,"4.2B Range Seeding, Good Stand-Sy-HighPZ-66",2750]
[null,null,null,"4.2C Range Seeding, Fair Stand-Sy-HighPZ-66",2250]
[null,null,null,"4.2D Tame Pasture, Low Mgt-Sy-HighPZ-66",2000]
[null,null,null,"4.2E Tame Pasture, Mod Mgt-Sy-HighPZ-66",2700]
[null,null,null,"4.2F Tame Pasture, High Mgt-Sy-HighPZ-66",3400]
[null,null,null,"4.2G Tame Pasture, Irrigated, Sy-HighPZ-66",6500]
[null,null,null,"4.2H Tame Pasture, Irrigated, High Mgt-Sy-HighPZ-66",11000]
[null,null,null,"1.1 Sand and Little Bluestem, Prairie Sandreed, Switchgrass-SyLo66",2900]
[null,null,null,"1.2 Little Bluestem, Switchgrass, Prairie Sandreed, Needle and Thread-SyLo66",2415]
[null,null,null,"1.3 Heavy Duff Layer-Low Vigor Perennial Grasses-SyLo66",2100]
[null,null,null,"1.4 Ephemeral Forb Community-SyLo66",1800]
[null,null,null,"2.1 Needle and Thread, Gramas, Sand Dropseed-SyLo66",1800]
[null,null,null,"4.1 Eastern Redcedar and other Trees-SaLo66",1750]
[null,null,null,"3.1 Go-Back-SyLo66",1250]
[null,null,null,"3.2A Range Seeding, Excellent Stand-SyLo66",3000]
[null,null,null,"3.2B Range Seeding, Good Stand-Lo66",2500]
[null,null,null,"3.2C Range Seeding, Fair Stand-SyLo66",2000]
[null,null,null,"3.2D Tame Pasture, Low Mgt-SyLo66",2500]
[null,null,null,"3.2E Tame Pasture, Mod Mgt-SyLo66",3500]
[null,null,null,"3.2F Tame Pasture, High Mgt-SyLo-66",4500]
[null,null,null,"3.2G Tame Pasture, Irrigated, Low Mgt-SyLo-66",6000]
[null,null,null,"3.2H Tame Pasture, Irrigated, High Mgt-SyLo-66",8000]
[null,null,null,"1.1 Big Bluestem-Sideoats Grama-Needlegrass-ShL66",1700]
[null,null,null,"1.2 Little Bluestem-Needlegrass, Grama-ShL66",1400]
[null,null,null,"2.1 Grama, Sedge, Bare Ground-ShL66",1000]
[null,null,null,"3.1 Eastern Redcedar-Ponderosa Pine-ShL66",1200]
[null,null,null,"1.1 Sand Bluestem, Prairie Sandreed-SG66",1600]
[null,null,null,"1.2 Club Moss, Prairie Sandreed-SG66",1100]
[null,null,null,"1.4 Heavy Duff-Low Vigor Perennial Grasses-SG66",1200]
[null,null,null,"1.5 Ephemeral Forbs-SG66",1100]
[null,null,null,"2.1 Club Moss, Grama-SG66",700]
[null,null,null,"3.1 Eastern Redcedar-SG66",700]
[null,null,null,"1.1 Sand Bluestem, Little Bluestem, Prairie Sandreed-StSy66",2000]
[null,null,null,"1.2 Little Bluestem, Needle and Thread, Gramas-StSy66",1750]
[null,null,null,"1.3 Blue Grama, Western Wheatgrass, Scribner's Rosettegrass-StSy66",1300]
[null,null,null,"1.4 Heavy Duff-Low Vigor Perennial Grasses-StSy66",1500]
[null,null,null,"1.5 Ephemeral Forbs-StSy66",1250]
[null,null,null,"2.1 Invaded Range-Kentucky Bluegrass, Smooth Brome-StSy66",1500]
[null,null,null,"3.1 Eastern Redcedar-StSy66",1300]
[null,null,null,"1.1 Big and Little Bluestem-Indiangrass-Sub66",4800]
[null,null,null,"1.2 Little and Big Bluestem-Switchgras-Sub66",4300]
[null,null,null,"1.3 Western Wheatgrass-Smooth Bromegrass-Kentucky Bluegrass-Sub66",4500]
[null,null,null,"1.4 Heavy Duff-Low Vigor Perennial Grasses-Sub66",3500]
[null,null,null,"1.5 Ephemeral Forbs-Sub66",3000]
[null,null,null,"2.1 Reed Canary-Creeping Foxtail, Low Mgt-Sub66",4500]
[null,null,null,"2.1 Reed Canary-Creeping Foxtail, High Mgt-Sub66",9000]
[null,null,null,"1.1 Little Bluestem-Needle and Thread-Sideoats Grama-TU66",2300]
[null,null,null,"1.2 Little Bluestem-Blue Grama-Western Wheatgrass-TU66",1900]
[null,null,null,"1.3 Blue Grama-Sedges-Threeawn-TU66",1000]
[null,null,null,"1.4 Heavy Duff-Low Vigor Perennial Grasses-TU66",1750]
[null,null,null,"1.5 Ephemeral Forbs-TU66",1800]
[null,null,null,"2.1 Three awn, annual grasses, introduced grasses-TU66",500]
[null,null,null,"4.1 Eastern Red Cedsar-TU66",1250]
[null,null,null,"3.1 Go-Back-TU-66",700]
[null,null,null,"3.2A Range Seeding, Excellent Stand-TU-66",2400]
[null,null,null,"3.2B Range Seeding, Good Stand-TU-66",1800]
[null,null,null,"3.2C Range Seeding, Fair Stand-TU-66",1200]
[null,null,null,"3.2D Tame Pasture, Low Mgt-TU-66",1400]
[null,null,null,"3.2E Tame Pasture, Mod Mgt-TU-66",2150]
[null,null,null,"3.2F Tame Pasture, High Mgt-TU-66",2900]
[null,null,null,"3.2G Tame Pasture, Irrigated, Low Mgt-TU-66",3500]
[null,null,null,"3.2H Tame Pasture, Irrigated, High Mgt-TU-66",6300]
[null,null,null,"1.1 Prairie Cordgrass-Reedgrasses-WL66",4495]
[null,null,null,"1.1 Sand and Little Bluestem, Prairie Sandreed, Needle and Thread-CS67A",1750]
[null,null,null,"1.2 Low Density, Prairie Sandreed, Needle and Thread-Forbs-CS-67A",1000]
[null,null,null,"2.1 Sandhill Muhly, Sand Sagebrush-CS-67A",550]
[null,null,null,"3.1 Annual Dominated Community-CS-67A",100]
[null,null,null,"3.2 Early Perennials-CS-67A",250]
[null,null,null,"1.1 Western Wheatgrass, Blue Grama, Green Needlegrass-Cy67A",1300]
[null,null,null,"1.2 Blue Grama, Threadleaf Sedge, Decreased Western Wheatgrass-Cy67A",950]
[null,null,null,"1.3 Cool season grasses, Prickypear-Cy67A",1200]
[null,null,null,"2.1 Blue Grama, Buffalograss Sod-Cy67A",600]
[null,null,null,"3.1 Blue Grama, Threeawn-Annuals-Cy67A",600]
[null,null,null,"4.1 Go-Back-Cy67A",400]
[null,null,null,"4.2A Seeded, Native, Excellent Stand-Cy67A",1400]
[null,null,null,"4.2B Seeded, Native, Good Stand-Cy67A",1100]
[null,null,null,"4.2C Seeded, Native, Fair Stand-Cy67A",800]
[null,null,null,"4.2D Tame Pasture, Low Mgt-Cy67A",1400]
[null,null,null,"4.2E Tame Pasture, Mod Mgt-Cy67A",2000]
[null,null,null,"4.2F Tame Pasture, High Mgt-Cy67A",2500]
[null,null,null,"4.2G Tame Pasture, Irrigated, Low Mgt-Cy67A",5000]
[null,null,null,"4.2H  Tame Pasture, Irrigated, High Mgt-Cy67A",9000]
[null,null,null,"1.1 Western Wheatgrass, Green Needlegrass-CUD67A",2000]
[null,null,null,"1.2 Blue Grama, Buffalograss, Western Wheatgrass-CUD67A",1500]
[null,null,null,"1.3 Low Plant Density, High Litter-CUD67A",1800]
[null,null,null,"1.4 Blue Grama, Buffalograss Sod-CUD67A",1300]
[null,null,null,"2.1 Blue Grama, Threeawn-Annual Grasses, Forbs-CUD67A",1000]
[null,null,null,"1.1 Little Bluestem, Needle and thread, Blue Grama-Gv67A",800]
[null,null,null,"1.2 Blue Grama, Needle and Thread-Gv67A",600]
[null,null,null,"2.1 Blue Grama, Threadleaf Sedge-Gv67A",400]
[null,null,null,"3.1 Cushion Plants, Threeawn-Annuals-Gv67A",300]
[null,null,null,"1.1 Needle and Thread, Blue Grama, Little Bluestem, Sideoats Grama-LiU67A",1250]
[null,null,null,"1.2 Blue Grama, Threadleaf Sedge, Remnant Mid-grasses-LiU67A",950]
[null,null,null,"1.3 Low Density, Increased Litter-LiU67A",1000]
[null,null,null,"2.1 Blue Grama, Buffalograss, Threadleaf Sedge-LiU67A",700]
[null,null,null,"3.1 Broom Snakeweed, Annual Grasses, Forbs, Bare Ground-LiU67A",650]
[null,null,null,"4.1 Go-Back-LiU67A",500]
[null,null,null,"4.2A Range Seeding, Natives, Excellent Stand-LiU67A",1350]
[null,null,null,"4.2B Range Seeding, Natives, Good Stand-LiU67A",1200]
[null,null,null,"4.2C Range Seeding, Natives, Fair Stand-LiU67A",1000]
[null,null,null,"4.2D Tame Pasture, Low Mgt-LiU67A",1000]
[null,null,null,"4.2E Tame Pasture, Mod Mgt-LiU67A",1500]
[null,null,null,"4.2F Tame Pasture, High Mgt-LiU67A",2000]
[null,null,null,"1.1 Needle and Thread, Little Bluestem, Blue Grama-Lo67A",1500]
[null,null,null,"1.2 Blue Grama, Threadleaf Sedge, Remnant Mid-grasses-Lo67A",1100]
[null,null,null,"1.3 Excessive Litter, Low Plant Density-Lo67A",1400]
[null,null,null,"2.1 Blue Grama, Buffalograss, Threadleaf Sedge-Lo67A",700]
[null,null,null,"3.1 Bare Ground, Broom Snakeweed, Pricklypear, Annuals, Blue Grama, Threadleaf Sedge-Lo67A",700]
[null,null,null,"4.1 Go-Back, Annuals, Sand Dropseed, Threeawn-Lo67A",700]
[null,null,null,"4.2A Range Seeding, Natives, Excellent Stand-Lo67A",1700]
[null,null,null,"4.2B Range Seeding, Natives, Good Stand-Lo67A",1500]
[null,null,null,"4.2C Range Seeding, Natives, Fair Stand-Lo67A",1200]
[null,null,null,"4.2D Tame Pasture, Low Mgt-Lo67A",1400]
[null,null,null,"4.2E Tame Pasture, Mod Mgt-Lo67A",1750]
[null,null,null,"4.2F Tame Pasture, High Mgt-Lo67A",2250]
[null,null,null,"1.1 Midgrasses, Shrubs, Plains Cottonwood-LoLo67A",2500]
[null,null,null,"1.2 Blue Grama, Western Wheatgrass, Cottonwood-LoLo67A",1750]
[null,null,null,"1.3 Excessive Litter, Low Plant Density-LoLo67A",1500]
[null,null,null,"2.1 Blue Grama, Buffalograss, Decadent Cottonwood-LoLo67A",1250]
[null,null,null,"3.1 Invaded Range-Kentucky Bluegrass, Smooth Brome, Noxious Weeds, Russian Olive-LoLo67A",1000]
[null,null,null,"1.1 Western Wheatgrass, Needle and Thread, Green Needlegrass, Big Bluestem-LoO67A",2000]
[null,null,null,"1.2  Blue Grama, Western Wheatgrass-LoO67A",1500]
[null,null,null,"1.3 Excessive Litter-Low Plant Density-LoO67A",1800]
[null,null,null,"2.1 Blue Grama, Buffalograss Sod-LoO67A",1000]
[null,null,null,"3.1 Threeawn, Annuals, Kentucky Bluegrass, Blue Grama-LoO67A",1000]
[null,null,null,"1.1 Alkali Sacaton-Western Wheatgrass, Greasewood, Saltbush-SalLo67A",1500]
[null,null,null,"1.2 Inland Saltgrass, Western Wheatgrass-SalLo67A",1300]
[null,null,null,"1.3 Excessive Litter-Low Plant Density-SalLo67A",1100]
[null,null,null,"2.1 Inland Saltgrass, Blue Grama, Shrubs-SalLo67A",900]
[null,null,null,"3.1 Inland Saltgrass, Cheatgrass, Annuals, Russian Olive, Salt Cedar-SalLo67A",500]
[null,null,null,"1.1 Alkali Sacaton, Western Wheatgrass, Inland Saltgrass-SalSub67A",3500]
[null,null,null,"1.2 Alkali Sacaton, Saltgrass-SalSub67A",2300]
[null,null,null,"1.3 Excessive Litter-SalSub67A",3100]
[null,null,null,"2.1 Inland Saltgrass, Remnant Alkali Sacaton-SalSub67A",1900]
[null,null,null,"3.1 Kochia, Russian Thistle, Halogeton, Salt Crust-SalSub67A",800]
[null,null,null,"4.1 Russian Olive Invasion-SalSub67A",2800]
[null,null,null,"1.1 Western Wheatgrass, Alkali Sacaton, Blue Grama, Fourwing Saltbush-SU67A",700]
[null,null,null,"1.2 Blue Grama and/or Buffalograss, Inland Saltgrass-SU67A",500]
[null,null,null,"1.3 Excessive Litter, Low Plant Density-SU67A",600]
[null,null,null,"2.1 Inland Saltgrass, Remnant Alkali Sacaton-SU67A",500]
[null,null,null,"3.1 Scratchgrass, Threeawn, Annuals, Bare Ground-SU67A",300]
[null,null,null,"1.1 Sand Bluestem, Prairie Sandreed, Needle and Thread-Sa67A",1500]
[null,null,null,"1.2 Blue Grama, Needle and Thread, Decreased Tall Grasses, Sand Sagebrush-Sa67A",1000]
[null,null,null,"1.3 Excessive Litter, Low Plant Density-Sa67A",1200]
[null,null,null,"2.1 Sand Sagebrush, Sandhill Muhly, Blue Grama, Annual Forbs and Grasses-Sa67A",600]
[null,null,null,"3.1 Blowouts, Annual Grasses and Forbs, Sand Sagebrush-Sa67A",100]
[null,null,null,"3.2 Blowout Grass, Sand Dropseed, Annual Grasses and Forbs-Sa67A",250]
[null,null,null,"1.1 Needle and Thread, Prairie Sandreed, Little Bluestem-Sy67A",1500]
[null,null,null,"1.2 Blue Grama, Needle and Thread, Prairie Sandreed-Sy67A",1100]
[null,null,null,"1.3 Excessive Litter, Low Plant Density-Sy67A",1200]
[null,null,null,"2.1 Blue Grama, Threadleaf Sedge Sod, Spreading Buckwheat-Sy67A",600]
[null,null,null,"3.1 Threadleaf Sedge, Blue Grama, Fendler's Threeawn, Annual Grasses and Forbs-Sy67a",600]
[null,null,null,"4.1 Go-back-Sy67A",300]
[null,null,null,"4.2A  Seeded, Native Excellent Stand-Sy67A",1700]
[null,null,null,"4.2B  Seeded, Native Good Stand-Sy67A",1500]
[null,null,null,"4.2C  Seeded, Native Fair Stand-Sy67A",1200]
[null,null,null,"4.2D Seeded, Introduced, Low Mgt-Sy67A",1000]
[null,null,null,"4.2E Seeded, Introduced, Mod Mgt-Sy67A",1250]
[null,null,null,"4.2F Seeded, Introduced, Irrigated-High Mgt-Sy67A",5000]
[null,null,null,"4.2G Seeded, Introduced, Irrigated-High Mgt-Sy67A",7000]
[null,null,null,"1.1 Plains Cottonwood-Needle and Thread-Sand and Little Bluestem-Prairie Sandreed-Shrubs-SyLo67A",2500]
[null,null,null,"1.2 Plains Cottonwood, Blue Grama, Threadleaf Sedge, Western Wheatgrass-SyLo67A",1750]
[null,null,null,"1.3 Excessive Litter-SyLo67A",1250]
[null,null,null,"2.1 Blue Grama, Threadleaf Sedge Sod-SyLo67A",1250]
[null,null,null,"3.1 Russian Olive, Kentucky Bluegrass, Smooth Brome-SyLo67A",1000]
[null,null,null,"1.1 Rhizomatous Wheatgrass-Little Bluestem-Blue Grama-Needle and Thread, Sw67A",1100]
[null,null,null,"1.2 Threadleaf Sedge, Blue Grama, Remnant Mid and Tall Grasses-Sw67A",850]
[null,null,null,"1.3 Excessive Litter, Low Plant Density-Sw67A",1000]
[null,null,null,"2.1 Blue Grama, Threadleaf Sedge Sod-Sw67A",650]
[null,null,null,"3.1 Threadleaf Sedge, Annuals, Cheatgrass, Bare Ground-Sw67A",550]
[null,null,null,"1.1 Big and Little Bluestem, Prairie Cordgrass-Sub67A",4500]
[null,null,null,"1.2 Little Bluestem, Kentucky Bluegrass, Reduced Tall Grasses-Sub67A",3200]
[null,null,null,"1.3 Excessive Litter, Low Plant Density-Sub67A",3800]
[null,null,null,"2.1 Kentucky Bluegrass Sod-Sub67A",2300]
[null,null,null,"3.1 Kentucky Bluegrass, Foxtail Barley, Annuals, Noxious Weeds-Sub67A",1800]
[null,null,null,"1.1 Little Bluestem, Western Wheatgrass, Needle and Thread, Blue Grama-VS67A",600]
[null,null,null,"1.2 Thread leaf Sedge, Blue Grama, Remnant Mid-grasses-VS67A",450]
[null,null,null,"1.3 Excessive Litter, Low Plant Density-VS67A",550]
[null,null,null,"2.1 Blue Grama, Threadleaf Sedge Sod-VS67A",350]
[null,null,null,"3.1 Threadleaf Sedge, Cheatgrass, Fringed Sagewort, Prickly pear-Bare Ground-VS67A",300]
[null,null,null,"1.1 Prairie Cordgrass, Nebraska Sedge, Reedgrass-WL67A",5500]
[null,null,null,"1.2 Excessive Litter, Low Plant Density-WL67A",5000]
[null,null,null,"2.1 Mountain Rush, Cattail-WL67A",3000]
[null,null,null,"3.1 Mountain Rush, Smartweed, American Licorice-WL67A",2500]
[null,null,null,"1.1A Dry Phase Western Wheatgrass, Buffalograss,Sedge-CUD71",4000]
[null,null,null,"1.1B Wet Phase Sedges, Spikerushes, Annuals-CUD71",3000]
[null,null,null,"1.2 Buffalograss, Kentucky Bluegrass, Annuals-CUD71",2500]
[null,null,null,"1.3 Excessive Litter-CUD71",2500]
[null,null,null,"2.1 Go-back, annuals-CUD71",2500]
[null,null,null,"3.1A Seeded or Invaded Introduced Cool Seasons, Low Mgmt-CUD71",3000]
[null,null,null,"3.1B Seeded or Invaded Introduced Cool Seasons, High Mgmt-CUD71",8000]
[null,null,null,"1.1 Big and Little Bluestem, Sideoats Grama-LiU71",2625]
[null,null,null,"1.2 Sideoats Grama, Little Bluestem, Blue Grama-LiU71",2200]
[null,null,null,"1.3 Sideoats grama, Blue Grama, Western Wheatgrass-LiU71",1800]
[null,null,null,"1.4 Decadent Plants-LiU71",1700]
[null,null,null,"2.1 Blue Grama, Kentucky Bluegrass Sod-LiU71",700]
[null,null,null,"3.1 Eastern Redcedar Encroachment-LiU71",1000]
[null,null,null,"4.1 Smooth Brome Encroachment-LiU71",2000]
[null,null,null,"5.1 Annual Dominated-LiU71",500]
[null,null,null,"6.1A Reseed - Excellent Stand-LiU71",2800]
[null,null,null,"6.1B Reseed-Good Stand-LiU71",2500]
[null,null,null,"6.1C Reseed-Fair Stand-LiU71",1800]
[null,null,null,"6.1D Tame Pasture - Low Mgt-LIU71",1800]
[null,null,null,"6.1E Tame Pasture-Avg Mgt-LIU71",4000]
[null,null,null,"6.1F Tame Pasture-High Mgt-LIU71",7000]
[null,null,null,"1.1 Big and  Little Bluestem, Western Wheatgrass-LoL71",3750]
[null,null,null,"1.2 Big Bluestem, Wheatgrass-LoL71",2700]
[null,null,null,"1.3 Excessive Litter-LoL71",1650]
[null,null,null,"2.1  Blue Grama, Kentucky Bluegrass, Ragweed-LoL71",1650]
[null,null,null,"2.2 Smooth Bromegrass Invaded-LoL71",2250]
[null,null,null,"3.1A Re-Seeded Excellent Stand-LoL71",4000]
[null,null,null,"3.1B Range Seeding, Good Stand-LoL71",3000]
[null,null,null,"3.1C Range Seeding, Fair Stand-LoL71",2000]
[null,null,null,"3.1D Tame Pasture - Low Mgt-LoL71",2000]
[null,null,null,"3.1E Tame Pasture-Avg Mgt-LoL71",5000]
[null,null,null,"3.1F Tame Pasture-High Mgt-LoL71",8000]
[null,null,null,"3.2 Go-Back-LoL71",1000]
[null,null,null,"4.1 Eastern Redcedar Dominant-LoL71",1500]
[null,null,null,"4.2 Mixed Woody-LoL71",1000]
[null,null,null,"1.1 Big and Little Bluestem, Indiangrass-LoO71",4000]
[null,null,null,"1.2 Big and Little Bluestem-LoO71",3500]
[null,null,null,"1.3 Excessive Litter-LoO71",2000]
[null,null,null,"2.1 Blue Grama, Kentucky Bluegrass Sod-LoO71",2500]
[null,null,null,"2.2 Invaded Range-Smooth Bromegrass-LoO71",3000]
[null,null,null,"3.1A Re-Seeded Excellent Stand-LoO71",4250]
[null,null,null,"3.1B Re-Seeded Good Stand-LoO71",3750]
[null,null,null,"3.1C Re-Seeded Fair Stand-LoO71",3000]
[null,null,null,"3.1D Tame Pasture - Low Mgt-LoO71",2200]
[null,null,null,"3.1E Tame Pasture-Avg Mgt-LoO71",5500]
[null,null,null,"3.1F Tame Pasture-High Mgt-LoO71",9000]
[null,null,null,"3.2 Go-Back-LoO71",1000]
[null,null,null,"4.1 Eastern Redcedar -Deciduous Trees-LoO71",2000]
[null,null,null,"1.1 Big and Little Bluestem, Sideoats Grama-LoU71",3125]
[null,null,null,"1.2 Sideoats Grama, Blue Grama, Western Wheatgrass-LoU71",2600]
[null,null,null,"2.1 Blue Grama;, Kentucky Bluegrass, Ragweed-LoU71",1650]
[null,null,null,"3.1 Invaded Grass, Annuals-LoU71",700]
[null,null,null,"3.2 Invaded Grass, Smooth Brome-LoU71",2500]
[null,null,null,"3.3A Range Seeding, Excellent Stand-LoU71",3250]
[null,null,null,"3.3B Range Seeding, Good Stand-LoU71",2500]
[null,null,null,"3.3C Range Seeding, Fair Stand-LoU71",2000]
[null,null,null,"3.3D Tame Pasture - Low Mgt-LoU71",3000]
[null,null,null,"3.3E Tame Pasture-Avg Mgt-LoU71",4500]
[null,null,null,"3.3F Tame Pasture-High Mgt-LoU71",8000]
[null,null,null,"3.4 Go-Back-LoU71",1000]
[null,null,null,"4.1 Eastern Redcedar-LoU71",2000]
[null,null,null,"5.1-5.3 Deciduous Trees and Shrubs-LoU71",2500]
[null,null,null,"6.1 Mature Deciduous Trees-LoU71",2500]
[null,null,null,"1.1 Little and Big Bluestem, Sideoats Grama-LB71",2125]
[null,null,null,"1.2 Little Bluestem, Sideoats Grama-LB71",1750]
[null,null,null,"1.3 Blue & Hairy Grama, Forbs, Shrubs-LB71",1300]
[null,null,null,"1.4 Decadent Plants-LB71",1500]
[null,null,null,"2.1 Blue Grama-Kentucky Bluegrass-LB71",1000]
[null,null,null,"3.1 Annual Plants, Reduced Cover-LB71",600]
[null,null,null,"4.1 Eastern Redcedar-Brush Community-LB71",1200]
[null,null,null,"1.1 Mid-grass Salt Tolerant species, Alkali Sacaton, Saltgrass, Western Wheatgrass-SaSub71",2250]
[null,null,null,"1.2 Sedges-Inland Saltgrass-SaSub71",1200]
[null,null,null,"1.3 Excessive Litter-SaSub71",1500]
[null,null,null,"2.1 Shortgrass Sod-SaSub71",900]
[null,null,null,"3.1 Russian olive, Saltcedar, eastern redcedar",750]
[null,null,null,"4.1A Re-Seeded Excellent Stand-SaSub71",1750]
[null,null,null,"4.1B Re-Seeded Good Stand-SaSub71",1250]
[null,null,null,"4.1C Re-Seeded Fair Stand-SaSub71",900]
[null,null,null,"4.1D Tame Pasture - Low Mgt-SaSub71",1700]
[null,null,null,"4.1E Tame Pasture - Mod Mgt-SaSub71",3700]
[null,null,null,"4.1F Tame Pasture - High Mgt-SaSub71",5700]
[null,null,null,"4.2 Go-Back-SaSub71",500]
[null,null,null,"1.1 Sand and Little Bluestem, Prairie Sandreed-Sa71",2700]
[null,null,null,"1.2 Sand Bluestem, Switchgrass, Prairie Sandreed-Sa71",2000]
[null,null,null,"1.3 Prairie Sandreed, Sand Dropseed, Blue Grama, Ragweed-Sa71",1800]
[null,null,null,"1.4 Excessive Litter-Sa71",1900]
[null,null,null,"2.1 Grama, Sedge Sod-Sa71",1350]
[null,null,null,"3.1 Annuals, Pioneer Perennials-Sa71",500]
[null,null,null,"3.2 Active Blowout-Sa71",250]
[null,null,null,"4.1 Eastern Redcedar-Sa71",1350]
[null,null,null,"5.1 Go-Back Community-Sa71",700]
[null,null,null,"5.2A Re-Seed Excellent Stand-Sa71",3000]
[null,null,null,"5.2B Re-Seed Good Stand-Sa71",2500]
[null,null,null,"5.2C Re-Seed Fair Stand-Sa71",2000]
[null,null,null,"5.2D Tame Pasture-Low Mgt-Sa71",2000]
[null,null,null,"5.2E Tame Pasture-Mod Mgt-Sa71",3500]
[null,null,null,"5.2F Tame Pasture-High Mgt-Sa71",5000]
[null,null,null,"1.1 Sand and Little Bluestem, Prairie Sandreed-Sy71",2700]
[null,null,null,"1.2 Switchgrass, Prairie Sandreed, Little Bluestem-Sy71",2500]
[null,null,null,"1.3 Blue Grama, Western Wheatgrass-Sy71",1700]
[null,null,null,"1.4 Excessive Litter-Sy71",1900]
[null,null,null,"2.1 Kentucky Bluegrass, Ragweed-Sy71",1200]
[null,null,null,"3.1 Annuals, Pioneer Perennials-Sy71",500]
[null,null,null,"3.2 Active Blowout-Sy71",250]
[null,null,null,"4.1 Eastern Redcedar-Sy71",1350]
[null,null,null,"5.1 Go-Back Community-Sy71",750]
[null,null,null,"5.2A Re-Seed Excellent Stand-Sy71",3000]
[null,null,null,"5.2B Re-Seed Good Stand-Sy71",2500]
[null,null,null,"5.2C Re-Seed Fair Stand-Sy71",2000]
[null,null,null,"5.2D Tame Pasture-Low Mgt-Sy71",2000]
[null,null,null,"5.2E Tame Pasture-Mod Mgt-Sy71",3500]
[null,null,null,"5.2F Tame Pasture-High Mgt-Sy71",5000]
[null,null,null,"1.1  Big Bluestem, Indiangrass, Switchgrass-Sub71",5100]
[null,null,null,"1.2 Big & Little Bluestem, Switchgrass, Prairie Cordgrass-SubB71",4000]
[null,null,null,"2.1 Invaded range-Kentucky Bluegrass, Smooth Brome-Sub71",3250]
[null,null,null,"3.1 Reed Canarygrass-Creeping Foxtail-Sub71",3000]
[null,null,null,"4.1 Deciduous Trees, Eastern Redcedar-Sub71",1500]
[null,null,null,"5.1A Tame Pasture-Low Mgt-Sub71",2900]
[null,null,null,"5.1B Tame Pasture-Avg Mgt-Sub71",5500]
[null,null,null,"5.1C Tame Pasture-High Mgt-Sub71",7100]
[null,null,null,"1.1 Prairie Cordgrass, Reedgrass-WL71",4800]
[null,null,null,"2.1A Tame Pasture, Reed Canarygrass-Low Mgt-WL71",3000]
[null,null,null,"2.1B Tame Pasture, Reed Canarygrass Mgt-WL71",6500]
[null,null,null,"2.1C Tame Pasture, Reed Canarygrass, High Mgt-WL71",10000]
[null,null,null,"1. 1 Prairie Sandreed, Sand Bluestem, Little Bluestem-CS72",1900]
[null,null,null,"1.2  Sandhill Muhly, Sand Sagebrush, Soapweed-CS72",900]
[null,null,null,"1.3 Sand Dropseed, Annuals-CS72",375]
[null,null,null,"1.1 Dry Phase: Western Wheatgrass, Buffalograss, Blue Grama-CD72",2000]
[null,null,null,"1.2 Inundation or Saturation Phase:  Spikerush, Barnyard Grass, Little Barley-CD72",1500]
[null,null,null,"1.3  Annuals-Bare Ground, CD72",150]
[null,null,null,"2.2 Seeded, CD72",2000]
[null,null,null,"1.1 Sideoats Grama, Little Bluestem-GH72",1200]
[null,null,null,"1.2 Blue Grama, Remnant Tall and Mid Grasses-GH72",600]
[null,null,null,"2.1 Sod Bound Blue Grama, Threadleaf Sedge-GH72",400]
[null,null,null,"1.1 Little Bluestem, Sideoats Grama, Blue Grama, Western Wheatgrass-LS72",1650]
[null,null,null,"1.2 Sideoats Grama, Blue Grama-LS72",1250]
[null,null,null,"1.3 Little Bluestem, Sideoats Grama, Soapweed Yucca-LS72",800]
[null,null,null,"2.1 Blue Grama, Buffalograss-LS72",1200]
[null,null,null,"3.1A Range Seeding, Natives, Excellent Stand-LS72",2000]
[null,null,null,"3.1B Range Seeding, Good Stand-LS72",1650]
[null,null,null,"3.1C Range Seeding, Fair Stand-LS72\n",1200]
[null,null,null,"3.1D Tame Pasture-Low Mgt-LS72",1000]
[null,null,null,"3.1E Tame Pasture-Mid Mgt-LS72",2000]
[null,null,null,"3.1F Tame Pasture-High Mgt-LS72",3000]
[null,null,null,"3.1G Tame Pasture-Irrigated, Low Mgt-LS72",5000]
[null,null,null,"3.1H Tame Pasture-Irrigated, High Mgt-LS72",7000]
[null,null,null,"3.2 Go-Back Three-awn, Annuals-LS72",400]
[null,null,null,"1.1 Big Bluestem, Switchgrass, Western Wheatgrass, Indiangrass-LL72",3500]
[null,null,null,"1.2 Western Wheatgrass, Sideoats Grama, Blue Grama-LL72",3000]
[null,null,null,"1.3 Blue Grama, Buffalograss, Western Wheatgrass, Sand Dropseed, Threeawn-LL72",1300]
[null,null,null,"2.1 Sod-bound Blue Grama, Buffalograss-LL72\n",700]
[null,null,null,"3.1 Go-Back-LL72",500]
[null,null,null,"3.2A Range Seeding, Excellent Stand-LL72",4000]
[null,null,null,"3.2B Range Seeding, Good Stand-LL72",2500]
[null,null,null,"3.2C Range Seeding, Fair Stand-LL72",2000]
[null,null,null,"3.2D Tame Pasture-Low Mgt-LL72",1600]
[null,null,null,"3.2E Tame Pasture-Mid Mgt-LL72",3000]
[null,null,null,"3.2F Tame Pasture-High Mgt-LL72",4700]
[null,null,null,"4.4 Tame Pasture-Irrigated, Low Mgt-LL72",4300]
[null,null,null,"4.5 Tame Pasture-Irrigated, Mod Mgt-LL72",8000]
[null,null,null,"4.6 Tame Pasture-Irrigated, High Mgt.-LL72",12000]
[null,null,null,"1.1 Short and mid warm season grasses, cool season grasses-LT72",1700]
[null,null,null,"1.2 Shortgrass and mid-grass Community-LT72",1500]
[null,null,null,"2.1 Blue Grama-Buffalograss Sod-LT72",1200]
[null,null,null,"3.1 Go-Back Community-LT72",500]
[null,null,null,"3.2A Range Seeding, Excellent Stand-LT72",2500]
[null,null,null,"3.2B Range Seeding, Good Stand-LT72",1700]
[null,null,null,"3.2C Range Seeding, Fair Stand-LT72",1500]
[null,null,null,"3.2D Tame Pasture-Low Mgt-LT72",1400]
[null,null,null,"3.2E Tame Pasture-Mod Mgt-LT72",4300]
[null,null,null,"3.2F Tame Pasture-High Mgt-LT72",7100]
[null,null,null,"3.2G Tame Pasture-Irrigated-Low-LT72",4300]
[null,null,null,"3.2H Tame Pasture-Irrigated-Mod-LT72",8000]
[null,null,null,"3.2I Tame Pasture-Irrigated-High-LT72",12000]
[null,null,null,"1.1 Little Bluestem, Sideoats Grama, Big Bluestem-LB72",1900]
[null,null,null,"1.2  Blue Grama, Threadleaf Sedge, Small Soapweed-LB72",1300]
[null,null,null,"1.1 Sand and Little Bluestem, Prairie Sandreed, Switchgrass-RS72",2000]
[null,null,null,"1.2  Blue Grama, Little Bluestem, Sand Sagebrush-RS72",1000]
[null,null,null,"2.1 Sand Sagebrush, Sand Dropseed, Annuals-RS72",800]
[null,null,null,"3.1 Go Back-RS72\n",175]
[null,null,null,"3.2A Range Seeding, Excellent Stand-RS72",2250]
[null,null,null,"3.2B Range Seeding, Good Stand-RS72",1750]
[null,null,null,"3.2C Range Seeding, Fair Stand-RS72",1250]
[null,null,null,"3.2D Tame Pasture-Low Mgt-Irrigated-RS72",4000]
[null,null,null,"3.2E Tame Pasture-Mod Mgt-Irrigated-RS72",8000]
[null,null,null,"3.2F Tame Pasture-High Mgt-Irrigated-RS72",13500]
[null,null,null,"1.1 Alkali Sacaton, Western Wheatgrass, Inland Saltgrass-SaLo72",2200]
[null,null,null,"1.2 Inland Saltgrass, Western Wheatgrass-SaLo72",1800]
[null,null,null,"2.1  Inland Saltgrass Sod-SaLo72",600]
[null,null,null,"3.1A  Range Seeding, Excellent Stand-SaLo72",2200]
[null,null,null,"3.1B Range Seeding, Good Stand-SaLo72",1700]
[null,null,null,"3.1C Range Seeding, Fair Stand-SaLo72",1250]
[null,null,null,"3.2 Go-Back, Three-awn, Sand Dropseed, Annuals-SaLo72",400]
[null,null,null,"1.1 Alkali Sacaton, Western Wheatgrass, Inland Saltgrass-SS72",3000]
[null,null,null,"1.2 Western Wheatgrass, Inland Saltgrass",2200]
[null,null,null,"2.1 Inland Saltgrass Sod-SS72",1500]
[null,null,null,"3.1A Range Seeding, Excellent Stand-SS72",3000]
[null,null,null,"3.1B  Range Seeding, Good Stand-SS72",2250]
[null,null,null,"3.1C Range Seeding, Fair Stand-SS72",1500]
[null,null,null,"3.2 Go-Back Community  Annuals-SS72",300]
[null,null,null,"1.1  Sand and Little Bluestem, Switchgrass, Sideoats Grama-SyLo72",2400]
[null,null,null,"1.2  Sand Dropseed, Western Wheatgrass-SyLo72",2200]
[null,null,null,"1.3  Blue Grama, Sand Sagebrush-SyLo72",1500]
[null,null,null,"2.1 Shrub Community,  Sand Sagebrush-SyLo72",1000]
[null,null,null,"3.1A Range Seeding, Excellent Stand-SyLo72",2500]
[null,null,null,"3.1B Range Seeding, Good Stand-SyLo72",2000]
[null,null,null,"3.1C Range Seeding, Fair Stand-SyLo72",1500]
[null,null,null,"3.2: Go-back Community-SyLo72\n",400]
[null,null,null,"1.1  Sand Bluestem, Prairie Sandreed, Blue Grama-SP72",1800]
[null,null,null,"1.2 Sand Dropseed, Blue Grama-SP72",1100]
[null,null,null,"1.3 Fendler Threeawn, Sand Dropseed, Annuals-SP72",425]
[null,null,null,"2.1 Blue Grama Sod-SP72",850]
[null,null,null,"3.1A Range Seeding, Excellent Stand-SP72",2500]
[null,null,null,"3.1B Range Seeding, Good Stand-SP72",2000]
[null,null,null,"3.1C Range Seeding, Fair Stand-SP72",1500]
[null,null,null,"3.1D Tame Pasture-Low Mgt-Irrigated-SP72",4000]
[null,null,null,"3.1E Tame Pasture-Mod Mgt-Irrigated-SP72",7000]
[null,null,null,"3.1F Tame Pasture-High Mgt-Irrigated-SP72",12000]
[null,null,null,"3.2 Go-back Community-SP72",425]
[null,null,null,"1.1 Little Bluestem, Sideoats Grama-ShLi72",1200]
[null,null,null,"1.2 Blue Grama, Buffalograss, Threadleaf Sedge, Threeawn-ShLi72",700]
[null,null,null,"1.1 Big Bluestem, Switchgrass, Indiangrass-Sub72",4000]
[null,null,null,"1.2 Cool Season Grasses, Remnant Warm seasons-Sub72",1700]
[null,null,null,"2.1  Kentucky Bluegrass, Smooth Bromegrass, Western Wheatgrass, Sedges-Sub72",1500]
[null,null,null,"3.1 Russian Olive, Eastern Redcedar, Salt Cedar, Cottonwood-Sub72",1000]
[null,null,null,"4.1A Range Seeding, Excellent Stand-Sub72",5000]
[null,null,null,"4.1B Range Seeding, Good Stand-Sub72",4000]
[null,null,null,"4.1C Range Seeding, Fair Stand",2000]
[null,null,null,"4.1D Tame Pasture-Low Mgt-Sub72",1400]
[null,null,null,"4.1E Tame Pasture-Mod Mgt-Sub72",3100]
[null,null,null,"4.1F Tame Pasture-High Mgt-Sub72",4900]
[null,null,null,"4.2 Go-Back Russian Thistle, Kochia, Foxtail Barley, Annual Bromes-Sub72",750]
[null,null,null,"1.1 Big Bluestem, Sideoats Grama, Little Bluestem, Indiangrass, Western Wheatgrass-TS72",2500]
[null,null,null,"1.2 Western Wheatgrass, Sideoats Grama, Blue Grama-TS72",2000]
[null,null,null,"1.3 Blue Grama, Buffalograss, Western Wheatgrass, Sand Dropseed, Threeawn-TS72",1200]
[null,null,null,"2.1 Blue Grama, Buffalograss Sod-TS72",700]
[null,null,null,"3.1 Go-Back Community-TS72",500]
[null,null,null,"3.2A Range Seeding, Excellent Stand-TS72",3000]
[null,null,null,"3.2B Range Seeding, Good Stand-TS72",2250]
[null,null,null,"3.2C Range Seeding, Fair Stand-TS72",1500]
[null,null,null,"1.1 Big and Little Blue, Indiangrass, Sideoats Grama -BS73",2500]
[null,null,null,"1.2 Sideoats Grama, Little Bluestem-BS73",2000]
[null,null,null,"1.3 Western Wheat, Blue grama, Buffalograss-BS73",1000]
[null,null,null,"2.1 Woody State: Easter Redcedar and Honey Locust-BS73",800]
[null,null,null,"3.1A Range Seeding, Excellent Stand-BS72",2500]
[null,null,null,"3.1B Range Seeding, Good Stand-BS72",2000]
[null,null,null,"3.1C Range Seeding, Fair Stand-BS72\n",1750]
[null,null,null,"3.2 Go-Back Three-awn, Annuals-BS72",500]
[null,null,null,"1. 1 Big Bluestem, Sideoats Grama, Switchgrass, Western Wheatgrass-CT73",3500]
[null,null,null,"1.2 Western Wheatgrass, Blue Grama, Buffalograss, Sideoats Grama-CT73",2000]
[null,null,null,"1.3  Buffalograss, Western Ragweed, Little Barley - CT73",1000]
[null,null,null,"2.1 Woody State: Easter Redcedar and Honey Locust-CT73",1000]
[null,null,null,"3.1A Range Seeding, Excellent Stand-CT73",3500]
[null,null,null,"3.1B Range Seeding, Good Stand-CT73",2750]
[null,null,null,"3.1C Range Seeding, Fair Stand-CT73\n",2000]
[null,null,null,"3.2 Go-Back Three-awn, Annuals-CT73",350]
[null,null,null,"1.1 Dry Phase: Western Wheatgrass, Sedges, Rushes, Blue Grama, Buffalograss-CUD73",2000]
[null,null,null,"1.2 Inundation or Saturation Phase: Spikerush, Western Wheat-CUD73",1000]
[null,null,null,"1.3  Annuals, Bare Ground-CUD73",500]
[null,null,null,"2.1 Threeawns, Annual Grasses",500]
[null,null,null,"2.2A Range Seeding, Excellent Stand-CUD73",2250]
[null,null,null,"2.2B Range Seeding, Good Stand-CUD73",1750]
[null,null,null,"2.2C Range Seeding, Fair Stand-CUD73",1250]
[null,null,null,"2.2D Tame Pasture-Low Mgt-CUD73",2900]
[null,null,null,"2.2E Tame Pasture-Mid Mgt-CUD73",7000]
[null,null,null,"2.2F Tame Pasture-High Mgt-CUD73",10000]
[null,null,null,"1.1 Big Bluestem, Little Bluestem, Sideoats Grama -GH73",2000]
[null,null,null,"1.2 Sideoats, Little Bluestem-GH73",1350]
[null,null,null,"1.3 Blue Grama, Sideoats Grama, Brush-GH73",1000]
[null,null,null,"2.1 Eastern Redcedar, Trees, Brush-GH73",500]
[null,null,null,"3.1 Blue and Hairy Grama, Buffalograss-GH73",700]
[null,null,null,"1.1 Big and Little Bluestem, Sideoats-LS73",2600]
[null,null,null,"1.2 Little Bluestem, Sideoats Grama, Blue Grama-LS73",2200]
[null,null,null,"1.3 Blue Grama, Western Wheatgrass, Sideoats Grama-LS73",1500]
[null,null,null,"4.1  Blue Grama, Buffalograss-LS73",800]
[null,null,null,"3.1 Eastern Redcedar, Honey Locust, Brush-LS73",500]
[null,null,null,"2.1A Range Seeding, Excellent Stand-LS73",2750]
[null,null,null,"2.1B Range Seeding, Good Stand-LS73",2250]
[null,null,null,"2.1C Range Seeding, Fair Stand-LS73\n",1750]
[null,null,null,"2.1D Tame Pasture-Low Mgt-LS73",1800]
[null,null,null,"2.1 E Tame Pasture-Mid Mgt-LS73",4000]
[null,null,null,"2.1F Tame Pasture-High Mgt-LS73",9000]
[null,null,null,"1.1 Big and Little Bluestem, Switchgrass, Indiangrass, Eastern Gamagrass-LF73",4500]
[null,null,null,"1.2 Western Wheat, Tall Grass-Remnants, Composite Dropseed-LF73",3000]
[null,null,null,"1.3 Blue Grama, Buffalograss, Western Wheat, Composite Dropseed-LS73",2000]
[null,null,null,"2.1 Eastern Redcedar, Honey Locust-LF73",1000]
[null,null,null,"3.1A Range Seeding, Excellent Stand-LF73",3250]
[null,null,null,"3.1B Range Seeding, Good Stand-LF73",2750]
[null,null,null,"3.1C Range Seeding, Fair Stand-LF73\n",2000]
[null,null,null,"3.3 Tame Pasture-Low Mgt-LF73",2200]
[null,null,null,"3.3 Tame Pasture-Mid Mgt-LF73",5500]
[null,null,null,"3.3 Tame Pasture-High Mgt-LF73",9000]
[null,null,null,"3.12 Go-Back Three-awn, Silver Beardgrass-Annual Bromes-LF73",500]
[null,null,null,"1.1 Big and Little Bluestem, Sideoats-LP73",3000]
[null,null,null,"1.2 Sideoats Grama, Blue Grama, Western Wheatgrass, Little Bluestem-LP73",2300]
[null,null,null,"1.3 Blue Grama, Buffalo, Western Wheatgrass, Sideoats Grama-LP73",1800]
[null,null,null,"2.1 Blue Grama, Buffalograss-LP73",800]
[null,null,null,"2.1 Eastern Redcedar, Honey Locust-LP73",800]
[null,null,null,"3.1A Range Seeding, Excellent Stand-LP73",3250]
[null,null,null,"3.1B Range Seeding, Good Stand-LP73",2750]
[null,null,null,"3.1C Range Seeding, Fair Stand-LP73\n",2000]
[null,null,null,"3.1D Tame Pasture-Low Mgt-LP73",2000]
[null,null,null,"3.1F Tame Pasture-Mid Mgt-LP73",5000]
[null,null,null,"3.1G Tame Pasture-High Mgt-LP73",8000]
[null,null,null,"3.1 Go-Back Three-awn, Silver Beardgrass, Annual Bromes-LP73",500]
[null,null,null,"1.1 Big and Little Bluestem, Indiangrass, Switchgrass-LT73",3500]
[null,null,null,"1.2 Western Wheatgrass, Composite Dropseed, Remnant Tall Grass-LT73",2500]
[null,null,null,"1.3 Blue Grama, Buffalograss, Western Wheatgrass-LT73",2000]
[null,null,null,"2.1 Eastern Redcedar, Honey Locust-LT73",1000]
[null,null,null,"3.1A Range Seeding, Excellent Stand-LT73",3750]
[null,null,null,"3.1B Range Seeding, Good Stand-LT73",3000]
[null,null,null,"3.1C Range Seeding, Fair Stand-LT73\n",2500]
[null,null,null,"3.1D Tame Pasture-Low Mgt-LT73",2000]
[null,null,null,"3.1F Tame Pasture-Mid Mgt-LT73",5000]
[null,null,null,"3.1G Tame Pasture-High Mgt-LT73",8000]
[null,null,null,"3.2 Go-Back Three-awn, Silver Beardgrass, Annual Bromes-LT73",750]
[null,null,null,"1.1 Little and Big Bluestem, Sideoats Grama, Switchgrass-LH73",2200]
[null,null,null,"1.2 Little Bluestem, Blue Grama-LH73",2000]
[null,null,null,"1.3 Blue and Hairy Grama, Annuals, Forbs, Shrubs-LH73",1500]
[null,null,null,"2.1 Eastern Redcedar, Honey Locust-LH73",1000]
[null,null,null,"1.1 Sand and Little Bluestem, Indiangrass, Switchgrass-SF73",3500]
[null,null,null,"1.2 Western Wheatgrass, Little Bluestem, Sideoats Grama-SF73",2500]
[null,null,null,"1.3 Western Wheatgrass, Cuman (Western) Ragweed-SF73",2000]
[null,null,null,"2.1 Eastern Redcedar, Honey Locust-SF73",1000]
[null,null,null,"3.1A Range Seeding, Excellent Stand-SF73",3750]
[null,null,null,"3.1B Range Seeding, Good Stand-SF73",3000]
[null,null,null,"3.1C Range Seeding, Fair Stand-SF73\n",2500]
[null,null,null,"3.3 Tame Pasture-Low Mgt-SF73",1800]
[null,null,null,"3.3 Tame Pasture-Mid Mgt-SF73",4000]
[null,null,null,"3.3 Tame Pasture-High Mgt-SF73",7000]
[null,null,null,"3.2 Go-Back Three-awn, Silver Beardgrass, Annual Bromes-SF73",750]
[null,null,null,"1.1  Sand and Little Bluestem, Sideoats Grama-SP73",2100]
[null,null,null,"1.2 Sideoats Grama, Little Bluestem, Blue Grama-SP73",1800]
[null,null,null,"1.3  Sand Sagebrush, Blue Grama, Remnant Tall and Mid-Grasses-SP73",900]
[null,null,null,"2.1 Sand sagebrush, eastern Redcedar-SP73",750]
[null,null,null,"3.1A Range Seeding, Excellent Stand-SP73",2250]
[null,null,null,"3.1B Range Seeding, Good Stand-SP73",1750]
[null,null,null,"3.1C Range Seeding, Fair Stand-SP73",1250]
[null,null,null,"3.1D Tame Pasture-Low Mgt-SP73",2000]
[null,null,null,"3.1E Tame Pasture-Mod Mgt-SP73",3500]
[null,null,null,"3.1F Tame Pasture-High Mgt-SP73",5500]
[null,null,null,"3.1G Tame Pasture-Irrigated, Low Mgt-SP73",4300]
[null,null,null,"3.1F Tame Pasture-Irritated, Medium Mgt-SP73",10000]
[null,null,null,"3.1F Tame Pasture-Irrigated, High Mgt-SP73",15000]
[null,null,null,"3.2 Go-back Community-Threeawn-Annual Bromes-Silver Bluestem-SP73",500]
[null,null,null,"1.1 Little and Big Bluestem, Sideoats Grama, Indiangrass, Switchgrass-ShLi73",1750]
[null,null,null,"1.2 Little Blue, Sideoats-ShLi73",1650]
[null,null,null,"1.3 Blue Grama, Remnant Little Bluestem-ShLi74",1150]
[null,null,null,"2.1 Eastern Redcedar, Honey Locust-ShLi73",850]
[null,null,null,"3.1 Blue Grama, Buffalograss-ShLi73",875]
[null,null,null,"1.1 Big Bluestem, Eastern Gamagrass, Switchgrass, Prairie Cordgrass, Indiangrass-Sub73",4750]
[null,null,null,"1.2 Western Wheatgrass, Foxtail Barley, Little Bluestem-Sub73",3900]
[null,null,null,"2.1 Western Wheatgrass, Kentucky Bluegrass, Foxtail Barley-Sub73",1700]
[null,null,null,"3.1 Woody State  Russian Olive, Eastern Redcedar, Salt Cedar, Cottonwood-Sub73",1000]
[null,null,null,"4.1A Range Seeding, Excellent Stand-Sub73",5000]
[null,null,null,"4.1B Range Seeding, Good Stand-Sub73",4250]
[null,null,null,"4.1C Range Seeding, Fair Stand-Sub73",3500]
[null,null,null,"4.2 Go-Back Russian Thistle, Kochia, Foxtail Barley, Annual Bromes-Sub73",700]
[null,null,null,"5.1A Tame Pasture-Low Mgt-Sub73",2900]
[null,null,null,"5.1B Tame Pasture-Mod Mgt-Sub73",6000]
[null,null,null,"5.1C Tame Pasture-High Mgt-Sub73",10000]
[null,null,null,"1.1. Big and Little Bluestem, Switchgrass, Indiangrass-CP75",3385]
[null,null,null,"1.2 Big and Little Bluestem CP75",3100]
[null,null,null,"1.3 Cool season and warm season short grasses CP75",2250]
[null,null,null,"1.4 Excessive Litter CP75",2000]
[null,null,null,"1.5 Ephemeral Forbs CP75",1500]
[null,null,null,"2.1 Blue grama, Tall (Composite) Dropseed, Kentucky Bluegrass CP75",2000]
[null,null,null,"2.2 Invaded range-Smooth Bromegrass-CP75",2550]
[null,null,null,"3.1A Range Seeding, Excellent Stand-CP75",3500]
[null,null,null,"3.1B Range Seeding, Good Stand-CP75",3000]
[null,null,null,"3.1C Range Seeding-Poor Stand-CP75",2500]
[null,null,null,"3.1D Tame Pasture-Low Mgmt-CP75",3000]
[null,null,null,"3.1E Tame Pasture-Med. Mgmt-CP75",6000]
[null,null,null,"3.1F Tame Pasture-High Mgmt-CP75",9000]
[null,null,null,"3.1G Tame Pasture-Irrigated-Low Mgmt-CP75",6500]
[null,null,null,"3.1H Tame Pasture-Irrigated-High Mgmt-CP75",15000]
[null,null,null,"1.1 - Saturated Soil Community:  Arrowhead, Burreed, Native Cattail, Soft stem Bulrush-CUD75",8000]
[null,null,null,"1.2 Moist Soil Perennials-Spikerush, Sedges, Rushes, Western Wheatgrass, Switchgrass-CUD75",6000]
[null,null,null,"1.3 Moist Soil Annuals:  Smartweed, Barnyard grass, bidens, fall panicum, coreopsis, ragweed, sumpweed-CUD75",3000]
[null,null,null,"2.1 Grassy Invaded - Reed Canarygrass-CUD75",12000]
[null,null,null,"3.1 Cattail-Bulrush Invaded State-CUD 75",12000]
[null,null,null,"1.1 Little and Big Bluestem, Sideoats Grama-GH75",2000]
[null,null,null,"1.2 Little Bluestem, Sideoats Grama-GH75",1500]
[null,null,null,"1.3 Excessive Litter-GH75",1500]
[null,null,null,"1.4 Ephemeral Forbs-GH75",1350]
[null,null,null,"2.1 Blue Grama, Kentucky Bluegrass, Tall (composite) Dropseed-GH75",750]
[null,null,null,"2.2 Smooth Brome, Invaded-GH75",1500]
[null,null,null,"3.1 Eastern Redcedar >15% Canopy-GH75",500]
[null,null,null,"1.1 Little and Big Bluestem, Sideoats Grama-LLS75",2625]
[null,null,null,"1.2 Little Bluestem , Sideoats Grama-LLS75",2200]
[null,null,null,"1.3 Blue and Sideoats Grama, Composite (Tall) Dropseed-LLS75",1800]
[null,null,null,"1.4 Excessive Litter LLS75",1800]
[null,null,null,"1.4 Ephemeral Forbs-LLS75",1800]
[null,null,null,"2.1 Blue Grama, Kentucky Bluegrass, Tall (composite) Dropseed-LLS75",700]
[null,null,null,"2.2 Invaded range-Smooth Brome-LLS75",1800]
[null,null,null,"3.1A Range Seeding, Excellent Stand-LLS75",3000]
[null,null,null,"3.1B Range Seeding, Good Stand-LLS75",2750]
[null,null,null,"3.1C Range Seeding, Fair Stand-LLS75",2000]
[null,null,null,"3.1D Tame Pasture-Low Mgt-LLS75",3000]
[null,null,null,"3.1E Tame Pasture-Mid Mgt-LLS75",6000]
[null,null,null,"3.1F Tame Pasture-High Mgt-LLS75",9000]
[null,null,null,"3.1 Threeawns, Annual Grasses-LLS75",900]
[null,null,null,"4.1 Eastern Redcedar, Honey Locust-LLS75",1500]
[null,null,null,"1.1 Big and Little Bluestem, Indiangrass-LF75",4000]
[null,null,null,"1.2 Blue grama, Cool Season, Remnant Tall grass-LF75",3500]
[null,null,null,"1.3 Excessive Litter LF75",3000]
[null,null,null,"1.4 Ephemeral Forbs-LF75",1800]
[null,null,null,"2.1 Blue Grama, Kentucky Bluegrass, Tall (composite) Dropseed-LF75",2500]
[null,null,null,"2.2 Invaded range-Smooth Brome-LF75",2750]
[null,null,null,"3.1A Range Seeding, Excellent Stand-LF75",4250]
[null,null,null,"3.1B Range Seeding, Good Stand-LF75",3000]
[null,null,null,"3.1C Range Seeding, Fair Stand-LF75",2500]
[null,null,null,"3.1D Tame Pasture-Low Mgt-LF75",3500]
[null,null,null,"3.1E Tame Pasture-Mid Mgt-LF75",7500]
[null,null,null,"3.1F Tame Pasture-High Mgt-LF75",11000]
[null,null,null,"3.1G Tame Pasture-Irrigated-Low Mgt-LF75",7000]
[null,null,null,"3.1E Tame Pasture-Irrigated-High Mgt-LF75",15000]
[null,null,null,"3.2 Threeawns, Annual Grasses-LF75",1000]
[null,null,null,"4.1 Eastern Redcedar, Honey Locust-LF75",2500]
[null,null,null,"1.1 Big and Little Blue, Indiangrass-LP75",3700]
[null,null,null,"1.2 Blue grama, Little Bluestem-LP75",3200]
[null,null,null,"1.3 Blue grama, Cool Season, Remnant Mid-grass-LP75",2750]
[null,null,null,"1.4 Excessive Litter LP75",3000]
[null,null,null,"1.5 Ephemeral Forbs-LF75",2500]
[null,null,null,"2.1 Blue Grama, Kentucky Bluegrass, Tall (composite) Dropseed-LP75",2500]
[null,null,null,"2.2 Invaded range-Smooth Brome-LP75",2800]
[null,null,null,"3.1A Range Seeding, Excellent Stand-LP75",3900]
[null,null,null,"3.1B Range Seeding, Good Stand-LP75",3250]
[null,null,null,"3.1C Range Seeding, Fair Stand-LP75",2750]
[null,null,null,"3.1D Tame Pasture-Low Mgt-LP75",3000]
[null,null,null,"3.1E Tame Pasture-Mid Mgt-LP75",5750]
[null,null,null,"3.1F Tame Pasture-High Mgt-LP75",9000]
[null,null,null,"3.1G Tame Pasture-Irrigated-High Mgt-LP75",7000]
[null,null,null,"3.1H Tame Pasture-Irrigated-High Mgt-LP75",15000]
[null,null,null,"3.2 Threeawns, Annual Grasses-LP75",1300]
[null,null,null,"4.1 Eastern Redcedar, Honey Locust-LP75",2500]
[null,null,null,"1.1 Big and Little Bluestem, Indiangrass-LT75",4000]
[null,null,null,"1.2 Big and Little Bluestem-LT75",3500]
[null,null,null,"1.3 Excessive Litter LT75",3000]
[null,null,null,"1.4 Ephemeral Forbs-LT75",3000]
[null,null,null,"2.1 Blue Grama, Kentucky Bluegrass, Tall (composite) Dropseed-LT75",2500]
[null,null,null,"2.2 Invaded Range-Smooth Brome-LT75",2800]
[null,null,null,"3.1 Threeawns, Annual Grasses-LT75",1500]
[null,null,null,"3.2A Range Seeding, Excellent Stand-LT75",4250]
[null,null,null,"3.2B Range Seeding, Good Stand-LT75",3750]
[null,null,null,"3.2C Range Seeding, Fair Stand-LT75",2500]
[null,null,null,"3.2D Tame Pasture-Low Mgt-LT75",3250]
[null,null,null,"3.2E Tame Pasture-Mid Mgt-LT75",7000]
[null,null,null,"3.2F Tame Pasture-High Mgt-LT75",10000]
[null,null,null,"3.2G Tame Pasture-Irrigated-Low Mgt-LT75",7000]
[null,null,null,"3.2H Tame Pasture-Irrigated-High Mgt-LT75",15000]
[null,null,null,"4.1 Mixed Woody--LT75",2500]
[null,null,null,"4.2 Eastern Redcedar, Honey Locust-LT75",2000]
[null,null,null,"1.1 Big and Little Bluestem, Indiangrass-LB75",2125]
[null,null,null,"1.2 Big and Little Bluestem-LB75",1750]
[null,null,null,"1.3 Blue Grama, Sideoats Grama, Composite (Tall) Dropseed-LB75",1300]
[null,null,null,"1.4 Excessive Litter LB75",1750]
[null,null,null,"1.5 Ephemeral Forbs-LB75",1250]
[null,null,null,"2.1 Blue Grama, Kentucky Bluegrass, Tall (composite) Dropseed-LB75",1000]
[null,null,null,"2.2 Smooth Brome, Invaded-LB75",1250]
[null,null,null,"3.1 Eastern Redcedar, Brush-LB75",1000]
[null,null,null,"1.1 Alkali Sacaton, Blue Grama, Wheatgrasses, Indiangrass-SD75",3500]
[null,null,null,"1.2 Blue Grama, Inland Saltgrass, Bluegrass-SD75",1500]
[null,null,null,"1.1 Sand and Little Bluestem, Indiangrass-Sa75",2500]
[null,null,null,"1.2 Western Wheatgrass, Sideoats Grama, Sedges-Sa75",2000]
[null,null,null,"1.3 Blue Grama, Western Wheatgrass Sand paspalum, Sand dropseed-Sa75",1500]
[null,null,null,"1.4 Excessive Litter-Sa75",1750]
[null,null,null,"1.5 Ephemeral Forbs-Sa75",1500]
[null,null,null,"2.1 Western Wheatgrass, Smooth brome Blue Grama, Sand Dropseed-Sa75",1500]
[null,null,null,"2.2 Invaded range-Smooth Brome-Sa75",2000]
[null,null,null,"3.1A Range Seeding, Excellent Stand-Sa75",2750]
[null,null,null,"3.1B Range Seeding, Good Stand-Sa75",2250]
[null,null,null,"3.1C Range Seeding, Fair Stand-Sa75",1750]
[null,null,null,"3.1D Tame Pasture-Low Mgt-Sa75",2900]
[null,null,null,"3.1E Tame Pasture-Mod Mgt-Sa75",5000]
[null,null,null,"3.1F Tame Pasture-High Mgt-Sa75",7000]
[null,null,null,"3.1G Tame Pasture-Low Mgt-Irrigated-Sa75",4300]
[null,null,null,"3.1H Tame Pasture-High Mgt-Irrigated-Sa75",15000]
[null,null,null,"3.2 Go-back Community-Threeawn-Annual Bromes-Silver Bluestem-Sa75",1000]
[null,null,null,"1.1 Sand and Little Bluestem, Indiangrass-Sy75",2500]
[null,null,null,"1.2 Western Wheatgrass, Sideoats Grama, Sedges-Sy75",2000]
[null,null,null,"1.3 Blue Grama, Western Wheatgrass, Sand Paspalum, Sand Dropseed-Sy75",1500]
[null,null,null,"1.4 Excessive Litter-Sy75",1750]
[null,null,null,"1.5 Ephemeral Forbs-Sy75",1500]
[null,null,null,"2.1 Western wheat, Smooth Brome Blue Grama, Sand Dropseed-Sy75",1500]
[null,null,null,"2.2 Invaded Range-Smooth Brome-Sy75",2000]
[null,null,null,"3.1A Range Seeding, Excellent Stand-Sy75",2750]
[null,null,null,"3.1B Range Seeding, Good Stand-Sy75",2250]
[null,null,null,"3.1C Range Seeding, Fair Stand-Sy75",1750]
[null,null,null,"3.1D Tame Pasture-Low Mgt-Sy75",2900]
[null,null,null,"3.1F Tame Pasture-Mod Mgt-Sy75",5000]
[null,null,null,"3.1G Tame Pasture-High Mgt-Sy75",7000]
[null,null,null,"3.1H Tame Pasture-Low Mgt-Irrigated-Sy75",4300]
[null,null,null,"3.1I Tame Pasture-High Mgt-Irrigated-Sy75",15000]
[null,null,null,"3.2 Go-back Community-Threeawn-Annual Bromes-Silver Bluestem-Sa75",1000]
[null,null,null,"4.1 Eastern Redcedar, Brush-Sy75",1250]
[null,null,null,"1.1 Sand and Little Blue, Indiangrass, Switchgrass-SyF75",3500]
[null,null,null,"1.2 Western Wheat, Sideoats Grama, Sedges-SyF75",2500]
[null,null,null,"1.3 Blue grama, Western, Sand dropseed-SyF75",2000]
[null,null,null,"1.4 Excessive Litter-SyF75",2000]
[null,null,null,"1.5 Ephemeral Forbs-SyF75",2000]
[null,null,null,"2.1 Kentucky bluegrass, Composite and/or sand dropseed-SyF75",1500]
[null,null,null,"2.2 Invaded range-Smooth Brome-SyF75",2750]
[null,null,null,"3.1A Range Seeding, Excellent Stand-SyF75",3750]
[null,null,null,"3.1B Range Seeding, Good Stand-SyF75",3000]
[null,null,null,"3.1C Range Seeding, Fair Stand-SyF75",2500]
[null,null,null,"3.1D Tame Pasture-Low Mgt-Dryland-SyF75",2500]
[null,null,null,"3.1E Tame Pasture-Mod Mgt-Dryland-SyF75",5750]
[null,null,null,"3.1F Tame Pasture-High Mgt-Dryland-SyF75",9000]
[null,null,null,"3.1G Tame Pasture-Low Mgt-Irrigated-SFy75",9000]
[null,null,null,"3.1H Tame Pasture-High Mgt-Irrigated-SyF75",15000]
[null,null,null,"3.2 Go-back Community-Threeawn-Annual Bromes-Silver Bluestem-SyF75",1250]
[null,null,null,"4.1 Eastern Redcedar, Honey Locust Brush-SyF75",1500]
[null,null,null,"1.1 Little and Big Bluestem, Sideoats Grama-ShLi75",2400]
[null,null,null,"1.2 Little Bluestem, Sideoats Grama-ShLi75",2250]
[null,null,null,"1.3 Excessive Litter-ShLi75",2250]
[null,null,null,"1.4  Ephemeral Forbs-ShLi75",1250]
[null,null,null,"2.1  Blue grama, Smooth brome, Sand dropseed-ShLi75",1250]
[null,null,null,"2.2 Smooth Brome, Invaded-ShLi75",1750]
[null,null,null,"3.1 Eastern Redcedar, Honey Locust-ShLi75",1000]
[null,null,null,"1.1 Big Bluestem, Indiangrass, Switchgrass, Prairie Cordgrass-Sub75",5800]
[null,null,null,"1.2  Little Bluestem, Sedges-Sub75",4000]
[null,null,null,"1.3 Little Bluestem, Kentucky Bluegrass, Foxtail Barley-Sub75",3000]
[null,null,null,"1.4 Excessive Litter-Sub75",3500]
[null,null,null,"1.5 Ephemeral Forbs-Sub75",3000]
[null,null,null,"2.1 Kentucky Bluegrass, Foxtail barley, Smooth Brome-Sub75",2000]
[null,null,null,"2.2 Invaded range- Smooth Brome-Sub75",3500]
[null,null,null,"3.1A Range Seeding, Excellent Stand-Sub75",6250]
[null,null,null,"3.1B Range Seeding, Good Stand-Sub75",5750]
[null,null,null,"3.1C Range Seeding, Fair Stand-Sub75",3500]
[null,null,null,"3.1D Tame Pasture-Low Mgt-Sub75",3400]
[null,null,null,"3.1E Tame Pasture-Mod Mgt-Sub75",7000]
[null,null,null,"3.1F Tame Pasture-High Mgt-Sub75",12500]
[null,null,null,"3.2 Go-Back Russian Thistle, Kochia, Foxtail Barley, Annual Bromes-Sub75",1500]
[null,null,null,"4.1 Woody State  Russian Olive, Eastern Redcedar, Salt Cedar, Cottonwood-Sub75",3000]
[null,null,null,"1.1 Big Bluestem, Indiangrass, Switchgrass, Prairie Cordgrass-WetSub75",5500]
[null,null,null,"1.2  Little Bluestem, Sedges-WetSub75",4500]
[null,null,null,"1.3 Little Bluestem, Kentucky Bluegrass, Foxtail Barley-WetSub75",3500]
[null,null,null,"1.4 Excessive Litter-WetSub75",4000]
[null,null,null,"1.5 Ephemeral Forbs-WetSub75",3000]
[null,null,null,"2.1 Kentucky Bluegrass, Foxtail barley, Smooth Brome-WetSub75",2500]
[null,null,null,"2.2 Invaded range-Smooth Brome-Sub75",3500]
[null,null,null,"3.1 Range Seeding, Excellent Stand-WetSub75",5750]
[null,null,null,"3.2 Range Seeding, Good Stand-WetSub75",5000]
[null,null,null,"3.3 Range Seeding, Fair Stand-WetSub75",4000]
[null,null,null,"3.4 Go-Back Introduced perennials, Annual Bromes-WetSub75",2500]
[null,null,null,"1.1 Diverse Tall and Mid Grassees-Cy102C",3385]
[null,null,null,"1.2 Big and Little Bluestem Cy102C",3100]
[null,null,null,"1.3  Cool season and warm season short grasses Cy102C",2250]
[null,null,null,"2.1 Blue grama, Tall (Composite) Dropseed, Kentucky Bluegrass Cy102C",2000]
[null,null,null,"2.2 Invaded range-Smooth Bromegrass-Cy102C",2700]
[null,null,null,"3.1A Range Seeding, Excellent Stand-Cy102C",3500]
[null,null,null,"3.1B Range Seeding, Good Stand-Cy102C",3000]
[null,null,null,"3.1C Range Seeding, Fair Stand-Cy102C",2500]
[null,null,null,"3.1D Tame Pasture-Low Mgmt-Cy102C",7000]
[null,null,null,"3.1E Tame Pasture-Med. Mgmt-Cy102C",4750]
[null,null,null,"3.1F Tame Pasture-High Mgmt-Cy102C",2600]
[null,null,null,"1.1 Diverse Tall and Mid Grassees-CyO102C",3500]
[null,null,null,"1.2 Western Wheatgrass Dominant CyO102C",2750]
[null,null,null,"1.3  Cool season grasses and warm season short grasses CyO102C",2500]
[null,null,null,"2.1 Western Wheatgrass, Bluestem, Needlegrass, Non-Native Cool Season Grasses CyO102C",3000]
[null,null,null,"2.2 Invaded range-Smooth Bromegrass, Kentucky Bluesgrass-CyO102C",2600]
[null,null,null,"3.1A Range Seeding, Excellent Stand-CyO102C",3500]
[null,null,null,"3.1B Range Seeding, Good Stand-CyO102C",2800]
[null,null,null,"3.1C Range Seeding, Fair Stand-CyO102C",2500]
[null,null,null,"3.1D Tame Pasture-Low Mgmt-CyO102C",4000]
[null,null,null,"3.1E Tame Pasture-Med. Mgmt-CyO102C",6000]
[null,null,null,"3.1F Tame Pasture-High Mgmt-CyO102C",8000]
[null,null,null,"1.1 - Saturated Soil Community:  Arrowhead, Burreed, Native Cattail, Softstem Bulrush-CD102C",8000]
[null,null,null,"1.2 Moist Soil Perennials-Spikerush, Sedges, Rushes, Western Wheatgrass, Switchgrass-CD102C",6000]
[null,null,null,"1.3 Moist Soil Annuals:  Smartweed, Barnyard grass, bidens, fall panicum, coreopsis, ragweed, sumpweed-CD102C",3000]
[null,null,null,"2.1 Grassy Invaded - Reed Canarygrass-CD102C",12000]
[null,null,null,"3.1 Cattail-Bulrush Invaded State CD102C",12000]
[null,null,null,"1.1 Big Bluestem, Sideoats Grama-LiU102C",3000]
[null,null,null,"1.2 Little Bluestem, Sideoats Grama-LiU102C",2450]
[null,null,null,"2.1 Native Grasse, Smooth Brome, Kentucky Bluegrass-LiU102C",2100]
[null,null,null,"2.2 - Smooth Brome, Kentucky Bluegrass, Remnant Natives-LiU102C",1750]
[null,null,null,"3.1 - Invasive Dominant-LiU102C",2300]
[null,null,null,"4.1 - Annuals and Pioneer Perennials-LiU102C",400]
[null,null,null,"5.1 - Eastern Redcedar-LiU102C",1000]
[null,null,null,"6.1A Range Seeding, Excellent Stand-LiU102C",3250]
[null,null,null,"6.1B Range Seeding, Good Stand-LiU102C",2750]
[null,null,null,"6.1C Range Seeding, Fair Stand-LiU102C",2250]
[null,null,null,"6.1D Tame Pasture-Low Mgt-LiU102C",3500]
[null,null,null,"6.1E Tame Pasture-Mid Mgt-LiU102C",4500]
[null,null,null,"6.1F Tame Pasture-High Mgt-LiU102C",6000]
[null,null,null,"1.1 Big Bluestem, Little Bluestem-LoLo102C",4000]
[null,null,null,"1.2 Little Bluestem, Sideoats Grama-LoLo102C",3200]
[null,null,null,"2.1 Native Grasses with Subdominant Smooth Brome-LoLo102C",2650]
[null,null,null,"2.2 Native Grasses with Co-dominant Smooth Brome-LoLo102C",2150]
[null,null,null,"3.1 Invaded range-Smooth Brome, Kentucky Bluegrass LoLo102C",2800]
[null,null,null,"4.1 Annuals and Pioneer Perennials LoLo102C",600]
[null,null,null,"5.1 Eastern Redcedar LoLo102C",1000]
[null,null,null,"6.1A Range Seeding, Excellent Stand-LoLo102C",4250]
[null,null,null,"6.1B Range Seeding, Good Stand-LoLo102C",3200]
[null,null,null,"6.1C Range Seeding, Fair Stand-LoLo102C",2150]
[null,null,null,"6.1D Tame Pasture-Low Mgt-LoLO102C",4000]
[null,null,null,"6.1E Tame Pasture-Mid Mgt-LoLO102C",5500]
[null,null,null,"6.1F Tame Pasture-High Mgt-LoLo102C",7500]
[null,null,null,"1.1 Big Bluestem, Little Bluestem-LoO102C",3200]
[null,null,null,"1.2 Sideoats Grama, Composite Dropseed-LoO102C",2600]
[null,null,null,"2.1 Native Grasses with Subdominant Smooth Brome-LoO102C",2500]
[null,null,null,"2.2 Native Grasses with Co-dominant Smooth Brome-LoO102C",2350]
[null,null,null,"3.1 Invaded range-Smooth Brome, Kentucky Bluegrass LoO102C",2400]
[null,null,null,"4.1 Annuals and Pioneer Perennials LoO102C",900]
[null,null,null,"5.1 Deciduous Overstory LoO102C",1000]
[null,null,null,"6.1A Range Seeding, Excellent Stand-LoO102C",3300]
[null,null,null,"6.1B Range Seeding, Good Stand-LoO102C",2600]
[null,null,null,"6.1C Range Seeding, Fair Stand-LoO102C",2000]
[null,null,null,"6.1D Tame Pasture-Low Mgt-LoO102C",4000]
[null,null,null,"6.1E Tame Pasture-Mid Mgt-LoO102C",5000]
[null,null,null,"6.1F Tame Pasture-High Mgt-LoO102C",7000]
[null,null,null,"1.1 Big Bluestem, Little Bluestem-LoU102C",3500]
[null,null,null,"1.2 Little Bluestem, Sideoats Grama-LoU102C",3000]
[null,null,null,"2.1 Native Grasses with Subdominant Smooth Brome-LoU102C",2700]
[null,null,null,"2.2 Native Grasses with Co-dominant Smooth Brome-LoU102C",2400]
[null,null,null,"3.1 Invaded range-Smooth Brome, Kentucky Bluegrass LoU102C",2750]
[null,null,null,"4.1 Annuals and Pioneer Perennials LoU102C",400]
[null,null,null,"5.1 Eastern Redcedar LoU102C",1000]
[null,null,null,"6.1A Range Seeding, Excellent Stand-LoU102C",3750]
[null,null,null,"6.1B Range Seeding, Good Stand-LoU102C",3000]
[null,null,null,"6.1C Range Seeding, Fair Stand-LoU102C",2500]
[null,null,null,"6.1D Tame Pasture-Low Mgt-LoU102C",3700]
[null,null,null,"6.1E Tame Pasture-Mid Mgt-LoU102C",5000]
[null,null,null,"6.1F Tame Pasture-High Mgt-LoU102C",6600]
[null,null,null,"1.1 Little Bluestem, Big Bluestem-LB102C",2400]
[null,null,null,"1.2 Little Bluestem, Sideoats Grama-LB102C",2100]
[null,null,null,"2.1 Native Grasses with Subdominant Cool-Season Invasives-LB102C",1600]
[null,null,null,"3.1 Bur Oak, Eastern Redcedar-LoB102C",800]
[null,null,null,"1.1 Prairie Cordgrass, Switchgrass, Saltgrass, Western Wheatgrass-SS102C",3800]
[null,null,null,"1.2 Western Wheatgrass, Saltgrass-SS102C",3000]
[null,null,null,"2.1 Saltgrass-SS102C",2500]
[null,null,null,"3.1 Annuals and Pioneer Perennials-SS102C",1500]
[null,null,null,"3.1A Range Seeding, Excellent Stand-SS102C",3500]
[null,null,null,"3.1B Range Seeding, Good Stand-SS102C",3000]
[null,null,null,"3.1C Range Seeding, Fair Stand-SS102C",2500]
[null,null,null,"3.1D Tame Pasture-Low Mgt-SS102C",2000]
[null,null,null,"3.1E Tame Pasture-Mid Mgt-SS102C",2600]
[null,null,null,"3.1F Tame Pasture-High Mgt-LSS102C",3400]
[null,null,null,"1.1 Bluestem, Prairie Sandreed-Sa102C",2600]
[null,null,null,"1.2 Bluestem, Prairie Sandreed, Switchgrass-Sa102C",2300]
[null,null,null,"1.3 Prairie Sandreed, Ragweed-Sa102C",1700]
[null,null,null,"1.4 Excessive Litter-Sa102C",2400]
[null,null,null,"2.1 Grama, Sedge Sod-Sa102C",1400]
[null,null,null,"3.1 Eastern Redcedar-Sa102C",300]
[null,null,null,"4.1 Annual, Pioneer Perennial-Sa102C",800]
[null,null,null,"4.2 Active Blowout-Sa102C",100]
[null,null,null,"5.1 Go-Back-Sa102C",1000]
[null,null,null,"5.2 Range Seeding, Excellent Stand-Sa102C",2750]
[null,null,null,"5.3 Range Seeding, Good Stand-Sa102C",2400]
[null,null,null,"5.4 Range Seeding, Fair Stand-Sa102C",2000]
[null,null,null,"5.5 Tame Pasture, Low Mgt-Sa102C",1700]
[null,null,null,"5.6 Tame Pasture, Mod Mgt-Sa102C",2400]
[null,null,null,"5.7 Tame Pasture, High Mgt-Sa102C",2900]
[null,null,null,"5.8 Tame Pasture, Irrigated, Low Mgt-Sa102C",7000]
[null,null,null,"5.9 Tame Pasture, Irrigated, High Mgt-Sa102C",11000]
[null,null,null,"1.1 Bluestem, Prairie Sandreed-Sy102C",3000]
[null,null,null,"1.2 Switchgrass, Prairie Sandreed-Sy102C",2500]
[null,null,null,"2.1 Blue Grama, Western Wheatgrass-Sy102C",1700]
[null,null,null,"3.1 Kentucky Bluegrass, Ragweed-Sy102C",1200]
[null,null,null,"4.1 Go-back-Sy102C",800]
[null,null,null,"4.2 Range Seeding, Excellent Stand-Sy102C",3200]
[null,null,null,"4.3 Range Seeding, Good Stand-Sy102C",2750]
[null,null,null,"4.4 Range Seeding, Fair Stand-Sy102C",2500]
[null,null,null,"4.5 Tame Pasture, Low Mgt-Sy102C",1700]
[null,null,null,"4.6 Tame Pasture, Mod Mgt-Sy102C",2400]
[null,null,null,"4.7 Tame Pasture, High Mgt-Sy102C",2900]
[null,null,null,"4.8 Tame Pasture, Irrigated, Low Mgt-Sy102C",7000]
[null,null,null,"4.9 Tame Pasture, Irrigated, High Mgt-Sy102C",11000]
[null,null,null,"1.1 Sand and Little Bluestem, Prairie Sandreed, Switchgrass-SyLo102C",2900]
[null,null,null,"1.2 Little Bluestem, Switchgrass, Prairie Sandreed, Needle and Thread-SyLo102C",2415]
[null,null,null,"1.3 Heavy Duff Layer-Low Vigor Perennial Grasses-SyLo102C",2100]
[null,null,null,"1.4 Ephemeral Forb Community-SyLo102C",1800]
[null,null,null,"2.1 Needle and Thread, Gramas, Sand Dropseed-SyLo102C",1800]
[null,null,null,"4.1 Eastern Redcedar and other Trees-SaLo102C",1750]
[null,null,null,"3.1 Go-Back-SyLo102C",1250]
[null,null,null,"3.2A Range Seeding, Excellent Stand-SyLo102C",3000]
[null,null,null,"3.2B Range Seeding, Good Stand-Lo102C",2500]
[null,null,null,"3.2C Range Seeding, Fair Stand-SyLo102C",2000]
[null,null,null,"3.5 Tame Pasture, Low Mgt-SyLo102C",2500]
[null,null,null,"3.6 Tame Pasture, Mod Mgt-SyLo102C",3500]
[null,null,null,"3.7 Tame Pasture, High Mgt-SyLo102",4500]
[null,null,null,"3.8 Tame Pasture, Irrigated, Low Mgt-SyLo102C",6000]
[null,null,null,"3.9 Tame Pasture, Irrigated, High Mgt-SyLo102",8000]
[null,null,null,"1.1 Needlegrass, Bluestem, Western Wheatgrass-SwCy102C",2200]
[null,null,null,"1.2 Western Wheatgrass, Buffalograss, Grama-SwCy102C",1500]
[null,null,null,"2.1 Blue Grama, Buffalograss, Sedge-SwCy102C",900]
[null,null,null,"3.1 Deciduous Trees and Shrubs-SwCy102C",750]
[null,null,null,"3.2 Juniper-SwCy102C",1400]
[null,null,null,"4.1 Western Wheatgrass, Needlegrass, Non-Native Cool Season Grasses-SwCy102C",1800]
[null,null,null,"5.1 Smooth Brome, Kentucky Bluegrass-SwCy102C",1000]
[null,null,null,"5.2 Annual, Pioneer Perennials, Bare Ground-SwCy102C",500]
[null,null,null,"1.1 Bluestem-Sideoats Grama-Needlegrass-ShL102C",1700]
[null,null,null,"1.2 Little Bluestem-Needlegrass, Grama-ShL102C",1400]
[null,null,null,"2.1 Grama, Sedge, Bare Ground-ShL102C",1000]
[null,null,null,"3.1 Eastern Redcedar-Ponderosa Pine-ShL102C",1200]
[null,null,null,"1.1 Sand Bluestem, Prairie Sandreed-SG102",1600]
[null,null,null,"1.2 Club Moss, Prairie Sandreed-SG102C",1100]
[null,null,null,"1.4 Heavy Duff-Low Vigor Perennial Grasses-SG102C",1200]
[null,null,null,"1.5 Ephemeral Forbs-SG102C",1100]
[null,null,null,"2.1 Club Moss, Grama-SG102C",700]
[null,null,null,"3.1 Eastern Redcedar-SG102C",700]
[null,null,null,"1.1 Big Bluestem, Little Bluestem-Sub102C",5100]
[null,null,null,"1.2  Prairie Cordgrass, Big Bluestem-Sub102C",3500]
[null,null,null,"2.1 Native grasses, Sub dominant Smooth Brome, Reed Canarygrass-Sub102C",2550]
[null,null,null,"2.2 Native  grasses, Co-dominant Smooth Brome, Reed Canarygrass-Sub102C",2000]
[null,null,null,"3.1 Smooth Brome, Reed Canarygrass-Sub102C",2100]
[null,null,null,"4.1 Annuals, Pioneer Perennials-Sub102C",1000]
[null,null,null,"5.1 Native Deciduous Overstory-Sub102C",3500]
[null,null,null,"1.1 Needlegrass, Grama, Western Wheatgrass-VS102C",1500]
[null,null,null,"1.2 Sedge, Grama, Needlegrass-VS102C",1000]
[null,null,null,"2.1 Needlegrass, Grama, Western Wheatgrass, Non-Native Cool Season Grasses-VS102C",1500]
[null,null,null,"2.2 Sedge, Grama, Needlegrass, Non-Native Cool Season Grasses-VS102C",700]
[null,null,null,"1.1 Big Bluestem, Switchgrass-WSub102C",4650]
[null,null,null,"2.2 Switchgrass, Prairie Cordgrass-WSub102C",4050]
[null,null,null,"3.3 Reedgrass, Bluegrass, and Other Cool seasons-WSub102C",3700]
[null,null,null,"4.4 Reed Canarygrass, Creeping Foxtail-WSub102C",3000]
[null,null,null,"1.1 Big Bluestem, Indiangrass, Little Bluestem-CU106",3800]
[null,null,null,"1.2 Sideoats Grama, Little  Bluestem, Composite Dropseed-CU106",3400]
[null,null,null,"1.3 Blue Grama, Sideoats Grama, Kentucky Bluegrass, Smooth Brome-CU106",2300]
[null,null,null,"2.1 Invaded range-Smooth Brome and/or Tall Fescue-Cu106",2700]
[null,null,null,"3.1A Range Seeding, Excellent Stand-CU106",4000]
[null,null,null,"3.1B Range Seeding, Good Stand-CU106",3500]
[null,null,null,"3.1C Range Seeding, Fair Stand-CU106",3000]
[null,null,null,"3.1D Tame Pasture-Low Mgmt-CU106",3500]
[null,null,null,"3.1E Tame Pasture-Med. Mgmt-CU106",7000]
[null,null,null,"3.1F Tame Pasture-High Mgmt-CU106",11000]
[null,null,null,"3.2 Tilled and Abandoned-CU106",2000]
[null,null,null,"4.1 Eastern Redcedar, Deciduous Trees-CU106",2500]
[null,null,null,"1.1 Big Bluestem, Little Bluestem, Sideoats Grama-LiU106",3000]
[null,null,null,"1.2 Sideoats Grama, Little  Bluestem, LiU106",2500]
[null,null,null,"1.3 Blue Grama, Sideoats Grama, Composite Dropseed-LiU106",2000]
[null,null,null,"1.4 Excessive Litter-LiU106",2250]
[null,null,null,"2.1 Native Warm-season Grasses,  Smooth Brome, Kentucky Bluegrass-LiU106",2000]
[null,null,null,"2.2 Invaded range-Smooth Brome, Kentucky Bluegrass-LiU106",2250]
[null,null,null,"3.1 Eastern Redcedar, Deciduous Trees-LiU106",1500]
[null,null,null,"4.1A Range Seeding, Excellent Stand-LiU106",3250]
[null,null,null,"4.1B Range Seeding, Good Stand-LiU106",2750]
[null,null,null,"4.1C Range Seeding, Fair Stand-LiU106",2000]
[null,null,null,"4.1D Annuals and Pioneer Perennials-LiU106",1000]
[null,null,null,"4.1E Pasture Planting, Low Mgmt-LiU106",3000]
[null,null,null,"4.1F Pasture Planting, Med Mgmt-LiU106",6000]
[null,null,null,"4.1G Pasture Planting, High Mgmt-LiU106",9000]
[null,null,null,"1.1 Big Bluestem, Indiangrass, Prairie Cordgrass, Switchgrass-LF106",4000]
[null,null,null,"1.2 Prairie Cordgrass, Little  Bluestem, Big Bluestem-LF106",3200]
[null,null,null,"1.3 Composite Dropseed, Western Wheatgrass, Gramas, Sedges-LF106",2500]
[null,null,null,"1.4 Excessive Litter-LF106",3000]
[null,null,null,"2.1 Invaded range-Smooth Brome, Kentucky Bluegrass, Composite Dropseed-LF106",2750]
[null,null,null,"2.2 Invaded range-Smooth Brome or Tall Fescue-LF106",3000]
[null,null,null,"3.1A Range Seeding, Excellent Stand-LF106",4250]
[null,null,null,"3.1B Range Seeding, Good Stand-LF106",3500]
[null,null,null,"3.1C Range Seeding, Fair Stand-LF106",2750]
[null,null,null,"3.1D Pasture Planting, Low Mgmt-LF106",3700]
[null,null,null,"3.1E Pasture Planting, Med Mgmt-LF106",6000]
[null,null,null,"3.1F Pasture Planting, cool-season, High Mgmt-LF106",11000]
[null,null,null,"3.1G Pasture Planting, warm-season, High Mgmt-LF106",15000]
[null,null,null,"3.2 Tilled and Abandoned-LF106",2000]
[null,null,null,"4.1 Eastern Redcedar, Deciduous Trees-LF106",2250]
[null,null,null,"1.1 Big Bluestem, Indiangrass, Prairie Cordgrass, Switchgrass-LT106",4200]
[null,null,null,"1.2 Little  Bluestem, Western Wheatgrass, Gramas, Sedges-LT106",3200]
[null,null,null,"1.3 Dropseed, Western Wheatgrass, Gramas, Kentucky Bluegrass-LT106",2500]
[null,null,null,"1.4 Excessive Litter-LT106",3000]
[null,null,null,"2.1 Little Bluestem, Gramas, Western Wheatgrass, Introduced Grasses-LT106",2500]
[null,null,null,"2.2 Invaded range-Smooth Brome or Tall Fescue, Bluegrass-LT106",3100]
[null,null,null,"3.1A Range Seeding, Excellent Stand-LT106",4250]
[null,null,null,"3.1B Range Seeding, Good Stand-LT106",4250]
[null,null,null,"3.1C Range Seeding, Fair Stand-LT106",2750]
[null,null,null,"3.1D Pasture Planting, Low Mgmt-LT106",3700]
[null,null,null,"3.1E Pasture Planting, Med Mgmt-LT106",6000]
[null,null,null,"3.1F Pasture Planting, cool-season, High Mgmt-LT106",11000]
[null,null,null,"3.1G Pasture Planting, warm-season, High Mgmt-LT106",15000]
[null,null,null,"3.2 Tilled and Abandoned-LT106",1600]
[null,null,null,"4.1 Eastern Redcedar, Deciduous Trees-LT106",1200]
[null,null,null,"1.1 Big Bluestem, Indiangrass-LoU106",4250]
[null,null,null,"1.2 Sideoats Grama, Little  Bluestem, LoU106",3700]
[null,null,null,"2.1 Little Bluestem, Smooth Brome or Tall Fescue-LoU106",2600]
[null,null,null,"2.2 Invaded range-Smooth Brome or Tall Fescue, Kentucky Bluegrass-LoU106",2750]
[null,null,null,"3.1A Range Seeding, Excellent Stand-LoU106",4500]
[null,null,null,"3.1B Range Seeding, Good Stand-LoU106",3750]
[null,null,null,"3.1C Range Seeding, Fair Stand-LoU106",2600]
[null,null,null,"3.1D Annuals and Pioneer Perennials-LoU106",2000]
[null,null,null,"3.1E Pasture Planting, Low Mgmt-LoU106",4000]
[null,null,null,"3.1F Pasture Planting, Med Mgmt-LoU106",6000]
[null,null,null,"3.1G Pasture Planting, High Mgmt-LoU106",10000]
[null,null,null,"4.1 Eastern Redcedar, Deciduous Trees-LoU106",2500]
[null,null,null,"1.1 Switchgrass, Western Wheatgrass, Saltgrass-SaLo106",3000]
[null,null,null,"1.2 Western Wheatgrass, Inland Saltgrass, SaLo106",2500]
[null,null,null,"1.3 Blue Grama, Saltgrass, Composite Dropseed-SaLo106",2000]
[null,null,null,"1.4 -Excessive Litter-SaLo106",2000]
[null,null,null,"2.1 Smooth Brome, Kentucky Bluegrass, Composite Dropseed-SaLo106",2000]
[null,null,null,"2.2 Invaded range-Smooth Brome or Tall Fescue-SaLo106",2250]
[null,null,null,"3.1A Range Seeding, Excellent Stand-SaLo106",3250]
[null,null,null,"3.1B Range Seeding, Good Stand-SaLo106",2750]
[null,null,null,"3.1C Range Seeding, Fair Stand-SaLo106",2000]
[null,null,null,"3.2 Abandoned Farmland-SaLo106",1000]
[null,null,null,"4.1 Eastern Redcedar, Deciduous Trees-SaLo106",1500]
[null,null,null,"1.1A Salt Marsh, Bulrush, Narrow-leaf Cattail-SaSub106",3800]
[null,null,null,"1.1B Switchgrass, Prairie Cordgrass, Western Wheatgrass, Saltgrass-SaSub106",3800]
[null,null,null,"1.2 Western Wheatgrass, Inland Saltgrass, SaSub106",2750]
[null,null,null,"1.3 -Excessive Litter-SaSub106",2000]
[null,null,null,"2.1 Inland Saltgrass-SaSub106",1500]
[null,null,null,"3.1A Range Seeding, Excellent Stand-SaSub106",3800]
[null,null,null,"3.1B Range Seeding, Good Stand-SaSub106",3250]
[null,null,null,"3.1C Range Seeding, Fair Stand-SaSub106",2500]
[null,null,null,"3.2 Abandoned Farmland-SaSub106",1000]
[null,null,null,"1.1 Big Bluestem, Indiangrass, Switchgrass-SyLo106",6000]
[null,null,null,"1.2 Little Bluestem, Sideoats Grama-SyLo106",5000]
[null,null,null,"1.3 Blue grama, Sand dropseed, Thin Paspalum, Lovegrass-SyLo75",3500]
[null,null,null,"2.1 Lovegrass, Dropseed, Annuals-SyLo106",2000]
[null,null,null,"3.1A Range Seeding, Excellent Stand-SyLo106",6000]
[null,null,null,"3.1B Range Seeding, Good Stand-SyLO75",5000]
[null,null,null,"3.1C Range Seeding, Fair Stand-SyLO75",4000]
[null,null,null,"3.1D Tame Pasture-Low Mgt-Dryland-SyLo75",4000]
[null,null,null,"3.1E Tame Pasture-Mod Mgt-Dryland-SyLo75",7000]
[null,null,null,"3.1F Tame Pasture-High Mgt-Dryland-SyLo75",12000]
[null,null,null,"3.2 Abandoned Farmland-SyLo106",2000]
[null,null,null,"4.1 Willow, Elm, Cottonwood-SyLo106",4000]
[null,null,null,"1.1 Big Bluestem, Little Bluestem, Deciduous Tree Canopy-Sv106",4250]
[null,null,null,"1.2 Sideoats and Hairy Grama, Muhly, Composite Dropseed-Sv106",3250]
[null,null,null,"1.3 Composite Dropseed, Hairy Grama, Kentucky Bluegrass-Sv106",2500]
[null,null,null,"1.4 Excessive Litter-Sv106",2000]
[null,null,null,"2.1 Deciduous Woody Dominant-Sv106",2000]
[null,null,null,"2.2 Eastern Redcedar Dominant-Sv106",2000]
[null,null,null,"3.1A Range Seeding, Excellent Stand-Sv106",4500]
[null,null,null,"3.1B Range Seeding Good, Stand-Sv106",3500]
[null,null,null,"3.1C Range Seeding, Fair Stand-Sv106",3000]
[null,null,null,"3.2 Abandoned Farmland-Sv106",1500]
[null,null,null,"1.1 Little and Big Bluestem, Sideoats Grama-ShLi106",2400]
[null,null,null,"1.2 Sideoats Grama, Little bluestem, Composite Dropseed, Blue and Hairy Grama-ShLi106",2000]
[null,null,null,"1.3 Composite Dropseed, Kentucky Bluegrass, Smooth Brome-ShLI106",2000]
[null,null,null,"1.3 Excessive Litter-ShLi106",1800]
[null,null,null,"2.1  Annual Bromes, Blue grama, Hairy Grama, Introduced Grasses-ShLi106",2200]
[null,null,null,"3.1 Deciduous Trees, Eastern Redcedar-ShLi106",1500]
[null,null,null,"1.1 Little and Big Bluestem-ShSy106",2500]
[null,null,null,"1.2 Sideoats Grama, Muhly, Composite Dropseed, Blue and Hairy Grama-ShSy106",2000]
[null,null,null,"1.3 Composite Dropseed, Sideoats Grama, Western Wheatgrass-ShSy106",1750]
[null,null,null,"1.4 Excessive Litter-ShSy106",1750]
[null,null,null,"2.1  Blue grama, Hairy Grama, Kentucky Bluegrass-ShSy106",1500]
[null,null,null,"3.1 Eastern Redcedar-ShSy106",1000]
[null,null,null,"1.1 Big Bluestem, Little Bluestem-ShSv106",1800]
[null,null,null,"1.2 Sideoats Grama, Hairy Grama, Composite Dropseed-ShSv106",1250]
[null,null,null,"1.3 Composite Dropseed, Sideoats Grama, Western Wheatgrass-ShSv106",1000]
[null,null,null,"1.4 Excessive Litter-ShSv106",1250]
[null,null,null,"2.1 Deciduous Woody Species-ShSv106",750]
[null,null,null,"2.2 Eastern Redcedar-ShSv106",500]
[null,null,null,"1.1 Big Bluestem, Indiangrass, Prairie Cordgrass, Switchgrass-Sub106",5250]
[null,null,null,"1.2  Little Bluestem, Sedges-Sub106",4500]
[null,null,null,"1.3 Little Bluestem, Composite Dropseed, Reed Canarygrass-Sub106",4500]
[null,null,null,"1.4 Excessive Litter-Sub106",4000]
[null,null,null,"2.1 Invasive Cool-season grasses, Remnant Native Grasses-Sub106",4500]
[null,null,null,"2.2 Reed Canarygrass-Sub106",4000]
[null,null,null,"3.1A Range Seeding, Excellent Stand-Sub106",5500]
[null,null,null,"3.1B Range Seeding, Good Stand-Sub106",4750]
[null,null,null,"3.1C Range Seeding, Fair Stand-Sub106",4000]
[null,null,null,"3.2 Abandoned Farmland-Sub106",2500]
[null,null,null,"4.1 Woody Species-Sub106",2000]
[null,null,null,"1.1 Prairie Cordgrass, Big Bluestem, Indiangrass, Switchgrass-WSub106",6000]
[null,null,null,"1.2  Little Bluestem, Sedges-WSub106",5000]
[null,null,null,"1.3 Little Bluestem, Composite Dropseed, Reed Canarygrass-WSub106",5000]
[null,null,null,"1.4 Excessive Litter-WSub106",4000]
[null,null,null,"2.1 Invasive Cool-season grasses, Remnant Native Grasses-WSub106",4500]
[null,null,null,"2.2 Reed Canarygrass-WSub106",4000]
[null,null,null,"3.1A Range Seeding, Excellent Stand-WSub106",6000]
[null,null,null,"3.1B Range Seeding, Good Stand-WSub106",5000]
[null,null,null,"3.1C Range Seeding, Fair Stand-WSub106",4000]
[null,null,null,"3.2 Abandoned Farmland-WSub106",2500]
[null,null,null,"4.1 Woody Species-WSub106",2500]
[null,null,null,"1.1 Big Bluestem, Indiangrass-CLUP107B",3500]
[null,null,null,"1.2 Native Grasses, Increased Shrub Canop-CLUP107B",3000]
[null,null,null,"2.1 Eastern Redcedar, Sideoats, Big and Little Bluestem-CLUP107B",2750]
[null,null,null,"2.2 Eastern Redcedar, Kentucky Bluegrass-CLUP107B",2000]
[null,null,null,"3.1 Invaded range-Smooth Bromegrass, Kentucky Bluegrass-CLUP107B",3000]
[null,null,null,"4.1A Range Seeding, Excellent Stand-CLUP107B",3250]
[null,null,null,"4.1B Range Seeding, Good Stand-CLUP107B",2750]
[null,null,null,"4.1C Range Seeding, Fair Stand-CLUP107B",2000]
[null,null,null,"4.1D Pasture Planting, Low Mgmt-CLUP107B",3000]
[null,null,null,"4.1E Pasture Planting, Medium Mgmt-CLUP107B",6000]
[null,null,null,"4.1F Pasture Planting, High Mgmt-CLUP107B",9000]
[null,null,null,"1.1 Little Bluestem, Sideoats Grama-CLEBP107B",3500]
[null,null,null,"1.2 Little Bluestem, Tall False Foxgflove-CLEBP107B",3000]
[null,null,null,"2.1 Eastern Redcedar, Sideoats, Big and Little Bluestem-CLEBP107B",2750]
[null,null,null,"2.2 Eastern Redcedar, Kentucky Bluegrass-CLEBP107B",2000]
[null,null,null,"3.1 Invaded range-Smooth Brome, Kentucky Bluegrass-CLEBP107B",3000]
[null,null,null,"4.1A Range Seeding, Excellent Stand-CLEBP107B",3250]
[null,null,null,"4.1B Range Seeding, Good Stand-CLEBP107B",2750]
[null,null,null,"4.1C Range Seeding, Fair Stand-CLEBP107B",2000]
[null,null,null,"4.1D Pasture Planting, Low Mgmt-CLEBP107B",3000]
[null,null,null,"4.1E Pasture Planting, Medium Mgmt-CLEBP107B",6000]
[null,null,null,"4.1F Pasture Planting, High Mgmt-CLEBP107B",9000]
[null,null,null,"1.1 Bur Oak (<20% canopy), Little Bluestem, Sideoats Grama-CLPBS107B",4000]
[null,null,null,"1.2 Bur Oak (20-50% canopy), Big Bluestem, Indiangrass-CLBS107B",3250]
[null,null,null,"2.1 Deciduous Trees, Shrubs, Kentucky Bluegrass, Sedge-CLBS107B",2500]
[null,null,null,"3.1 Bur Oak, Smooth Brome, Kentucky Bluegrass-CLBS107B",2000]
[null,null,null,"4.1A Range Seeding, Excellent Stand-CLBS107B",2000]
[null,null,null,"4.1B Range Seeding, Good Stand-CLBS107B",2000]
[null,null,null,"4.1C Range Seeding, Fair Stand-CLBS107B",4500]
[null,null,null,"4.1D Pasture Planting, Low Mgmt-CLBS107B",3500]
[null,null,null,"4.1E Pasture Planting, Medium Mgmt-CLBS107B",3000]
[null,null,null,"4.1F Pasture Planting, High Mgmt-CLBS107B",1500]
[null,null,null,"1.1 Little Bluestem, Porcupinegrass, Leadplant-CTUP107B",3500]
[null,null,null,"1.2 Big Bluestem, Stiff Sunflower, Leadplant, Black Cherry-CTUP107B",3000]
[null,null,null,"3.1 Invaded range-Smooth Brome, Kentucky  Bluegrass-CTUP107B",2750]
[null,null,null,"4.1 Old Field, Go-Back-CTUP107B",2000]
[null,null,null,"5.1A Range Seeding, Excellent Stand-CTUP107B",3000]
[null,null,null,"5.1B Range Seeding, Good Stand-CTUP107B",3250]
[null,null,null,"5.1C Range Seeding, Fair Stand-CTUP107B",2750]
[null,null,null,"5.1D Pasture Planting, Low Mgmt-CTUP107B",3000]
[null,null,null,"5.1E Pasture Planting, Medium Mgmt-CTUP107B",6000]
[null,null,null,"5.1F Pasture Planting, High Mgmt-CTUP107B",9000]
[null,null,null,"1.1 Oak Canopy (<15%), Little Bluestem, Leadplant, White Prairie Clover-DLEBS107B",4000]
[null,null,null,"1.2 Oak Canopy (15-30%), Big and Little Bluestem, Shrubs-DLEBS107B",3250]
[null,null,null,"2.1 Oak, Hickory, Eastern Redcedar, Sedge-DLEBS107B",2500]
[null,null,null,"2.2 Oak, Hickory, Eastern Redcedar, Black Cherry, Dogwood, Sedge-DLEBS107B",2000]
[null,null,null,"3.1 Smooth Brome, Kentucky Bluegrass-DLEBS107B",3000]
[null,null,null,"5.1A Range Seeding, Excellent Stand-DLEBS107B",4250]
[null,null,null,"5.1B Range Seeding, Good Stand-DLEBS107B",3750]
[null,null,null,"5.1C Range Seeding, Fair Stand-DLEBS107B",3000]
[null,null,null,"5.1D Pasture Planting, Low Mgmt-DLEBS107B",3000]
[null,null,null,"5.1E Pasture Planting, Medium Mgmt-DLEBS107B",6000]
[null,null,null,"5.1F Pasture Planting, High Mgmt-DLEBS107B",9000]
[null,null,null,"1.1 Prairie Cordgrass, Eastern Gamagrass-LFP107B",5000]
[null,null,null,"1.2 Prairie Cordgrass, Big Bluestem-LFP107B",4500]
[null,null,null,"1.3 Prairie Cordgrass, Sedges-LFP107B",4000]
[null,null,null,"2.1 Black Willow, Redtop-LFP107B",3000]
[null,null,null,"2.2 Silver Maple, Black Willow, Redtop-LFP107B",2500]
[null,null,null,"3.1 Prairie Cordgrass, Kentucky Bluegrass-LFP107B",3000]
[null,null,null,"3.2 Kentucky Bluegrass, Red Clover-LFP107B",25000]
[null,null,null,"3.3 Reed Canarygrass-LFP107B",3250]
[null,null,null,"5.1A Range Seeding, Excellent Stand-LFP107B",5000]
[null,null,null,"5.1B Range Seeding, Good Stand-LFP107B",4500]
[null,null,null,"5.1C Range Seeding, Fair Stand-LFP107B",3500,"Check Deep Loess Upland Prairie - in Nebraska????"]
[null,null,null,"5.1D Pasture Planting, Low Mgmt-LFP107B",3500,"Check Loamy Footslope Savanna"]
[null,null,null,"5.1E Pasture Planting, Medium Mgmt-LFP107B",5000]
[null,null,null,"5.1F Pasture Planting, High Mgmt-LFP107B",9000]
[null,null,null,"1.1 Oaks (10-20% Canopy), Big Bluestem, Indiangrass-LFS107B",4250]
[null,null,null,"1.2 Deciduous Trees- 30% Canopy, Big Bluestem, Indiangrass-LFS107B",3500]
[null,null,null,"2.1 Deciduous Trees (80% Canopy), Sedges-LFS107B",2500]
[null,null,null,"2.2 Deciduous Trees - Closed Canopy-LFS107B",2000]
[null,null,null,"3.1 Invaded range-Smooth Brome-Kentucky Bluegrass-LFS107B",3500]
[null,null,null,"5.1A Range Seeding, Excellent Stand-LFS107B",4250]
[null,null,null,"5.1B Range Seeding, Good Stand-LFS107B",3500]
[null,null,null,"5.1C Range Seeding, Fair Stand-LFS107B",2500]
[null,null,null,"5.1D Pasture Planting, Low Mgmt-LFS107B",3500]
[null,null,null,"5.1E Pasture Planting, Medium Mgmt-LFS107B",5000]
[null,null,null,"5.1F Pasture Planting, High Mgmt-LFS107B",9000]
[null,null,null,"1.1 Oaks (5-20% Canopy), Virginia Wildrye, Sweet Woodreed-LTS107B",3000]
[null,null,null,"1.2 Oaks (20-60% Canopy), Sweet Woodreed, Shoreline Sedge-LTS107B",2500]
[null,null,null,"2.1 Deciduous Trees (>60% canopy), Virginia Wildrye-LTS107B",1500]
[null,null,null,"2.2 Deciduous Trees - Closed Canopy-LTS107B",1250]
[null,null,null,"3.1 Shrubs, Reed Canarygrass, Kentucky Bluegrass-LTS107B",2750]
[null,null,null,"5.1A Range Seeding, Excellent Stand-LTS107B",3250]
[null,null,null,"5.1B Range Seeding, Good Stand-LTS107B",2750]
[null,null,null,"5.1C Range Seeding, Fair Stand-LTS107B",2500]
[null,null,null,"5.1D Pasture Planting, Low Mgmt-LTS107B",3500]
[null,null,null,"5.1E Pasture Planting, Medium Mgmt-LTS107B",5000]
[null,null,null,"5.1F Pasture Planting, High Mgmt-LTS107B",9000]
[null,null,null,"1.1 Big Bluestem, Leadplant, Golden Zizia-LUP107B",4500]
[null,null,null,"3.1 Invaded range-Smooth Brome, Kentucky Bluegrass-LUP107B",3500]
[null,null,null,"4.1 Abandoned Field, Annuals, Pioneer Perennials-LUP107B",2000]
[null,null,null,"4.2 Abandoned Field-Dogwood, Eastern Redcedar-LUP107B",1750]
[null,null,null,"5.1A Range Seeding, Excellent Stand-LUP107B",4750]
[null,null,null,"5.1B Range Seeding, Good Stand-LUP107B",4000]
[null,null,null,"5.1C Range Seeding, Fair Stand-LUP107B",3250]
[null,null,null,"5.1D Pasture Planting, Low Mgmt-LUP107B",4300]
[null,null,null,"5.1E Pasture Planting, Medium Mgmt-LUP107B",7000]
[null,null,null,"5.1F Pasture Planting, High Mgmt-LUP107B",10000]
[null,null,null,"1.1 River Bulrush, Broadleaf Arrowhead-PFP107B",5000]
[null,null,null,"1.2 Water Knotweed, Nodding Beggarticks-PFP107B",3000]
[null,null,null,"1.3 Waterlily, Lotus-PFP107B",2000]
[null,null,null,"2.1 Shrubs, Arrowhead, Knotweed-PFP107B",2500]
[null,null,null,"2.2 Small Trees, Shrubs, Knotweed-PFP107B",2500]
[null,null,null,"3.1 Woody overstory, Cattail, Bulrush-PFP107B",2250]
[null,null,null,"3.1 Cottonwood, Silver Maple, Cattail, Reed Canarygrass-PFP107B",4000]
[null,null,null,"1.1 Canada Wildrye, Sand Dropseed-SDP107B",2000]
[null,null,null,"1.2 Early Successional Species-SDP107B",1750]
[null,null,null,"2.1 Shrubs, Canada Wildrye-SDP107B",1500]
[null,null,null,"2.2 Trees, Shrubs, Kentucky Bluegrass-SDP107B",1500]
[null,null,null,"3.1 Smooth Brome, Kentucky Bluegrass-SDP107B",2000]
[null,null,null,"1.1 Shrubs, Sedges, Grasses-WFP107B",6000]
[null,null,null,"1.2 Prairie Cordgrass, Bluejoint-WFP107B",5000]
[null,null,null,"1.3 Sedges Rice Cutgrass-WFP107B",4000]
[null,null,null,"2.1 Shrubs, Red Top-WFP107B",3500]
[null,null,null,"2.2 Trees, Redtop-WFP107B",3000]
[null,null,null,"3.1 Prairie Cordgrass, Kentucky Bluegrass-WFP107B",3500]
[null,null,null,"3.2 Kentucky Bluegrass, Reed Canarygrass-WFP107B",3000]
[null,null,null,"5.1A Range Seeding, Excellent Stand-WFP107B",6000]
[null,null,null,"5.1B Range Seeding, Good Stand-WFP107B",5000]
[null,null,null,"5.1C Range Seeding, Fair Stand-WFP107B",4000]
[null,null,null,"5.1D Pasture Planting, Low Mgmt-WFP107B",4500]
[null,null,null,"5.1E Pasture Planting, Medium Mgmt-WFP107B",8000]
[null,null,null,"5.1F Pasture Planting, High Mgmt-WFP107B",11500]
[null,null,null,"1.1 Prairie Cordgrass, Switchgrass-WUDP107B",6000]
[null,null,null,"1.2 Woody Canopy (<30%), Prairie Cordgrass-WUDP107B",5000]
[null,null,null,"2.1 Woody Canopy >30%, Prairie Cordgrass-WUDP107B",4000]
[null,null,null,"2.2 Woody Canopy dominant, Prairie Cordgrass, Reed Canarygrass-WUDP107B",4000]
[null,null,null,"3.1 Reed Canarygrass, Kentucky Bluegrass-WUDP107B",5000]
[null,null,null,"5.1A Range Seeding, Excellent Stand-WUDP107B",6000]
[null,null,null,"5.1B Range Seeding, Good Stand-WUDP107B",5000]
[null,null,null,"5.1C Range Seeding, Fair Stand-WUDP107B",4000]
[null,null,null,"5.1D Pasture Planting, Low Mgmt-WUDP107B",4000]
[null,null,null,"5.1E Pasture Planting, Medium Mgmt-WUDP107B",7000]
[null,null,null,"5.1F Pasture Planting, High Mgmt-WUDP107B",10000]

{"sheet":"DATA","index":16,"n_rows":220,"n_cols":8,"rows_kept":220,"cut":false,"hidden":false,"merged":[]}
["Alfalfa",2.5,null,null,null,"Begin Grazing","End Grazing","Killing frost"]
["Grass Hay",2.5,null,null,"Alfalfa / Alsike/ red clover",6,3,6]
["Annual Hay",2.5,null,null,"Big / Sand bluestem",10,6,10]
["Corn Silage",1.5,null,null,"Birdsfoot trefoil",6,3,6]
["Cane Silage",1.5,null,null,"Cicer milkvetch",8,5,8]
["Grain",3.7,null,null,"Creeping foxtail",6,3,6]
[null,null,null,null,"Crested wheatgrass",4,3,6]
[null,null,null,null,"Eastern gamagrass",18,8,10]
[null,null,null,null,"Forage Cocktail",6,2,2]
[null,null,null,null,"Indiangrass",10,4,10]
[null,null,null,null,"Intermediate wheatgrass",6,5,8]
[null,null,null,null,"Meadow bromegrass",6,5,6]
[null,null,null,null,"Mid Warm Season Native",6,4,5]
[null,null,null,null,"Orchardgrass",6,5,8]
[null,null,null,null,"Pubescent wheatgrass",6,5,6]
[null,null,null,null,"Reed canarygrass",8,4,8]
[null,null,null,null,"Russian wildrye",6,3,4]
[null,null,null,null,"Small Grain ",6,2,4]
[null,null,null,null,"Smooth brome",6,4,7]
[null,null,null,null,"Switchgrass",10,6,10]
[null,null,null,null,"Tall fescue",6,3,6]
[null,null,null,null,"Tall Warm Season Native",10,6,10]
[null,null,null,null,"Tall wheatgrass",7,4,8]
[null,null,null,null,"Timothy",6,4,5]
[null,null,null,null,"Warm Season Cover Crop",10,6,8]
[null,null,null,null,"Western wheatgrass",6,3,6]
[]
[]
[]
[]
[]
[]
[]
[]
[]
[]
[]
[]
[]
[]
[]
[]
[]
[]
[]
[]
[]
[]
[]
[]
[]
[]
[]
[]
[]
[]
[]
[]
[]
[]
[]
[]
[]
[]
[]
[]
[]
[]
[]
[]
[]
[]
[]
[]
[]
[]
[]
[]
[]
[]
[]
[]
[]
[]
[]
[]
[]
[]
[]
[]
[]
[]
[]
[]
[]
[]
[]
[]
[]
[]
[]
[]
[]
[]
[]
[]
[]
[]
[]
[]
[]
[]
[]
[]
[]
[]
[]
[]
[]
[]
[]
[]
[]
[]
[]
[]
[]
[]
[]
[]
[]
[]
[]
[]
[]
[]
[]
[]
[]
[]
[]
[]
[]
[]
[]
[]
[]
[]
[]
[]
[]
[]
[]
[]
[]
[]
[]
[]
[]
[]
[]
[]
[]
[]
[]
[]
[]
[]
[]
[]
[]
[]
[]
[]
[]
[]
[]
[]
[]
[]
[]
[]
[]
[]
[]
[]
[]
[]
[]
[]
[]
[]
[]
[]
[]
[]
[]
[]
[]
[]
[]
[]
[]
[]
[]
[]
[]
[]
[]
[]
[]
[]
[]
[]
[]
[]
[null,null,0.2,0.8]
[null,null,0.25,1]
[null,null,0.3,1.2]
[null,null,0.35,1.4]