{"text_format":"1","workbook":"xlsx","n_sheets":5,"sheets":["Instructions","Version Notes","Woody Residue Treatment (384)","Resource Concern List","CPPE"],"not_rendered":{"charts":0,"images":0,"macros":1,"external_links":0,"defined_names":2,"comments":1,"pivot_tables":0},"unopened":[],"bounds":{"document_bytes":16777216,"sheet_cells":100000,"rows_first":2000,"rows_last":500,"rows_between":2000,"halvings":0,"cell_chars":16384,"cell_head_chars":4096},"cells_cut":0,"cells_raw":0,"read":"whole","date_system":"1900"}

{"sheet":"Instructions","index":0,"n_rows":7,"n_cols":1,"rows_kept":7,"cut":false,"hidden":false,"merged":[]}
["Instructions for completing Excel Based Jobsheet for Woody Residue Treatment (384):"]
["This Jobsheet has two main sections: The white section for the Cooperator on the left, and; the tan area on the right to assist the Planner in making planning decisions while completing the Jobsheet. "]
["Planners must fill out all grey boxes from top to bottom and left to right within rows up to the \"Cooperator's Acknowledgement\" section (and obtain Cooperator's dated signature) for the Jobsheet, and on the \"Certification Sheet\" for checkout.  Some grey boxes have simple drop down lists."]
["Note that cells with a small red triangle in the upper right corner contain comment boxes that provide additional guidelines and notes.  Access the comments by clicking on the target cell or hovering the cursor over the same."]
["To plan and employ specifications that exceed those provided in the Jobsheet, consult with the PIA State Forester for a potential variance."]
["Once the Jobsheet is completed, print out both the white and tan sections in their entirety for the case file folder and the white section for the Cooperator's copy."]
["If you have any questions or problems with this Jobsheet, or if you have suggestions for improving the Jobsheet, please contact the PIA State Forester."]

{"sheet":"Version Notes","index":1,"n_rows":5,"n_cols":3,"rows_kept":5,"cut":false,"hidden":true,"merged":[]}
["Version Date","Item No.","Notes"]
["2013-05-01",1,"Original version released"]
["2014-01-01",2,"JAA references removed"]
["2015-10-01",3,"\"FOTG review\" and CPPE sections removed from Planner's side of Jobsheet"]
["2016-10-01",4,"Automated view for methods selection."]

{"sheet":"Woody Residue Treatment (384)","index":2,"n_rows":131,"n_cols":31,"rows_kept":131,"cut":false,"hidden":false,"merged":[[102,11,102,12],[98,11,98,19],[103,11,108,19],[95,8,96,10],[101,11,101,12],[100,11,100,12],[53,2,53,4],[53,5,53,7],[54,2,55,4],[56,2,57,4],[54,5,55,7],[56,5,57,7],[58,2,59,4],[58,5,59,7],[84,5,84,10],[106,1,106,6],[106,7,106,8],[106,9,106,10],[100,1,100,3],[100,4,100,6],[100,7,100,9],[101,1,101,3],[101,4,101,6],[101,7,101,9],[31,2,31,10],[86,11,86,15],[87,11,87,15],[88,11,88,15],[85,11,85,16],[19,2,19,10],[20,2,20,10],[88,1,88,10],[92,1,92,10],[91,1,91,10],[90,1,90,10],[44,11,45,19],[50,2,50,10],[49,2,49,10],[48,2,48,10],[41,1,41,4],[41,5,41,10],[42,8,42,10],[42,2,42,7],[43,2,43,7],[44,2,44,7],[45,2,45,7],[41,11,42,19],[46,2,46,10],[8,11,8,19],[12,12,12,13],[11,12,11,13],[10,12,10,13],[9,12,9,13],[15,5,15,7],[17,2,17,7],[17,9,17,10],[18,2,18,7],[12,14,14,19],[9,14,11,19],[21,27,23,27],[21,21,22,22],[28,2,28,10],[29,2,29,10],[30,2,30,10],[25,2,25,7],[21,24,21,26],[21,23,23,23],[23,2,23,7],[24,2,24,7],[22,24,23,24],[22,25,23,25],[22,26,23,26],[22,2,22,7],[1,11,1,19],[3,11,3,19],[0,1,0,8],[0,9,0,10],[1,9,1,10],[1,1,1,8],[8,1,8,10],[2,1,2,10],[4,1,4,4],[4,9,4,10],[5,6,5,7],[2,11,2,19],[7,3,7,5],[7,6,7,9],[7,1,7,2],[6,1,6,2],[3,1,3,10],[4,11,4,19],[5,12,6,19],[5,1,5,2],[5,11,6,11],[5,8,5,10],[5,3,5,5],[0,11,0,19],[115,7,115,10],[97,8,97,10],[109,1,109,10],[131,1,131,10],[128,9,128,10],[129,5,129,7],[129,9,129,10],[130,1,130,10],[128,5,128,7],[128,1,129,4],[121,1,121,3],[122,1,122,3],[126,1,126,10],[127,1,127,10],[123,1,123,10],[110,1,110,10],[97,1,97,6],[98,7,98,9],[98,10,99,10],[99,1,99,3],[99,4,99,6],[99,7,99,9],[107,9,107,10],[104,1,104,6],[7,12,7,19],[119,1,119,3],[85,1,87,10],[113,6,113,7],[113,3,113,5],[119,10,120,10],[120,1,120,3],[111,1,111,10],[112,1,112,4],[114,1,114,2],[115,5,115,6],[118,8,118,10],[116,1,116,4],[113,8,113,10],[116,5,116,10],[117,1,117,4],[117,5,117,10],[112,9,112,10],[113,1,113,2],[94,1,94,10],[10,1,14,10],[115,1,115,4],[107,1,107,6],[107,7,107,8],[102,1,102,3],[102,4,102,6],[102,7,102,9],[105,1,105,6],[105,7,105,8],[105,9,105,10],[95,1,96,6],[89,1,89,10],[93,1,93,10],[104,7,104,8],[104,9,104,10],[80,2,81,10],[82,2,83,10],[63,2,63,3],[51,2,51,10],[64,2,65,10],[66,2,67,10],[68,2,68,10],[69,2,70,10],[72,2,72,10],[71,2,71,10],[73,2,77,10],[78,2,79,10],[53,8,53,9],[54,8,55,9],[56,8,57,9],[58,8,59,9],[60,2,61,4],[60,5,61,7],[60,8,61,9]]}
[null,"Natural Resources Conservation Service - Pacific Islands",null,null,null,null,null,null,null,"Field Office:",null,"Woody Residue Treatment (384)",null,null,null,null,null,null,null,null,null,null,"American Samoa",null,null,null,null,null,null,null,"Biochar Systems"]
[null,"Conservation Practice Implementation Requirements",null,null,null,null,null,null,null,null,null,"Information & Resources for Conservation Planners",null,null,null,null,null,null,null,null,null,null,"Guam",null,"hand tools - non mechanized",null,null,null,null,null,"Flame Cap/Kon-Tiki Kiln"]
[null,"Woody Residue Treatment (384)",null,null,null,null,null,null,null,null,null,"PIA e-FOTG",null,null,null,null,null,null,null,null,null,null,"Hilo",null,"hand tools - mechanized (chainsaw, weed whacker, etc.)",null,null,null,null,null,"Retort"]
[null,"Version: October 2022",null,null,null,null,null,null,null,null,null,null,null,null,null,null,null,null,null,null,null,null,"Kahului",null,"wheeled or tracked machinery",null,null,null,null,null,"Open Pit"]
[null,"Jobsheet Prepared for and by:",null,null,null,null,null,null,"Date:",null,null,"Purpose of Planned Practice:",null,null,null,null,null,null,null,null,null,null,"Kaunakakai",null,"combination of hand tools and wheeled or tracked machinery",null,null,null,null,null,"Top-Lit Updraft (TLUD)"]
[null,"Cooperator Name",null,null,null,null,"Business Name",null,null,null,null,"Resource Concern ",null,null,null,null,null,null,null,null,null,null,"Kealakekua",null,"biochar equipment",null,null,null,null,null,"Other"]
[null,"Tract Number",null,null,"Field Number(s)",null,"Field Acres",null,"Planned Amount",null,"acres",null,null,null,null,null,null,null,null,null,null,null,"Lihue",null,"Reduce hazardous fuels"]
[null,"Planner Name",null,null,null,null,"  Site Rainfall (inches per year)",null,null,null,null,"Primary Purpose ",null,null,null,null,null,null,null,null,null,null,"Marshall Islands",null,"Reduce the risk of harmful insects and disease"]
[null,"Summary of Conservation Practice (Note: Avoid spreading noxious or invasive species by applying ",null,null,null,null,null,null,null,null,null,"Select Method(s) to be Applied:",null,null,null,null,null,null,null,null,null,null,"Oahu",null,"Protect/maintain air quality by reducing the risk of wildfire"]
[null,"this practice when residues do not contain viable weed seeds to the greatest extent practicable):  ",null,null,null,null,null,null,null,null,null,null,"Lopping and scattering",null,"To the left, select \"Yes\" for each method that will be used. Below, select the description that best matches the equipment that will be used during implimentation.",null,null,null,null,null,"Yes",null,"Palau",null,"To improve access for management purposes"]
[null,null,null,null,null,null,null,null,null,null,null,null,"Piling for decomposition",null,null,null,null,null,null,null,"No",null,"Pohnpei",null,"Improve access to forage for livestock and wildlife"]
[null,null,null,null,null,null,null,null,null,null,null,null,"Chipping",null,null,null,null,null,null,null,null,null,"Saipan",null,"Develop renewable energy systems"]
[null,null,null,null,null,null,null,null,null,null,null,null,"Removal off site",null,null,null,null,null,null,null,null,null,"Waimea",null,"Reduce the risk of harm to humans and livestock"]
[null,null,null,null,null,null,null,null,null,null,null,null,"Processing into biochar",null,null,null,null,null,null,null,null,null,null,null,"Improve the soil organic matter"]
[null,null,null,null,null,null,null,null,null,null,null,null,"Burning",null,null,null,null,null,null,null,null,null,null,null,"Improve the site for natural or artificial regeneration"]
[null,"Slash treatment methods:",null,null,null,"Select method(s) in cells L10-15",null,null,null,null,null,"Additional Guidelines for Planners:",null,null,null,null,null,null,null,null,"NOTIFY STATE FORESTER BEFORE CONTINUING"]
[{"$f":"IF($L$10=\"Yes\",\"Yes\",\"No\")","v":"No"},"Specifications for lopping and scattering:"]
[{"$f":"IF($L$10=\"Yes\",\"Yes\",\"No\")","v":"No"},null,"  ● Lop limbs & stems then scatter slash so that it is no higher than ",null,null,null,null,null,{"$f":"IF(K8=\"\",\"\",VLOOKUP(K8,V25:AB30,3,TRUE))","v":""},"feet above ground."]
["No",null,"  ● Use heavy equipment to crush deep slash piles when feasible."]
["No",null,"  ● Woody residue from some weed species may resprout when placed in contact with soil; resudues "]
["No",null,"     from such species should be killed before scattering operations or placed above soil contact."]
[{"$f":"IF($L$11=\"Yes\",\"Yes\",\"No\")","v":"No"},"Specifications for piling for decomposition:",null,null,null,null,null,null,null,null,null,null,null,null,null,null,null,null,null,null,null,"Rainfall range (in)",null,"Lop & scatter over wide area - max slash depth (ft)","Pile for decomposition",null,null,"Chip piles - max depth (ft)"]
[{"$f":"IF($L$11=\"Yes\",\"Yes\",\"No\")","v":"No"},null,"  ● Maximum branch or stem diameters for piled slash  ------------>",null,null,null,null,null,{"$f":"IF(K8=\"\",\"\",VLOOKUP(K8,V25:AB30,4,TRUE))","v":""},"inches.",null,null,null,null,null,null,null,null,null,null,null,null,null,null,"max stem diam. (in)","max length (ft)","max pile ht. (ft)"]
["No",null,"  ● Maximum slash pile dimensions of 10 feet wide by -------------->",null,null,null,null,null,{"$f":"IF(K8=\"\",\"\",VLOOKUP(K8,V25:AB30,5,TRUE))","v":""},"feet long.",null,null,null,null,null,null,null,null,null,null,null,"min","max"]
["No",null,"  ● Maximum slash pile height ----------------------------------------------->",null,null,null,null,null,{"$f":"IF(K8=\"\",\"\",VLOOKUP(K8,V25:AB30,6,TRUE))","v":""},"feet.",null,null,null,null,null,null,null,null,null,null,null,0,25,1,4,5,3,3,"Jan 2007 Jobsheet specs"]
["No",null,"  ● Minimum distance between slash piles ------------------------------>",null,null,null,null,null,50,"feet.",null,null,null,null,null,null,null,null,null,null,null,26,45,1.5,5,10,3,3]
["No",null,"  ● Minimum distance between slash piles & structures / utilities >",null,null,null,null,null,100,"feet.",null,null,null,null,null,null,null,null,null,null,null,46,65,2,6,20,4,3]
["No",null,"  ● Slash shall never be buried, and mixing soil with slash should be avoided as practical.",null,null,null,null,null,null,null,null,null,null,null,null,null,null,null,null,null,null,66,90,2.5,7,40,5,3]
["No",null,"  ● Individual logs that excede the maximum stem diameter specified above may be left within the",null,null,null,null,null,null,null,null,null,null,null,null,null,null,null,null,null,null,91,115,3,8,60,6,3]
["No",null,"     field or placed at the field boundary in a way that does not interfere with other on-site activities.",null,null,null,null,null,null,null,null,null,null,null,null,null,null,null,null,null,null,116,500,3.5,9,80,6,3]
["No",null,"  ● Woody material from some weed species may resprout when piled in contact with soil; these "]
["No",null,"     species should be killed before cutting down & piling them, or should be piled above soil contact."]
[{"$f":"IF($L$12=\"Yes\",\"Yes\",\"No\")","v":"No"},"Specifications for chipping:"]
[{"$f":"IF($L$12=\"Yes\",\"Yes\",\"No\")","v":"No"},null,"  ● Chips may be spread over the ground surface on-site no deeper than 9” or removed off-site."]
["No",null,"  ● Maximum chip pile area is 100 square feet."]
["No",null,"  ● Maximum chip pile height is three (3) feet to avoid the possibility of spontaneous combustion."]
[{"$f":"IF($L$13=\"Yes\",\"Yes\",\"No\")","v":"No"},"Specifications for removal off site:"]
[{"$f":"IF($L$13=\"Yes\",\"Yes\",\"No\")","v":"No"},null,"  ● Material is moved off-site for firewood, chipping, etc."]
["No",null,"  ● Handle and transport material using methods that prevent the spread of invasive species."]
["No",null,"  ● When Woody Residue Treatment is applied in conjunction with Fuelbreak (383), all woody slash"]
[{"$f":"IF($L$13=\"Yes\",\"Yes\",\"No\")","v":"No"},null,"     must be removed from the fuelbreak and treated with one of the three specifications above."]
[{"$f":"IF($L$14=\"Yes\",\"Yes\",\"No\")","v":"No"},"Specifications for biochar production:",null,null,null,{"$f":"IF(L15=\"Yes\",U16,IF(AND(I43=AE4, L14=\"Yes\"),U16,\"\"))","v":""},null,null,null,null,null,"  ● Biochar production must follow Forestry Tech Note 13 - Biochar Production From Woody Biomass. Append the tech note to the IR as part of the Job Sheet and provide a copy to the client. "]
[{"$f":"IF($L$14=\"Yes\",\"Yes\",\"No\")","v":"No"},null,"  ● System type chosen for biochar production --------------------->"]
[{"$f":"IF($L$14=\"Yes\",\"Yes\",\"No\")","v":"No"},null,"  ● Number of units/pits to be used ----------------------------------->"]
[{"$f":"IF($L$14=\"\", \"No\", IF($I$43=$AE$4,\"Yes\",\"No\"))","v":"No"},null,"  ● Maximum pit diameter ----------------------------------------------->",null,null,null,null,null,null,null,null,"  ● All proposals for open pit systems require State Forester review and constitute invasive actions for Cultural Resources effects determination if new pits are constructed or existing ones enlarged."]
[{"$f":"IF($L$14=\"\", \"No\", IF($I$43=$AE$4,\"Yes\",\"No\"))","v":"No"},null,"  ● Maximum Pit depth --------------------------------------------------->"]
[{"$f":"IF($L$14=\"Yes\",\"Yes\",\"No\")","v":"No"},null,"Feedstock Criteria - (Unless otherwise specified by an equipment manufacturer)"]
["No"]
["No",null,"  ● Only wood, or pseudowood stems and branches will be used"]
["No",null,"  ● Feedstock will be cured and dry"]
["No",null,"  ● Dimensions will be as specified in the table below"]
["No",null,"  ● Feedstock will be free of dirt, garbage, construction materials, other non-woody materials"]
["No"]
["No",null,"Length",null,null,"Diameter (in)",null,null,"Moisture Content"]
[{"$f":"IF($L$14=\"\",\"No\", IF($I$43=$AE$4, \"Yes\", IF($I$43=$AE$2,\"Yes\",\"No\")))","v":"No"},null,"No longer than the width of the opening to the kiln/pit.",null,null,"1 - 6 inches (no leaves)",null,null,"<20%"]
[{"$f":"IF($L$14=\"\",\"No\", IF($I$43=$AE$4, \"Yes\", IF($I$43=$AE$2,\"Yes\",\"No\")))","v":"No"}]
[{"$f":"IF($I$43=$AE$5,\"Yes\",\"No\")","v":"No"},null,"No longer than depth of the feedstock chamber",null,null,"<2 inches (e.g. wood chips, small twigs [no leaves])",null,null,"<25%"]
[{"$f":"IF($I$43=$AE$5,\"Yes\",\"No\")","v":"No"}]
[{"$f":"IF($I$43=$AE$3,\"Yes\",\"No\")","v":"No"},null,"No longer than the depth/width of the inner chamber",null,null,"1 - 8 inches",null,null,"<15%"]
[{"$f":"IF($I$43=$AE$3,\"Yes\",\"No\")","v":"No"}]
[{"$f":"IF($I$43=$AE$6,\"Yes\",\"No\")","v":"No"}]
[{"$f":"IF($I$43=$AE$6,\"Yes\",\"No\")","v":"No"}]
[{"$f":"IF($L$14=\"Yes\",\"Yes\",\"No\")","v":"No"}]
[{"$f":"IF($L$14=\"Yes\",\"Yes\",\"No\")","v":"No"},null,"Operating Criteria:"]
[{"$f":"IF($L$14=\"Yes\",\"Yes\",\"No\")","v":"No"},null,"  ● Water of a quantity sufficient to quench the system must be on-site/available during operation and until lit char is fully quenched."]
["No"]
["No",null,"  ● Keep a charged hose on-site at all times during operation to provide initial fire suppression in the event of an ignition in surrounding area fuels."]
["No"]
["No",null,"  ● The operating area must be cleared of flammable vegetation and debris."]
["No",null,"  ● Only operate in areas where canopy is not directly above the system or otherwise close enough to ignite from radiant heat."]
["No"]
["No",null,"  ● Store feedstock a safe distance from active/operating biochar production equipment."]
["No",null,"  ● Do not store any flammable or hazardous materials near biochar production equipment."]
["No",null,"  ● All persons operating equipment should be equipped with adequate protective gear and clothing, including at a minimum closed-toe shoes, long sleeves, pants, and gloves. Use a shroud or goggles and hat to protect the neck, head and face from heat, as needed. All clothing worn should be natural fiber (NOT polyester, nylon, acrylic, or other synthetics) or other fabrics specifically engineered for heat and flame resistance."]
["No"]
["No"]
["No"]
["No"]
["No",null,"  ● Follow additional safety instructions and parameters specified by the manufacturer (if equipment was purchased)."]
["No"]
["No",null,"  ● Obtain and abide by all necessary permits and follow all rules and regulations pertaining to biochar production and equipment operation."]
["No"]
["No",null,"  ● Contact fire departments, emergency services or other agencies prior to ignition as required by permits or local laws and regulations."]
["No"]
[null,"Additional Information/Requirements: ",null,null,null,{"$f":"IF(L15=\"Yes\",U16,IF(AND(I43=AE4, L14=\"Yes\"),U16,\"\"))","v":""},null,null,null,null,null,"  ● Determine annual rainfall for project site and enter value in cell K8 using references below:"]
[null,null,null,null,null,null,null,null,null,null,null,"          ○ State of Hawaii - UH Geography Department interactive rainfall map"]
[null,null,null,null,null,null,null,null,null,null,null,"          ○ Guam - U.S. Geological Survey rainfall modelling map"]
[null,null,null,null,null,null,null,null,null,null,null,"          ○ Saipan - U.S. Geological Survey rainfall modelling map"]
[null,"Cooperator’s Acknowledgement: (To be completed after practice I&E and Design have been approved.)",null,null,null,null,null,null,null,null,null,"          ○ Tutuila - U.S. Geological Survey rainfall modelling map"]
[null,"By signing below, I acknowledge that I: ",null,null,null,null,null,null,null,null,null,"          For other PIA islands use best available resources or rain gauge data."]
[null,"  ● Have reviewed this Job sheet and have an understanding of its contents and requirements; ",null,null,null,null,null,null,null,null,null,"  ● Woody Residue Treatment practice intensity should match that of any practice listed below when planned "]
[null,"  ● Will make no changes to this Job sheet, without prior concurrence of NRCS;",null,null,null,null,null,null,null,null,null,"     and implemented in sequence with that same practice."]
[null,"  ● Will install, operate, and maintain this practice in accordance with this Job sheet; and",null,null,null,null,null,null,null,null,null,"  ● Whenever possible Woody Residue Treatment should be conducted within one (1) month of completion"]
[null,"  ● Will obtain all necessary permits and/or rights, comply with all ordinances and laws, and notify all utilities pertaining to the installation, operation, and maintenance of the practice.",null,null,null,null,null,null,null,null,null,"     of any practice listed below when planned in sequence with that same practice."]
[null,"    utilities pertaining to the installation, operation, and maintenance of this practice.",null,null,null,null,null,null,null,null,null,"○ Brush Management (314)",null,"○ Tree/Shrub Site Preparation (490)"]
[null,null,null,null,null,null,null,null,null,null,null,"○ Forest Stand Improvement (666)",null,"○ Tree/Shrub Pruning (660)"]
[null,null,null,null,null,null,null,null,null,null,null,"○ Fuelbreak (383)",null,"○ Windbreak/Shelterbelt Renovation (650)"]
[null,"Signature",null,null,null,null,null,null,"Date",null,null,"○ Land Clearing (460)",null,"○ Other Conservation Practice Standards that generate woody residues"]
[null," I&E and Design Approval:",null,null,null,null,null,null,null,null,"Req. Job Class","Fuel Assessment/Fire Hazard Determination:"]
[null,"Controlling Factor",null,null,"Units",null,null,"Planned Amount/Type/Method",null,null,null,"  ● Determine fire hazard for the site by selecting from the drop down list below:"]
[null,"Treatment Type",null,null,"Hand/Mechanical/Burn",null,null,{"$f":"IF(OR($L$14=\"Yes\", $L$15=\"Yes\"),$W$117, IF($O$13=\"\",\"Select an option in cell O13\", IF(OR($O$13=$Y$2,$O$13=$Y$3),$W$115,IF($O$13=\"biochar equipment\",$W$117,$W$116))))","v":"Select an option in cell O13"},null,null,{"$f":"IF($H$101=$W$115,$V$115,IF($H$101=$W$116,$V$116,IF($H$101=$W$117,$V$118,\"\")))","v":""},{"$f":"IF($K$8=\"\",\"\",$K$8)","v":""},null,"<-----Rainfall entered at top of form"]
[null,"Fuel Volatility",null,null,"Fire Hazard/Behavior Class",null,null,{"$f":"IF($L$14=\"Yes\",$Y$115,IF($O$13=\"biochar equipment\",$Y$115,IF(L102=\"\", \"Select Veg Description in L102\",$L$103)))","v":"Select Veg Description in L102"},null,null,{"$f":"IF(OR($H$102=\"\", $H$102=\"Select Veg Description in L102\"),\"\",IF($O$13=$Y$2,$V$115,IF($H$102=$Y$115,$V$116,IF($H$102=$Y$116,$V$117,IF($H$102=$Y$117,$V$118,$V$115)))))","v":""},null,null,"<-----Select best description of the vegetation type or condition at the site"]
[null,"Soil Erosion Hazard",null,null,"From WSS (slight, moderate, etc.)",null,null,null,null,null,{"$f":"IF($H$103=\"\",\"\",IF($H$101=$W$115,$V$115,IF($H$103=$Z$114,$V$116,IF($H$103=$Z$115,$V$118,IF($H$103=$Z$116,$V$119,IF($H$103=$Z$117,$V$119,\"\"))))))","v":""},{"$f":"IF($L$102=\"\",\"\",IF($K$8=\"\",\"enter rainfall in cell k8\",IF($K$8>=80,$Y$114,IF($K$8>=60,$Y$115,IF(AND($K$8>=40,OR($L$102=$X$116,$L$102=$X$117,$L$102=$X$118)),$Y$116,IF(AND($K$8<40,OR($L$102=$X$116,$L$102=$X$117,$L$102=$X$118,$L$102=$X$119)),$Y$117,$Y$115))))))","v":""},null,"<-----Calculated Fire Behavior/Fuel Model Rating"]
[null,null,null,null,null,null,null,null,null,null,null,"The estimated fire hazard or fire behavior for the site is based on the entered average rainfall and the vegetation type selected above. Sites with greater than 80 inches annual rainfall will always report as \"very low/none\" for fire hazard. As yearly rainfall lowers, site fire hazard will become progressively higher. Low grass vegetation type is always placed in \"very low/none\" or \"low\" fire hazard categories depending on site rainfall. When non-mechanized hand tools are the only equipment used, fire hazard rating drops to \"very low/none\"."]
[]
[null,"Signature for Approval of I&E (must submit inventory work to approver)",null,null,null,null,null,"Approver's JAA",null,"Date"]
[]
[null,"Signature for Approval of Design",null,null,null,null,null,"Approver's JAA",null,"Date"]
[]
[null,"Natural Resources Conservation Service"]
[null,"Pacific Islands Conservation Practice Certification Sheet"]
[null,{"$f":"IF(B3=0,\"\",B3)","v":"Woody Residue Treatment (384)"}]
[null,"Certification Prepared for:",null,null,null,null,null,null,"Date"]
[null,"Cooperator Name",null,{"$f":"IF(D6=0,\"\",D6)","v":""},null,null,"Business Name",null,{"$f":"IF(I6=0,\"\",I6)","v":""},null,null,null,null,null,null,null,null,null,null,null,null,null,null,null,"very low/none","slight"]
[null,"Tract Number",null,{"$f":"IF(D7=0,\"\",D7)","v":""},"Field Number(s)",{"$f":"IF(F7=0,\"\",F7)","v":""},"Field Acres",{"$f":"IF(H7=0,\"\",H7)","v":""},"Planned Amount",{"$f":"IF(J7=0,\"\",J7)","v":""},"acres",null,null,null,null,null,null,null,null,null,true,"I","hand tools","low grass (<2ft)","low","moderate"]
[null,"Certification Prepared by:",null,null,null,"Planner Name",null,null,null,null,null,null,null,null,null,null,null,null,null,null,false,"II","mechanical","high grass (>2ft)","moderate","severe"]
[null,"Resource Problem Identified",null,null,null,{"$f":"IF(M6=0,\"\",M6)","v":""},null,null,null,null,null,null,null,null,null,null,null,null,null,null,null,"III","burn","scattered shrubs/trees and grass","high","very severe"]
[null,"Selected Primary Purpose ",null,null,null,{"$f":"IF(M8=0,\"\",M8)","v":""},null,null,null,null,null,null,null,null,null,null,null,null,null,null,null,"IV",null,"dense shrubs"]
[null,"Record of Trees-Shrubs-Vines Planted and Field Checkout Notes:",null,null,null,null,null,null,null,null,null,null,null,null,null,null,null,null,null,null,null,"V",null,"forest"]
[null,"CIN #"]
[null,"Field(s)"]
[null,"Residue trt. completion date",null,null,null,null,null,null,null,null,"Total"]
[null,"Acres treated",null,null,null,null,null,null,null,null,{"$f":"SUM(E123:J123)","v":0}]
[null," Any variances to the above specifications must be documented and approved by NRCS prior to initiating work."]
[null,"1.  All Jobsheet specifications have been followed."]
[null,"2.  The practice as installed addresses the identified resource problem for the planned area."]
[null,"Checkout notes & methods used to determine applied units (GPS, tape, count, initial inventory, etc.): "]
[]
[null,"If the above two questions are answered True then the practice should be certified complete.  Must have adequate JAA."]
[null,null,null,null,null,"Certification Signature",null,null,null,"Date"]
[null,"Answering any of the above questions False simply means that this practice should not be certified at this time.  In the box below describe what needs to occur before the practice can be certified and review with the Cooperator."]

{"sheet":"Resource Concern List","index":3,"n_rows":48,"n_cols":2,"rows_kept":48,"cut":false,"hidden":true,"merged":[]}
["RCC","Resource Concerns"]
["Soil"," Sheet and rill erosion"]
["Soil"," Wind erosion"]
["Soil"," Ephemeral gully erosion"]
["Soil"," Classic gully erosion"]
["Soil"," Bank erosion from streams, shorelines, or water conveyance channels"]
["Soil"," Subsidence"]
["Soil"," Compaction"]
["Soil"," Organic matter depletion"]
["Soil"," Concentration of salts or other chemicals"]
["Soil"," Soil organism habitat loss or degradation"]
["Soil"," Aggregate instability "]
["Water"," Ponding and flooding"]
["Water"," Seasonal high water table"]
["Water"," Seeps"]
["Water"," Drifted snow"]
["Water"," Surface water depletion"]
["Water"," Ground water depletion"]
["Water"," Naturally available moisture use"]
["Water"," Inefficient irrigation water use"]
["Water"," Nutrients transported to surface water"]
["Water"," Nutrients transported to ground water"]
["Water"," Pesticides transported to surface water"]
["Water"," Pesticides transported to ground water"]
["Water"," Pathogens and chemicals from manure, biosolids, or compost applications transported to surface water"]
["Water"," Pathogens and chemicals from manure, biosolids, or compost applications transported to ground water"]
["Water"," Salts transported to surface water"]
["Water"," Salts transported to ground water"]
["Water"," Petroleum, heavy metals, and other pollutants transported to surface water"]
["Water"," Petroleum, heavy metals, and other pollutants transported to ground water"]
["Water"," Sediment transported to surface water"]
["Water"," Elevated water temperature"]
["Air"," Emissions of particulate matter (PM) and PM precursors"]
["Air"," Emissions of greenhouse gases (GHGs)"]
["Air"," Emissions of ozone precursors"]
["Air"," Objectionable odors"]
["Air"," Emissions of airborne reactive nitrogen"]
["Plants"," Plant productivity and health"]
["Plants"," Plant structure and composition"]
["Plants"," Plant pest pressure"]
["Plants"," Wildfire hazard from biomass accumulation"]
["Animals"," Terrestrial habitat for wildlife and invertebrates"]
["Animals"," Aquatic habitat for fish and other organisms"]
["Animals"," Feed and forage imbalance"]
["Animals"," Inadequate livestock shelter"]
["Animals"," Inadequate livestock water quantity, quality, and distribution"]
["Energy"," Energy efficiency of equipment and facilities"]
["Energy"," Energy efficiency of farming/ranching practices and field operations"]

{"sheet":"CPPE","index":4,"n_rows":117,"n_cols":82,"rows_kept":117,"cut":false,"hidden":true,"merged":[[1,1,1,2],[0,1,0,2]]}
["Resource Concern","Planned Conservation Practice",null,"CPPE Score"]
["Soil Erosion - Classic Gully","Access Control"]
[]
[]
["PracticeName","Soil Erosion - Classic Gully","Soil Erosion Ephemeral Gully","Soil Erosion - Irrigation-induced","Soil Erosion - Mass Movement","Soil Erosion - Road, Road Sides and Construction Sites","Soil Erosion - Sheet and Rill","Soil Erosion - Shoreline","Soil Erosion - Streambank","Soil Erosion - Wind","Soil Condition - Compaction","Soil Condition - Contaminants - Residual Pesticides","Soil Condition - Contaminants - Salts and Other Chemicals","Soil Condition - Damage from Sediment Deposition","Soil Condition - Organic Matter Depletion","Soil Condition - Subsidence","Soil Condition - Contaminants-Animal Waste and Other Organics - N","Soil Condition - Contaminants-Animal Waste and Other Organics - P","Soil Condition - Contaminants-Animal Waste and Other Organics - K","Soil Condition - Contaminants-Commercial Fertilizer - N","Soil Condition - Contaminants-Commercial Fertilizer - P","Soil Condition - Contaminants-Commercial Fertilizer - K","Soil Condition - Rangeland Site Stability","Water Quantity - Aquifer Overdraft","Water Quantity - Drifted Snow","Water Quantity - Excessive Runoff, Flooding, or Ponding","Water Quantity - Excessive Seepage","Water Quantity - Excessive Subsurface Water","Water Quantity - Inadequate Outlets","Water Quantity - Inefficient Water Use on Irrigated Land","Water Quantity - Inefficient Water Use on Non-irrigated Land","Water Quantity - Insufficient Flows in Water Courses","Water Quantity - Reduced Capacity of Conveyances by Sediment Deposition","Water Quantity - Reduced Storage of Water Bodies by Sediment Accumulation","Water Quantity - Rangeland Hydrologic Cycle","Water Quality - Excessive Nutrients and Organics in Groundwater","Water Quality - Excessive Nutrients and Organics in Surface Water","Water Quality - Excessive Salinity in Groundwater","Water Quality - Excessive Salinity in Surface Water","Water Quality - Excessive Suspended Sediment and Turbidity in Surface Water","Water Quality - Harmful Levels of Heavy Metals in Groundwater","Water Quality - Harmful Levels of Heavy Metals in Surface Water","Water Quality - Harmful Levels of Pathogens in Groundwater","Water Quality - Harmful Levels of Pathogens in Surface Water","Water Quality - Harmful Levels of Pesticides in Groundwater","Water Quality - Harmful Levels of Pesticides in Surface Water","Water Quality - Harmful Levels of Petroleum in Groundwater","Water Quality - Harmful Levels of Petroleum in Surface Water","Water Quality - Harmful Temperatures of Surface Water","Air Quality - Adverse Air Temperature","Air Quality - Ammonia (NH3)","Air Quality - Chemical Drift","Excessive Greenhouse Gas - CH4 (methane)","Excessive Greenhouse Gas - CO2 (carbon dioxide)","Air Quality - Excessive Greenhouse Gas - N2O (nitrous oxide)","Air Quality - Excessive Ozone","Air Quality - Objectionable Odors","Air Quality - Particulate matter less than 10 micrometers in diameter (PM 10)","Air Quality - Particulate matter less than 2.5 micrometers in diameter (PM 2.5)","Air Quality - Reduced Visibility","Air Quality - Undesirable Air Movement","Plant Condition - Forage Quality and Palatability","Plant Condition - Noxious and Invasive Plants","Plant Condition - Plants not adapted or suited","Plant Condition - Productivity, Health and Vigor","Plant Condition - Threatened and Endangered Plant Species","Plant Condition - Wildfire Hazard","Plant Condition - T&E Plant Species: Declining Species, Species of Concern","Fish and Wildlife - Imbalance Among and Within Populations","Fish and Wildlife - Inadequate Cover/Shelter","Fish and Wildlife - Inadequate Food","Fish and Wildlife - Inadequate Space","Fish and Wildlife - Inadequate Water ","Fish and Wildlife - Threatened and Endangered Fish and Wildlife Species","Fish and Wildlife - Habitat Fragmentation","Fish and Wildlife - T&E Species: Declining Species, Species of Concern","Domestic Animals - Inadequate Stock Water","Domestic Animals - Inadequate Quantities and Quality of Feed and Forage","Domestic Animals - Inadequate Shelter ","Domestic Animals - Stress and Mortality","Energy - Inefficient Energy Use - Equipment and Facilities","Energy - Inefficient Energy Use – Farming / Ranching Practices and Field Operations"]
["Access Control",4,4,0,0,4,4,4,4,4,4,0,0,4,2,0,2,2,2,2,2,2,3,0,0,-1,1,2,1,0,3,2,4,3,3,1,2,0,0,2,1,1,1,2,0,1,1,2,0,0,0,0,0,1,0,0,0,2,2,1,0,4,4,3,4,5,3,5,5,5,5,5,2,5,5,5,0,4,0,4,0,0]
["Access Road",-1,0,0,-1,0,0,0,0,0,2,0,0,0,0,0,0,0,0,0,0,0,0,0,-2,-1,0,0,2,0,0,-1,0,0,0,0,0,0,0,1,0,0,0,0,0,0,-1,-1,0,0,0,0,0,0,0,0,0,-2,-2,4,0,0,-3,5,2,0,4,0,0,0,0,-2,0,0,-1,0,0,0,0,0,0,0]
["Agrichemical Handling Facility",0,0,0,0,0,0,0,0,0,0,5,0,0,0,0,0,0,0,5,5,5,0,0,0,0,0,0,0,0,0,0,0,0,0,5,5,0,0,0,0,0,0,0,5,5,0,0,0,0,0,0,0,0,0,0,0,0,0,0,0,0,0,0,0,0,0,0,0,0,0,0,0,0,0,0,0,0,0,0,0,0]
["Alley Cropping",3,5,0,0,0,5,0,0,5,2,3,2,3,5,0,4,4,4,4,4,4,0,-2,0,0,2,2,2,0,1,-2,1,4,0,1,2,1,1,2,1,1,0,2,2,3,0,1,0,4,0,5,0,2,0,0,0,2,2,4,4,4,4,5,5,0,0,0,2,3,3,3,0,0,3,0,0,3,0,0,0,0]
["Anaerobic Digestor",0,0,0,0,0,0,0,0,0,0,0,0,0,0,0,0,0,0,0,0,0,0,0,0,0,0,0,0,0,0,0,0,0,0,0,0,0,0,0,0,0,0,0,0,0,0,0,0,null,null,null,null,null,null,null,null,null,null,null,null,0,0,0,0,0,0,0,0,0,0,0,0,0,0,0,0,0,0,0,0,0]
["Animal Trails and Walkways",0,0,0,0,0,0,0,0,0,3,0,0,0,0,0,0,0,0,0,0,0,0,0,0,0,0,0,0,0,0,0,0,0,0,0,0,0,0,1,0,0,0,0,0,0,0,0,0,0,0,0,0,0,0,0,0,0,0,0,0,0,-1,0,0,1,0,1,0,0,0,-1,0,0,-1,0,0,0,0,1,0,0]
["Aquatic Organism Passage",0,0,0,0,0,0,3,3,0,0,0,0,0,0,0,0,0,0,0,0,0,0,0,0,-3,0,0,1,0,0,3,2,-4,0,0,0,0,0,0,0,0,0,0,0,0,0,0,3,0,0,0,0,0,0,0,0,0,0,0,0,0,0,0,0,0,0,0,4,4,4,4,4,0,4,0,0,0,0,0,0,0]
["Brush Management",3,3,0,-2,0,3,1,1,3,-1,-1,2,2,3,0,0,0,0,0,0,0,3,1,0,2,-2,-2,1,1,2,3,3,3,3,0,0,0,1,3,0,1,0,0,-1,-1,0,0,0,-2,0,-2,0,0,0,0,0,0,0,0,0,4,4,4,3,0,4,3,3,3,3,3,0,3,3,3,0,4,-2,3,0,0]
["Clearing and Snagging",0,0,0,0,0,0,0,3,0,0,0,0,0,0,0,0,0,0,0,0,0,0,0,0,2,0,0,2,0,0,0,2,2,0,0,0,0,0,0,0,0,0,0,0,0,0,0,-1,0,0,0,0,0,0,0,0,0,0,0,0,0,0,0,0,0,0,0,0,-2,-2,-2,-1,0,-2,-1,0,0,0,0,0,0]
["Composting Facility",0,0,0,0,0,0,0,0,0,0,0,0,0,0,0,2,2,2,2,2,2,0,0,0,0,0,0,0,0,0,0,0,0,0,2,2,0,0,0,0,0,2,2,0,0,0,0,0,0,0,0,-1,0,0,0,3,0,0,0,0,0,1,0,0,0,0,0,0,0,0,0,0,0,0,0,0,0,0,0,1,1]
["Conservation Cover",3,5,0,1,0,5,0,3,5,3,3,2,3,3,0,2,2,2,2,2,2,0,1,0,2,2,2,1,0,2,0,3,3,0,2,2,1,1,3,1,2,2,1,3,3,0,0,0,0,0,0,0,1,0,0,0,2,2,1,0,0,4,4,4,3,0,3,3,2,2,2,0,3,2,3,0,0,0,0,1,1]
["Conservation Crop Rotation",1,2,1,0,0,4,0,0,4,2,3,2,3,3,0,4,4,4,4,4,4,0,1,0,2,1,1,0,2,2,0,3,3,0,3,3,2,1,3,1,1,1,1,3,3,0,0,0,0,1,1,0,1,0,0,0,2,2,1,0,0,3,4,4,0,0,0,1,1,1,1,0,0,1,0,0,3,0,0,0,2]
["Contour Buffer Strips",1,2,0,0,0,4,0,1,0,0,0,0,0,0,0,0,0,0,0,0,0,0,0,0,1,-2,-1,0,0,1,0,4,2,0,-1,3,-1,1,3,0,3,-1,1,0,2,0,0,0,0,0,0,0,1,0,0,0,1,1,1,0,0,4,5,3,0,0,0,0,2,2,2,0,0,2,0,0,1,0,0,1,1]
["Contour Farming",1,2,1,0,0,3,0,1,0,0,-1,0,4,2,0,0,0,0,0,0,0,0,0,0,1,-2,-1,0,0,1,0,4,2,0,-1,3,-1,1,3,0,2,0,1,-1,1,0,0,0,0,0,0,0,0,0,0,0,0,0,0,0,0,0,0,1,0,0,0,0,0,0,0,0,0,0,1,0,0,0,0,1,1]
["Contour Orchard and Other Perennial Crops",1,2,1,0,0,3,0,1,0,0,-1,0,4,2,0,0,0,0,0,0,0,0,0,0,1,-2,-1,0,1,1,0,4,2,0,-1,3,-1,1,3,0,2,0,1,-1,1,0,0,0,0,0,0,0,0,0,0,0,0,0,1,2,0,0,0,1,0,0,0,0,0,0,0,0,0,0,1,0,0,0,0,1,1]
["Cover Crop",1,4,1,0,0,4,0,0,4,2,2,1,2,3,0,2,2,2,2,2,2,0,1,0,2,1,1,0,0,3,0,3,3,0,2,2,1,0,2,1,1,2,1,2,2,0,0,0,0,2,0,0,2,1,1,0,3,2,3,0,2,3,5,3,0,0,0,2,2,2,2,0,0,2,0,0,3,0,0,0,2]
["Critical Area Planting",4,2,0,0,5,5,4,4,5,3,1,1,3,5,0,0,0,0,0,0,0,5,0,0,0,0,0,0,0,0,0,5,4,3,1,2,0,0,4,1,2,1,1,0,0,0,0,0,0,0,0,0,1,0,0,0,3,3,2,0,0,4,5,5,1,0,1,1,2,2,2,0,0,2,0,0,1,0,0,0,0]
["Cross Wind Trap Strips",0,0,0,0,0,0,0,0,4,0,0,0,2,2,0,0,0,0,0,0,0,0,0,0,0,0,0,0,0,0,0,4,4,0,0,2,0,1,1,0,0,0,0,0,2,0,0,0,0,0,0,0,1,0,0,0,2,2,2,0,0,4,5,3,0,0,0,0,2,2,2,0,0,2,0,0,1,0,0,0,0]
["Dam",3,0,0,0,0,0,-2,1,0,0,0,0,2,0,0,0,0,0,0,0,0,0,1,0,2,-2,-1,0,3,0,-1,3,0,0,-1,0,0,0,3,0,0,0,-2,0,0,0,0,0,0,0,0,0,0,0,0,0,0,0,0,0,0,0,0,0,0,0,0,2,3,2,2,1,0,-4,0,4,0,0,4,0,0]
["Deep Tillage",1,1,1,-1,0,2,0,1,0,5,2,2,2,0,0,2,2,2,2,2,2,0,1,0,2,-2,-2,1,2,2,0,2,2,0,-2,3,-2,2,2,-1,3,-1,3,-2,3,0,3,0,0,1,0,0,0,0,0,0,0,0,0,0,1,-1,0,3,0,0,0,0,0,0,0,0,0,0,0,0,2,0,0,0,0]
["Dike",1,0,0,0,3,0,0,-2,0,0,0,0,0,0,0,0,0,0,0,0,0,0,0,0,3,-1,-1,-2,0,0,0,1,-1,0,0,0,0,0,0,0,0,0,0,2,2,0,0,0,0,0,0,0,0,0,0,0,0,0,0,0,0,0,0,0,0,0,0,0,-3,-3,1,1,0,-1,0,0,0,0,0,0,0]
["Diversion",3,3,0,2,2,1,0,1,0,0,0,0,2,0,0,0,0,0,0,0,0,0,0,0,3,-1,2,-2,2,2,1,2,2,0,-1,0,0,0,2,0,1,0,1,1,-1,0,-1,0,0,0,0,0,0,0,0,0,0,0,0,0,0,0,0,2,0,0,0,0,0,0,0,0,0,0,0,0,0,0,0,0,0]
["Dust Control from Animal Activity on Open Lot Surfaces",0,0,0,0,0,0,0,0,0,0,0,0,0,0,0,0,0,0,0,0,0,0,-1,0,0,0,0,0,0,0,0,0,0,0,0,0,0,0,0,0,0,0,0,0,0,0,0,0,0,0,0,0,0,0,0,0,4,4,3,0,0,0,0,0,0,0,0,0,0,0,0,0,0,0,0,0,0,0,3,0,0]
["Fence",1,0,0,0,0,0,0,3,0,0,0,0,0,0,0,0,0,0,0,0,0,0,0,0,0,0,0,0,0,0,0,0,0,0,0,0,0,0,0,0,0,0,0,0,0,0,0,0,0,0,0,0,0,0,0,0,0,0,0,0,0,3,0,0,0,0,0,0,0,0,-2,0,0,-2,0,0,1,4,4,0,0]
["Field Border",1,1,0,0,0,1,1,1,4,3,2,1,2,4,0,2,2,2,2,2,2,0,0,0,2,-2,-1,0,0,0,-1,2,2,0,2,2,1,0,3,1,1,0,1,2,2,0,1,0,2,2,0,0,1,0,0,0,1,1,1,1,0,3,5,5,1,0,1,2,2,3,3,0,3,2,3,0,0,0,0,0,0]
["Filter Strip",0,0,0,0,0,0,0,0,0,5,2,1,1,1,0,2,2,2,2,2,2,0,0,0,0,0,0,0,0,0,-1,5,5,0,3,5,1,1,5,1,4,1,1,1,3,0,1,0,0,0,0,0,1,0,0,0,1,1,0,0,0,4,5,5,1,0,1,1,3,3,3,0,0,1,0,0,1,0,0,0,0]
["Firebreak",-1,-1,0,0,0,-1,0,0,-1,-2,-1,0,0,-4,0,0,0,0,0,0,0,0,0,0,0,0,0,0,0,0,0,-1,-1,0,0,0,0,0,-1,0,0,0,0,0,0,0,0,0,0,0,0,0,4,0,1,0,0,0,2,0,0,-2,5,3,3,5,3,0,0,0,-1,0,0,0,0,0,0,0,0,0,0]
["Fish Raceway or Tank",0,0,0,0,0,0,0,0,0,0,0,0,0,0,0,0,0,0,0,0,0,0,-2,0,0,0,0,0,0,0,-2,0,0,0,-1,-1,0,-1,0,0,0,-1,-1,0,0,0,0,-1,0,0,0,0,0,0,0,0,0,0,0,0,0,0,0,0,0,0,0,0,0,0,0,0,0,0,0,0,0,0,4,0,0]
["Fishpond Management",0,0,0,0,0,0,0,0,0,0,0,0,0,0,0,0,0,0,0,0,0,0,0,0,0,0,0,0,0,0,2,0,0,0,-2,0,0,0,0,0,0,0,0,0,0,0,0,0,0,0,0,0,0,0,1,0,-1,-1,0,0,0,4,4,4,1,0,1,3,4,4,4,2,0,0,0,0,0,0,0,0,0]
["Forage and Biomass Planting",1,4,3,0,0,4,0,0,4,4,2,3,2,4,0,4,4,4,4,4,4,0,0,0,2,0,1,1,0,2,1,1,2,0,2,2,1,1,2,1,1,1,1,2,2,0,0,0,0,-1,0,0,1,0,0,0,2,2,0,0,5,4,5,5,0,0,0,1,3,3,1,0,3,0,3,0,5,0,3,0,0]
["Forest Stand Improvement",1,1,0,-2,0,1,0,0,0,-2,0,0,0,-2,0,2,2,2,2,2,2,0,1,0,3,-2,-2,-1,0,3,3,1,1,0,3,3,0,1,0,1,1,1,3,2,2,0,1,-1,-2,0,-1,0,4,0,0,0,0,0,-1,-1,4,4,4,5,3,5,3,3,3,3,3,3,3,3,3,0,4,0,3,1,1]
["Forest Trails and Landings",1,-1,0,0,0,-1,0,0,0,-4,0,0,1,0,0,0,0,0,0,0,0,0,0,0,0,0,0,0,0,0,0,0,0,0,0,1,0,0,0,0,0,0,0,0,0,-1,0,0,0,0,0,0,0,0,0,0,0,0,0,0,0,4,4,2,-3,2,-3,-1,-1,-1,-1,-1,-3,-1,-3,0,2,0,0,0,0]
["Fuel Break",-2,-2,0,0,0,-2,0,0,-2,-2,-1,0,0,-1,0,0,0,0,0,0,0,0,0,0,0,0,0,0,0,0,0,-1,-1,0,0,0,0,0,-1,0,0,0,-1,-1,0,0,0,0,0,0,0,0,4,0,1,0,0,0,2,0,0,-2,5,3,3,5,3,0,0,0,-1,0,3,0,3,0,0,0,0,0,0]
["Grade Stabilization Structure",3,0,0,0,0,0,0,3,0,0,0,0,0,0,0,0,0,0,0,0,0,0,0,0,0,0,0,0,0,0,0,1,1,0,0,0,0,0,2,0,0,0,0,0,0,0,0,0,0,0,0,0,0,0,0,0,0,0,0,0,0,0,0,0,1,0,3,0,2,2,0,1,0,0,0,0,0,0,0,0,0]
["Grassed Waterway",4,5,0,0,2,0,1,1,0,0,-1,-1,1,2,0,-1,-1,-1,-1,-1,-1,0,0,0,3,0,2,4,0,0,0,2,2,0,0,2,0,0,2,0,1,0,1,0,2,0,1,0,0,0,0,0,1,0,0,0,0,0,0,0,0,4,4,5,0,0,0,0,1,1,1,1,0,1,0,0,1,0,0,1,1]
["Grazing Land Mechanical Treatment",1,3,1,-1,0,3,1,1,2,4,0,1,2,2,0,0,-1,0,0,0,0,4,0,0,2,-1,-1,2,2,2,0,1,1,5,-1,2,0,2,2,-1,1,-1,2,-2,2,0,0,0,0,0,0,0,1,0,0,0,-2,-1,0,0,4,-1,3,4,0,0,0,0,2,2,0,1,0,0,0,0,4,0,1,0,0]
["Heavy Use Area Protection",0,3,0,0,3,3,3,3,3,-1,0,0,2,0,0,0,0,0,0,0,0,3,0,0,0,0,0,0,0,0,0,2,2,3,0,1,0,0,2,0,0,0,2,0,0,1,2,0,0,0,0,0,0,0,0,0,2,2,1,0,0,4,0,3,0,0,0,0,0,0,0,0,0,0,0,0,0,0,3,0,0]
["Hedgerow Planting",0,0,0,0,0,0,0,0,1,1,0,0,-1,2,0,0,0,0,0,0,0,0,0,2,0,0,0,0,0,0,0,0,0,0,0,2,0,0,0,0,0,0,0,0,1,0,0,1,4,2,2,0,1,0,0,2,2,2,2,5,0,4,5,3,3,0,3,1,4,4,4,0,0,2,0,0,0,1,0,0,0]
["Herbaceous Weed Control",3,3,1,0,0,3,1,1,3,0,0,0,0,0,0,0,0,0,0,0,0,0,1,0,2,-2,-2,1,0,2,3,3,3,3,0,0,-1,1,3,0,1,0,0,-1,-1,0,0,0,0,0,0,0,0,0,0,0,0,0,0,0,4,4,4,3,0,0,0,3,3,0,3,0,0,3,0,0,4,0,3,0,0]
["Herbaceous Wind Barriers",0,-1,0,0,0,-1,0,0,4,0,0,0,2,2,0,0,0,0,0,0,0,0,0,2,0,0,0,0,0,3,0,2,1,0,0,1,0,1,1,0,1,0,0,0,1,0,0,0,0,0,2,0,1,0,0,0,3,2,2,5,2,3,5,3,0,0,0,0,2,2,2,0,0,2,0,0,1,0,0,0,0]
["Hillside Ditch",3,3,0,0,1,3,0,0,0,0,0,0,1,0,0,0,0,0,0,0,0,0,0,0,4,0,0,-1,0,1,1,-1,-1,0,-1,-1,0,0,2,0,-1,0,-2,0,1,0,-2,0,0,0,0,0,0,0,0,0,0,0,0,0,0,0,0,1,0,0,0,0,0,0,0,1,0,0,0,0,0,0,0,0,0]
["Integrated Pest Management",3,3,3,0,0,3,0,0,3,2,3,0,2,2,2,0,0,0,0,0,0,0,0,0,0,0,0,0,1,1,0,1,1,0,0,0,0,0,3,0,0,0,0,5,5,0,0,0,0,0,5,0,2,0,0,4,2,2,0,0,4,5,4,5,5,3,5,0,3,3,3,0,5,3,5,0,4,0,4,0,0]
["Irrigation Land Leveling",0,1,3,0,0,1,0,0,0,-2,0,-1,3,-2,0,0,0,0,0,0,0,0,1,0,1,0,2,0,4,0,0,1,1,0,2,2,2,0,1,1,1,2,2,2,2,0,1,0,0,0,0,0,0,0,0,0,-1,-1,-1,0,0,1,0,2,0,0,0,0,0,0,0,0,0,0,0,0,0,0,0,0,0]
["Irrigation Pipeline",0,0,0,0,0,0,0,0,0,0,0,0,0,0,0,0,0,0,0,0,0,0,0,0,0,1,1,2,3,0,1,0,0,0,0,1,2,1,1,1,-1,1,-1,0,0,0,0,0,0,0,0,0,0,0,0,0,0,0,0,0,0,0,0,3,0,0,0,0,0,0,0,0,0,0,0,0,0,0,0,0,0]
["Irrigation Reservoir",0,0,0,0,0,0,0,0,0,0,0,0,0,0,0,0,0,0,0,0,0,0,1,0,2,-1,-1,1,3,0,-1,3,0,0,0,0,0,0,0,0,0,0,0,0,0,0,0,0,0,0,0,0,0,0,0,0,0,0,0,0,0,0,0,0,0,0,0,0,0,0,0,0,0,0,0,4,0,0,4,0,0]
["Irrigation System, Microirrigation",0,0,3,0,0,0,0,0,1,0,2,1,0,0,0,0,0,0,0,0,0,0,3,0,3,3,3,5,3,0,3,3,3,0,3,3,3,0,0,1,1,1,3,3,3,1,3,0,0,0,0,0,0,0,0,0,2,2,0,0,0,1,0,3,0,0,0,0,0,0,0,1,0,0,0,0,4,0,0,3,3]
["Irrigation System, Sprinkler",0,0,3,0,0,0,0,0,3,-1,0,3,0,0,0,0,0,0,0,0,0,0,3,0,2,0,1,3,3,0,1,3,3,0,1,2,2,2,0,1,1,1,2,2,2,1,2,0,2,0,0,0,0,0,0,0,2,2,0,0,0,1,0,3,0,0,0,0,0,0,0,1,0,0,0,0,4,0,0,2,2]
["Irrigation Water Management",0,0,3,0,0,0,0,0,3,0,0,3,0,1,0,0,0,0,0,0,0,0,2,0,0,0,1,0,3,0,2,3,3,0,3,3,3,2,3,2,3,2,3,3,3,1,3,0,2,0,0,0,0,0,0,0,3,3,0,0,3,1,0,3,0,0,0,0,0,0,0,0,0,0,0,0,4,0,0,0,0]
["Land Clearing",0,0,0,-1,-2,0,0,0,0,-1,0,0,0,-3,0,0,0,0,0,0,0,0,0,0,-1,0,0,0,0,0,1,-1,-1,0,0,-1,0,0,-1,0,-1,0,-1,0,-1,0,-1,-2,-2,0,0,0,-1,0,0,0,-1,-1,-1,-1,0,-3,0,3,-3,4,0,0,-2,-2,-3,0,-3,-3,-3,0,0,-2,0,0,0]
["Land Reconstruction, Abandoned Mined Land",1,4,0,5,5,4,0,0,4,0,0,0,0,0,0,0,0,0,0,0,0,0,0,0,3,0,0,3,0,0,0,5,5,0,0,0,1,1,4,1,0,0,3,0,0,0,3,0,0,0,0,0,0,0,0,0,0,0,0,0,5,4,5,4,0,0,0,0,2,2,1,0,0,2,0,0,4,0,0,0,0]
["Land Reconstruction, Currently Mined Land",1,4,0,5,5,4,0,0,4,0,0,0,0,0,0,0,0,0,0,0,0,0,0,0,3,0,0,3,0,0,0,5,5,0,0,0,1,1,4,1,0,0,3,0,0,0,3,0,0,0,0,0,0,0,0,0,0,0,0,0,5,4,5,4,0,0,0,0,2,2,1,0,0,2,0,0,4,0,0,0,0]
["Land Smoothing",0,1,1,0,0,0,0,0,0,-2,0,-1,3,-2,0,0,0,0,0,0,0,0,0,0,3,3,3,0,3,3,0,0,0,0,2,1,0,0,1,0,1,0,0,1,1,0,0,0,0,0,0,0,-1,0,0,0,-2,-2,-2,0,0,3,0,3,0,0,0,-1,0,0,-1,0,-1,-1,-1,0,0,0,0,0,0]
["Lined Waterway or Outlet",3,5,0,0,2,0,0,0,0,0,0,0,1,0,0,0,0,0,0,0,0,0,0,0,2,2,2,-1,0,0,1,2,2,0,2,0,0,0,2,0,0,0,0,0,0,0,0,0,0,0,0,0,0,0,0,0,0,0,0,0,0,0,0,0,0,0,0,-1,-2,-2,0,0,-1,0,-1,0,0,0,0,0,0]
["Mulching",1,4,3,-1,4,4,1,2,4,2,1,2,1,3,0,1,0,1,1,0,1,0,1,0,2,-1,-1,1,3,3,0,3,3,0,-1,2,-1,1,2,0,1,0,1,1,2,0,0,0,2,0,0,-1,1,0,0,0,2,2,2,0,0,3,0,3,1,0,1,0,1,1,0,0,0,0,0,0,2,0,0,0,0]
["Multi-Story Cropping",3,3,0,3,0,4,0,0,4,3,3,2,3,5,1,4,4,4,4,4,4,0,0,2,-2,2,2,0,0,2,0,1,4,0,0,2,0,1,4,1,0,1,2,1,3,0,1,0,4,0,5,0,2,0,0,2,2,2,0,1,4,4,5,5,0,2,0,0,3,3,3,0,0,3,0,0,4,3,0,0,0]
["Nutrient Management",0,0,-1,0,0,0,0,0,0,0,0,2,1,2,0,2,2,2,2,2,2,0,0,0,0,0,0,0,0,0,0,0,0,0,5,5,1,1,0,2,3,1,1,0,0,0,0,0,0,2,0,2,1,1,3,4,2,3,2,0,4,0,1,3,0,0,0,0,1,1,0,0,0,3,0,2,4,0,3,0,0]
["Open Channel",0,0,0,0,0,0,0,3,0,0,0,0,1,0,0,0,0,0,0,0,0,0,0,0,5,1,3,5,0,0,3,2,-2,0,0,-1,0,0,0,0,-1,0,0,0,0,0,0,0,0,0,0,0,0,0,0,0,0,0,0,0,0,0,0,0,0,0,0,1,1,1,1,0,1,-2,1,0,0,0,0,0,0]
["Pipeline",0,0,0,0,0,0,0,0,0,0,0,0,0,0,0,0,0,0,0,0,0,0,0,0,0,0,0,0,0,0,0,0,0,0,0,0,0,0,0,0,0,0,0,0,0,0,0,0,0,0,0,0,0,0,0,0,0,0,0,0,0,0,0,2,0,0,0,0,0,0,0,0,0,0,0,5,0,0,4,0,0]
["Pond",3,0,0,0,0,0,0,0,0,0,0,0,2,0,0,0,0,0,0,0,0,0,1,0,2,-2,-1,0,0,0,-1,3,0,0,-1,2,0,0,3,0,0,0,-2,0,0,0,0,0,0,0,0,0,0,0,0,0,0,0,0,0,0,0,0,2,0,0,0,2,3,3,2,4,5,2,5,5,0,0,4,0,0]
["Pond Sealing or Lining, Compacted Clay Treatment",0,0,0,0,0,0,1,0,0,0,0,1,0,0,0,1,1,1,1,1,0,0,-1,0,0,1,2,0,3,3,0,0,0,0,2,2,3,0,0,1,0,3,0,0,0,0,0,0,0,0,0,0,0,0,0,0,0,0,0,0,0,0,0,1,0,0,0,1,1,1,1,1,1,1,1,4,0,0,3,0,0]
["Pond Sealing or Lining, Flexible Membrane",0,0,0,0,0,0,1,0,0,0,0,1,0,0,0,1,1,1,1,1,0,0,-1,0,0,1,2,0,3,3,0,0,0,0,3,2,3,0,0,1,0,3,0,0,0,0,0,0,0,0,0,0,0,0,0,0,0,0,0,0,0,0,0,1,0,0,0,1,1,1,1,1,1,1,1,4,0,0,3,0,0]
["Precision Land Forming",4,2,0,0,2,0,0,0,0,-1,0,1,2,-2,0,1,1,1,1,1,1,0,0,0,3,3,3,0,0,3,0,0,0,0,2,1,1,0,1,1,1,1,0,1,1,0,0,0,0,0,0,0,-1,0,0,0,0,0,0,0,0,0,0,4,0,0,0,0,0,0,0,0,0,0,0,0,0,0,0,0,0]
["Prescribed Grazing",2,4,2,0,0,4,1,3,4,3,2,2,3,4,0,2,2,2,2,2,2,5,0,0,2,0,1,1,-1,2,0,1,1,4,1,1,1,2,3,1,1,1,1,2,2,0,0,0,0,0,0,0,2,0,0,0,2,2,2,0,4,4,4,5,1,3,1,3,3,3,4,0,3,4,3,0,5,3,4,0,0]
["Pumping Plant",0,0,0,0,0,0,0,0,0,0,0,0,0,0,3,0,0,0,0,0,0,0,1,0,2,2,2,2,3,3,0,0,0,0,0,0,0,0,0,0,0,0,0,0,0,-1,0,0,0,0,0,0,3,0,2,0,0,0,1,0,0,0,0,3,0,0,0,0,0,0,0,0,0,0,0,5,0,0,4,4,4]
["Range Planting",3,4,0,0,0,4,2,2,4,4,3,1,3,4,1,2,2,2,2,2,2,4,0,0,2,0,0,1,0,3,2,4,2,4,2,1,1,1,3,1,2,1,1,2,2,0,0,0,0,0,0,0,2,0,0,0,2,2,2,0,5,4,5,5,3,0,3,2,3,3,4,0,3,4,3,0,5,0,3,0,0]
["Recreation Area Improvement",1,4,0,0,0,4,1,1,4,2,0,2,3,3,0,0,0,0,0,0,0,0,0,0,2,0,0,0,0,0,0,5,2,0,0,0,0,0,4,0,0,0,0,2,2,0,0,0,4,0,0,0,2,0,0,0,1,1,1,0,0,4,5,5,-1,3,-1,0,2,2,-2,2,-3,-1,-3,0,0,0,0,0,0]
["Recreation Land Grading and Shaping",4,0,0,0,0,0,3,2,0,0,0,0,2,1,0,0,0,0,0,0,0,0,0,0,2,0,0,2,0,0,0,0,0,0,0,0,0,0,2,0,0,0,0,0,0,0,0,0,0,0,0,0,-1,0,0,0,0,0,1,0,0,4,0,3,-1,0,-1,0,-2,-2,-2,0,-3,-1,-3,0,0,0,0,0,0]
["Recreation Trail and Walkway",4,0,0,1,3,0,3,3,0,2,0,0,0,0,0,0,0,0,0,0,0,0,0,0,2,0,0,0,0,1,0,2,2,0,0,0,0,0,2,0,0,0,-2,0,0,0,0,0,0,0,0,0,0,0,0,0,0,0,1,0,0,-1,5,4,-1,2,-1,0,-2,-2,-2,0,-3,-1,-3,0,0,0,0,0,0]
["Residue and Tillage Management, No-Till/Strip Till/Direct Seed",1,4,3,-1,0,4,0,0,4,2,0,1,3,3,0,0,0,0,0,0,0,0,1,0,2,-1,0,0,2,3,0,3,3,0,-1,1,-1,1,3,1,1,0,1,1,4,0,0,0,0,0,-2,0,2,0,2,1,3,3,3,0,0,0,0,2,0,0,0,2,2,2,1,0,1,0,1,0,1,0,0,4,4]
["Residue Management, Seasonal",1,1,2,0,0,2,0,0,3,0,0,1,2,1,0,0,0,0,0,0,0,0,1,0,1,-1,0,0,1,1,0,1,2,0,-1,1,-1,1,1,1,1,0,1,-1,1,0,0,0,0,0,0,0,1,0,0,0,2,2,2,0,0,0,0,2,0,0,0,2,2,2,1,0,1,0,1,0,1,0,0,0,0]
["Restoration and Management of Declining Habitats",0,2,0,0,0,2,0,0,2,0,0,-1,0,0,0,0,0,0,0,0,0,3,0,0,0,0,0,0,0,0,0,0,0,0,0,0,0,0,2,0,0,0,0,0,0,0,0,2,0,0,0,0,1,0,0,0,0,0,0,2,4,4,4,4,5,0,5,5,5,5,5,5,5,5,5,0,2,0,0,0,0]
["Riparian Forest Buffer",3,1,0,3,0,2,3,3,2,4,2,1,2,4,0,3,3,3,3,3,3,0,0,0,-1,2,2,0,0,0,4,5,5,3,5,5,1,1,4,1,2,2,3,2,3,0,1,3,4,0,2,0,4,0,0,1,1,1,2,3,4,4,4,5,5,0,5,4,5,5,5,3,5,5,5,0,4,4,4,0,0]
["Riparian Herbaceous Cover",1,1,0,1,0,2,4,4,2,4,2,2,2,4,0,3,3,3,3,3,3,3,0,0,0,2,2,0,0,0,4,4,5,3,5,5,1,1,4,1,2,2,3,2,3,0,1,2,0,0,0,0,2,0,0,0,1,1,0,0,4,4,4,5,3,0,3,5,5,5,5,3,5,5,5,0,4,0,4,0,0]
["Rock Barrier",0,5,0,1,0,5,0,0,0,0,0,0,-2,0,0,0,0,0,0,0,0,0,1,2,0,1,1,1,0,0,0,1,1,0,0,0,-1,1,2,0,0,0,1,0,0,0,0,0,0,0,0,0,0,0,0,0,0,0,1,1,0,0,0,1,0,0,0,0,0,0,0,0,0,0,0,0,0,0,0,0,0]
["Roof Runoff Structure",1,3,0,0,0,1,1,1,0,0,0,0,1,0,0,0,0,0,0,0,0,0,1,0,-1,1,1,0,0,3,2,1,1,0,2,2,0,2,1,0,0,0,3,0,0,2,0,0,0,0,0,0,0,0,0,0,0,0,0,0,0,0,0,0,0,0,0,0,0,0,0,0,0,0,0,3,0,0,0,0,0]
["Roofs and Covers",0,0,0,0,0,0,0,0,0,0,0,0,0,0,0,0,0,0,0,0,0,0,0,0,-1,0,0,0,0,0,0,0,0,0,0,0,0,0,0,1,1,1,0,0,0,0,0,0,0,2,0,2,0,0,0,2,0,0,0,0,0,0,0,0,0,0,0,0,0,0,0,0,0,0,0,0,0,0,0,1,1]
["Row Arrangement",0,3,3,0,0,3,0,0,1,0,0,1,2,1,0,1,1,1,1,1,1,0,1,0,2,-1,-1,0,4,4,1,1,1,0,2,-2,0,0,2,0,0,0,1,-1,1,0,0,0,0,0,0,0,0,0,0,0,0,0,0,0,0,0,0,1,0,0,0,0,0,0,0,0,0,0,0,0,0,0,0,0,0]
["Seasonal High Tunnel System for Crops",0,0,2,0,0,2,0,0,2,1,0,0,0,1,0,0,0,0,0,0,0,0,-1,0,-3,2,0,0,1,1,0,0,0,0,1,2,1,0,1,0,0,0,0,1,1,0,0,0,3,0,1,0,0,1,0,0,1,1,0,1,0,0,2,3,0,0,0,0,0,0,0,0,0,0,0,0,0,0,0,0,0]
["Sediment Basin",2,0,0,-1,0,0,0,0,0,0,0,0,5,0,0,0,0,0,0,0,0,0,1,0,2,-2,-2,3,0,0,-1,4,4,0,-1,5,-1,2,4,-1,2,-1,2,-1,2,0,2,0,0,0,0,0,0,0,0,0,0,0,0,0,0,0,0,0,0,0,0,1,-1,-1,0,1,0,0,0,1,0,0,0,0,0]
["Shallow Water Development and Management",0,0,0,0,0,0,3,0,0,0,0,0,0,1,0,0,0,0,0,0,0,0,0,0,3,0,0,0,0,0,0,0,3,0,1,1,-1,0,2,1,2,-1,2,1,1,0,0,0,0,0,0,-1,0,0,0,0,0,0,0,0,0,1,4,3,1,0,1,5,3,4,4,2,3,2,3,0,1,0,0,0,0]
["Silvopasture Establishment",2,5,2,1,0,5,3,3,5,0,0,0,0,4,0,1,1,1,1,1,1,0,0,2,2,1,1,1,-1,2,0,2,1,0,2,5,1,1,3,1,1,0,2,2,3,1,1,2,4,0,2,0,5,0,0,1,2,2,3,2,5,4,4,5,0,3,0,4,5,4,2,0,0,0,0,0,5,4,4,0,0]
["Solid/Liquid Waste Separation Facility",0,0,0,0,0,0,0,0,0,0,0,0,0,1,0,2,2,2,0,0,0,0,0,0,0,0,0,0,1,0,0,0,0,0,3,3,2,2,0,2,2,2,2,0,0,0,0,0,0,3,0,2,1,1,0,4,0,2,0,0,2,0,0,0,0,0,0,0,0,0,0,0,0,0,0,1,0,0,2,0,0]
["Spring Development",1,0,0,1,0,0,0,1,0,-1,0,0,0,0,0,2,2,2,2,2,2,0,0,0,1,2,2,0,2,2,-1,0,0,0,0,0,0,1,1,0,2,0,1,0,0,0,1,0,0,0,0,0,0,0,0,0,0,0,0,0,0,0,0,2,3,0,3,3,3,3,3,5,3,3,3,5,3,0,4,0,0]
["Stream Crossing",0,0,0,0,0,0,0,3,0,0,0,0,1,0,0,0,0,0,0,0,0,0,0,0,0,0,0,0,0,0,0,0,1,0,0,-1,0,0,2,0,0,0,-3,0,0,0,0,0,0,0,0,0,0,0,0,0,0,0,0,0,0,0,0,0,0,0,0,1,0,0,0,0,0,0,1,3,3,0,4,0,0]
["Stream Habitat Improvement and Management",0,0,0,0,0,0,0,5,0,0,0,0,0,0,0,0,0,0,0,0,0,0,0,0,0,0,0,0,0,0,0,0,0,0,0,1,0,0,3,0,0,0,0,0,0,0,0,3,4,0,0,0,1,0,0,0,0,0,0,0,0,4,4,4,3,0,3,3,3,3,4,3,3,4,3,0,2,4,4,0,0]
["Streambank and Shoreline Protection",0,0,0,4,0,0,4,4,0,0,0,0,2,0,0,0,0,0,0,0,0,0,0,0,0,0,0,0,0,0,0,3,3,0,0,1,0,0,3,0,0,0,1,0,0,0,0,1,4,0,0,0,1,0,0,0,0,0,0,0,0,4,4,4,3,0,3,1,2,2,2,0,3,2,3,0,1,0,0,0,0]
["Stripcropping",1,4,0,0,0,4,0,0,4,0,0,0,4,2,0,0,0,0,0,0,0,0,0,0,1,-2,-1,0,0,1,0,4,2,0,-1,3,-1,1,3,-1,3,-1,1,0,2,0,0,0,0,0,0,0,0,0,0,0,3,3,1,0,0,0,0,3,0,0,0,0,1,1,1,0,1,1,1,0,0,0,0,0,0]
["Structure for Water Control",0,0,0,0,1,0,0,0,0,0,0,0,2,0,0,0,0,0,0,0,0,0,0,0,2,0,0,0,3,3,2,2,2,0,0,0,0,0,1,0,0,0,0,0,0,0,0,1,0,0,0,0,0,0,0,0,0,0,0,0,0,0,0,0,1,0,1,1,1,1,1,2,1,1,1,1,0,0,0,0,0]
["Surface Drainage, Field Ditch",-1,2,0,0,0,0,0,0,-1,1,1,2,0,-2,-1,1,1,1,1,1,1,0,-1,0,3,0,3,-3,3,3,2,-2,-2,0,1,-2,1,-2,-2,1,-2,1,-2,1,0,0,-2,0,0,0,0,0,0,0,0,0,0,0,0,0,3,0,0,2,0,0,0,0,0,0,0,0,0,0,0,0,4,0,0,0,0]
["Surface Drainage, Main or Lateral",-1,2,0,0,0,0,0,0,-1,0,0,0,0,0,0,0,0,0,0,0,0,0,-1,0,3,0,3,-3,3,3,2,-2,-2,0,1,-2,2,-2,-2,2,-2,2,-2,0,0,0,-2,0,0,0,0,0,0,0,0,0,0,0,0,0,3,0,0,2,0,0,0,-1,0,0,0,0,0,0,0,0,4,0,0,0,0]
["Terrace",2,4,1,-1,0,5,0,1,1,-1,0,0,2,1,0,0,0,0,0,0,0,0,1,0,4,-2,-2,2,0,3,-1,2,2,0,-2,2,-2,2,3,-1,2,-1,2,-2,3,0,2,0,0,0,0,0,0,0,0,0,0,0,0,0,0,0,0,2,0,0,0,0,0,0,0,0,0,0,0,0,0,0,0,1,1]
["Tree/Shrub Establishment",2,4,0,3,2,5,0,0,5,2,2,2,0,4,0,2,2,2,2,2,2,0,-2,2,-1,2,2,2,0,2,2,4,4,0,2,2,1,1,4,1,1,4,3,4,4,0,1,2,5,0,2,0,5,0,0,2,2,2,3,4,5,4,5,5,5,0,5,5,5,3,5,0,5,4,5,0,2,4,4,1,1]
["Tree/Shrub Pruning",0,0,0,0,0,1,0,0,0,0,0,0,0,-1,0,1,1,1,1,1,1,0,0,0,0,0,0,0,0,0,0,0,0,0,1,1,0,0,0,0,0,0,0,1,1,0,0,0,0,0,0,0,0,0,0,0,0,0,0,0,0,0,0,5,0,2,0,0,1,1,0,0,0,0,0,0,2,-3,0,0,0]
["Tree/Shrub Site Preparation",-2,-2,0,0,0,-1,0,0,-1,-1,0,0,0,-2,0,0,0,0,0,0,0,0,0,0,0,0,0,0,0,4,0,0,0,0,0,0,0,0,-1,0,0,0,0,0,0,0,0,0,0,0,0,0,1,0,0,0,-2,-1,1,0,0,4,4,5,0,4,0,0,0,0,0,0,0,0,0,0,0,-1,0,0,0]
["Underground Outlet",4,5,0,1,2,0,0,-1,0,0,0,0,2,0,0,0,0,0,0,0,0,0,0,0,4,0,0,3,0,0,0,2,2,0,0,0,0,0,0,0,1,0,1,0,0,0,1,0,0,0,0,0,0,0,0,0,0,0,0,0,0,0,0,0,0,0,0,0,0,0,0,0,0,0,0,0,0,0,0,1,1]
["Upland Wildlife Habitat Management",2,3,0,1,0,3,1,1,3,0,0,0,0,0,0,0,0,0,0,0,0,3,0,0,-3,0,2,0,0,0,1,1,1,2,0,0,0,0,2,0,0,0,0,0,0,0,0,0,3,0,0,0,1,0,0,0,2,2,1,2,4,4,4,4,5,3,5,5,5,5,5,0,5,5,5,0,2,0,0,0,0]
["Vegetative Barrier",2,5,0,0,2,4,1,1,1,-1,0,0,2,0,0,-2,-2,-2,-2,-2,-2,0,1,0,0,0,2,2,3,3,2,5,5,0,-1,2,-1,1,2,-1,2,0,2,-1,2,0,1,0,0,2,0,0,1,0,0,0,0,0,1,1,0,0,2,3,0,0,0,1,1,1,1,1,1,1,1,0,1,1,0,0,0]
["Waste Storage Facility",0,0,0,0,0,0,0,0,0,1,0,0,0,1,0,2,2,2,2,2,2,0,0,0,0,0,0,0,1,0,-1,0,0,0,2,4,1,2,0,1,0,2,2,0,0,0,0,0,0,2,0,-2,0,0,0,-2,0,0,0,0,0,0,0,2,0,0,0,0,0,0,0,0,0,0,0,0,0,0,0,0,0]
["Waste Transfer",0,-1,0,0,0,-1,0,0,-1,-1,0,0,0,0,0,0,0,0,0,0,0,0,0,0,0,0,0,0,0,1,0,0,0,0,2,3,2,2,0,0,0,2,3,0,0,0,0,0,0,-2,0,-2,0,0,0,-1,-1,-1,-1,0,0,-1,0,0,0,0,0,0,0,0,0,0,0,0,0,0,0,0,0,0,0]
["Waste Treatment",0,0,0,0,0,0,0,0,0,1,0,0,0,1,0,2,2,2,0,0,0,0,0,0,0,0,0,0,1,0,0,0,0,0,3,3,2,2,0,2,2,2,2,0,0,0,0,0,0,4,0,3,1,1,0,4,1,4,0,0,2,0,0,2,0,0,0,0,0,0,0,0,0,0,0,1,0,0,3,0,0]
["Waste Treatment Lagoon",0,0,0,0,0,0,0,0,0,1,0,0,0,1,0,3,3,3,3,3,3,0,0,0,0,0,0,0,1,0,0,0,0,0,2,4,1,2,0,1,0,2,4,0,0,0,0,0,0,2,0,-1,2,2,0,-1,0,0,0,0,0,0,0,2,0,0,0,1,0,1,1,1,1,0,0,0,0,0,0,1,1]
["Waste Utilization",0,1,2,0,1,1,0,0,1,0,1,0,1,3,0,0,0,0,0,0,0,0,0,0,0,0,0,0,2,2,0,0,0,0,2,2,2,2,0,0,0,2,0,2,0,0,0,0,0,2,0,0,2,1,2,4,-1,-1,1,0,4,0,3,3,0,0,0,0,0,0,0,0,0,0,0,0,4,0,3,0,0]
["Water and Sediment Control Basin",3,2,0,0,3,0,0,0,0,0,0,0,3,0,0,0,0,0,0,0,0,0,0,0,2,-2,-2,1,0,0,1,4,4,0,-1,2,-1,1,4,-1,2,-1,2,-1,2,0,2,-2,0,0,0,0,0,0,0,0,0,0,0,0,0,0,0,0,0,0,0,0,-1,-1,0,2,0,0,0,1,0,0,0,0,0]
["Water Harvesting Catchment",0,0,0,0,0,0,0,0,0,0,0,0,0,0,0,0,0,0,0,0,0,0,1,0,0,1,0,0,3,0,0,0,0,0,0,0,0,0,0,0,0,0,0,0,0,0,0,0,0,0,0,0,0,0,0,0,0,0,0,0,0,0,0,3,0,0,0,0,0,0,2,0,1,2,1,5,0,0,4,0,0]
["Watering Facility",1,2,0,0,0,2,4,4,2,0,0,0,0,0,0,0,0,0,0,0,0,0,0,0,0,0,0,0,0,0,0,1,1,0,0,0,0,1,2,0,1,-1,1,0,0,0,0,1,0,0,0,0,0,0,0,0,0,0,0,0,0,0,0,2,0,0,0,0,0,0,2,2,0,2,0,5,3,0,4,0,0]
["Wetland Creation",0,0,0,0,0,0,3,0,0,0,0,0,0,2,0,1,1,1,1,1,1,0,1,0,3,0,-1,3,0,0,-1,0,3,0,1,3,0,1,2,0,2,0,1,1,1,0,0,0,3,0,0,-1,2,0,0,-1,0,0,1,0,0,4,4,4,3,0,3,5,5,5,5,5,5,5,5,0,2,0,0,0,0]
["Wetland Enhancement",0,0,0,0,0,0,3,0,0,0,0,0,0,1,0,1,1,1,1,1,1,0,0,0,3,0,0,3,0,0,0,0,3,0,1,3,0,1,2,0,2,0,1,1,1,0,0,0,3,0,0,-1,2,0,0,-1,0,0,0,0,0,4,4,4,5,0,5,5,5,5,5,5,5,5,5,0,2,0,0,0,0]
["Wetland Restoration",0,0,0,0,0,0,3,0,0,0,0,0,0,1,0,1,1,1,1,1,1,0,0,0,3,0,0,3,0,0,0,0,3,0,1,3,0,1,2,0,2,0,1,1,1,0,0,0,3,0,0,-1,2,0,0,-1,0,0,1,0,0,4,4,4,5,0,5,5,5,5,5,5,5,5,5,0,2,0,0,0,0]
["Wetland Wildlife Habitat Management",0,0,0,0,0,0,3,0,0,0,0,0,0,0,0,0,0,0,0,0,0,0,0,0,3,0,0,0,0,0,0,0,0,0,0,0,0,0,3,0,0,0,1,0,0,0,0,0,3,0,0,-1,2,0,0,-1,0,0,0,2,0,4,4,4,5,0,5,5,5,5,5,5,5,5,5,0,2,0,0,0,0]
["Windbreak/Shelterbelt Establishment",0,1,0,1,0,1,0,0,5,2,1,1,-2,1,0,2,2,2,2,2,2,0,-2,5,-1,2,2,0,5,2,-2,1,1,0,5,1,0,0,2,0,1,0,0,0,2,0,1,0,4,2,3,0,2,0,0,2,2,2,2,5,4,4,5,5,1,0,1,3,3,3,3,0,3,3,3,0,1,5,5,1,1]
["Windbreak/Shelterbelt Renovation",0,1,0,1,0,1,0,0,5,2,1,1,-2,1,0,2,2,2,2,2,2,0,-2,5,-1,2,2,0,5,2,-2,1,1,0,5,5,0,0,1,0,1,0,0,0,2,0,1,0,4,2,3,0,1,0,0,2,2,2,2,5,4,4,5,5,1,0,1,3,3,3,3,0,3,3,3,0,1,5,5,1,1]
["Woody Residue Treatment",1,2,0,0,0,2,0,0,2,-2,0,0,2,3,0,0,0,0,0,0,0,0,0,0,0,0,0,0,0,1,0,1,1,0,0,0,0,0,1,0,0,0,0,0,0,-1,0,0,0,0,0,0,3,0,1,0,-1,-1,0,0,4,4,4,5,0,4,0,0,0,0,0,0,0,0,0,0,0,-1,0,0,0]