{"text_format":"1","workbook":"xlsx","n_sheets":19,"sheets":["LivestockForageBalance","TimeControlWorksheet","Summary","Instructions","Field Worksheet","Explanation sheet for L.O. ","Module1","Module2","Module3","Calculations","ForageGrowthCurves","Hay Loss Storage","PastureGrazingEfficiency","HayList","FSGTables","PrintableLivestockInventory","PrintableGrazingInventory","PrintableSummaryBalance","PrintableHayInventory"],"not_rendered":{"charts":3,"images":16,"macros":1,"external_links":0,"defined_names":617,"comments":2,"pivot_tables":0},"unopened":[{"sheet":"Module1","index":6,"reason":"part_missing"},{"sheet":"Module2","index":7,"reason":"part_missing"},{"sheet":"Module3","index":8,"reason":"part_missing"}],"bounds":{"document_bytes":16777216,"sheet_cells":100000,"rows_first":2000,"rows_last":500,"rows_between":2000,"halvings":0,"cell_chars":16384,"cell_head_chars":4096},"cells_cut":0,"cells_raw":0,"read":"whole","date_system":"1900"}

{"sheet":"LivestockForageBalance","index":0,"n_rows":314,"n_cols":25,"rows_kept":314,"cut":false,"hidden":false,"merged":[[232,9,232,12],[102,6,103,6],[130,6,131,6],[112,6,113,6],[207,6,207,14],[206,5,206,14],[193,5,193,24],[195,4,197,5],[195,13,196,24],[132,6,133,6],[134,6,135,6],[136,6,137,6],[138,6,139,6],[140,6,141,6],[142,6,143,6],[144,6,145,6],[146,6,147,6],[148,6,149,6],[0,5,0,25],[1,9,1,17],[226,6,226,24],[96,5,96,24],[99,13,100,24],[1,5,1,7],[99,4,101,5],[122,6,123,6],[114,6,115,6],[116,6,117,6],[118,6,119,6],[120,6,121,6],[74,7,74,12],[75,7,75,12],[51,7,51,12],[4,9,4,17],[26,7,26,9],[42,7,42,12],[43,7,43,12],[44,7,44,12],[48,7,48,12],[50,7,50,12],[49,7,49,12],[45,7,45,12],[2,5,2,24],[240,7,240,11],[230,8,230,11],[231,9,231,12],[236,8,236,11],[90,9,90,11],[91,9,91,11],[92,9,92,11],[90,7,90,8],[91,7,91,8],[92,7,92,8],[239,7,239,11],[237,9,237,12],[62,7,62,12],[68,7,68,12],[11,11,11,12],[46,7,46,12],[59,7,59,12],[55,7,55,12],[57,7,57,12],[56,7,56,12],[58,7,58,12],[54,7,54,12],[60,7,60,12],[5,19,9,24],[253,8,253,12],[255,8,255,12],[156,9,157,9],[224,4,224,7],[223,6,223,7],[209,4,211,5],[154,6,154,13],[155,6,155,13],[11,13,11,24],[25,7,25,9],[247,7,247,12],[189,5,189,24],[61,7,61,12],[41,8,41,9],[188,5,188,24],[104,6,105,6],[106,6,107,6],[108,6,109,6],[110,6,111,6],[124,6,125,6],[126,6,127,6],[128,6,129,6],[245,17,247,22],[263,10,263,12],[266,7,266,12],[243,7,243,14],[251,7,251,14],[257,8,257,12],[248,8,248,12],[249,7,249,12],[261,7,261,12],[254,9,254,12],[258,9,258,12],[259,10,259,12],[262,9,262,12],[264,10,264,14],[245,7,245,12],[243,17,243,22],[15,7,15,8],[17,7,17,8],[19,7,19,8],[27,7,27,8],[29,7,29,8],[31,7,31,8],[35,7,35,8],[33,7,33,8],[191,5,191,24],[190,5,190,24],[53,7,53,12],[72,7,72,12],[67,7,67,12],[70,7,70,12],[71,7,71,12],[76,7,76,12],[66,7,66,12],[228,7,228,11],[234,7,234,11],[229,7,229,11],[235,7,235,11],[97,5,97,24],[99,9,100,9]]}
[null,null,null,null,null,"LIVESTOCK-FORAGE BALANCE WORKSHEET"]
[null,null,null,null,null,null,null,null,null,"LIVESTOCK NEEDS AND DEMAND SCHEDULE"]
[null,null,null,null,null,"Start by using the \"Save As\" option to save a copy of the model to your computer.  Enter the general information for the producer you are working with into the yellow cells.  Then select the livestock class (or classes) to model by slecting the check box next to the livestock class name.  You can select as many livestock classes to model as needed.  If you selected a livestock class in error, clicking the check box again will remove that livestock class from the chosen options.   Depending on the livestock class chosen, there may be additional management information to enter by selecting the button for \"Mgt Info\" next to the livestock class name.    Enter the managment information within the button (if available) and then enter the required information in the yellow cells to capture the total forage demand.  For Cow/Calf, Dairy, Bulls, and Horses livestock classes the \"Mgt Info\" button will have options to manage the animals on the grazing system all year or an alternative pasture or a dry lot for a portion of the year.  The selected option will be reflected directly below the livestock class name. "]
[]
[null,null,null,null,null,null,null,"General Info",null,"Select Livestock Class (select as many as needed)",null,null,null,null,null,null,null,null,null,"Notes:  (Use this area to make any notes specific to the model)"]
[null,null,null,null,null,null,"Name:"]
[null,null,null,null,null,null,"System ID:",""]
[null,null,null,null,null,null,"Date:",""]
[null,null,null,null,null,null,"County:",""]
[null,null,null,null,null,null,"Completed by:"]
{"$rows_left_out":305}
{"sheet":"TimeControlWorksheet","index":1,"n_rows":57,"n_cols":11,"rows_kept":57,"cut":false,"hidden":false,"merged":[[56,1,56,10],[55,1,55,10],[3,2,4,9],[8,2,8,3],[9,2,9,3],[10,2,10,3]]}
[]
[null,null,null,null," TIME CONTROL GRAZING WORKSHEET"]
[]
[null,null,"Only enter the additional information needed as indicated by the yellow cells.  The remaining cells and infomration will populate automatically based on the information entered into the Livestock Forage Balance Worksheet."]
[]
[null,null,null,"Name:",{"$f":"LivestockForageBalance!$H$6","v":0},null,null,"County:",{"$f":"LivestockForageBalance!$H$9","v":""}]
[null,null,null,"System ID:",{"$f":"LivestockForageBalance!$H$7","v":""},null,null,"Date:",{"$f":"LivestockForageBalance!$H$8","v":""}]
[]
[null,null,"  Minimum Rest Period =",null,null,"days",null,"Avg Animal Weight =",{"$f":"LivestockForageBalance!$J$41","v":0},"pounds"]
[null,null,"  Maximum Rest Period =",null,null,"days",null,"Animal Numbers =",{"$f":"LivestockForageBalance!$I$41","v":0},"head"]
{"$rows_left_out":48}
{"sheet":"Summary","index":2,"n_rows":74,"n_cols":6,"rows_kept":74,"cut":false,"hidden":false,"merged":[[9,1,9,3],[60,1,61,5],[70,1,70,5],[71,1,71,5],[1,1,1,5]]}
[]
[null,"DETAILED SUMMARY"]
[]
[null,"Name:",{"$f":"LivestockForageBalance!$H$6","v":0}]
[null,"System ID:",{"$f":"LivestockForageBalance!$H$7","v":""}]
[null,"County:",{"$f":"LivestockForageBalance!$H$9","v":""}]
[null,"Date:",{"$f":"LivestockForageBalance!$H$8","v":""}]
[null,"By:",{"$f":"LivestockForageBalance!$H$10","v":0}]
[null,"LIVESTOCK"]
[null,"The class(es) of livestock used to make these calculations is:"]
{"$rows_left_out":65}
{"sheet":"Instructions","index":3,"n_rows":173,"n_cols":5,"rows_kept":173,"cut":false,"hidden":false,"merged":[[169,2,169,3],[172,2,172,3],[18,2,18,3],[19,2,19,3],[20,2,20,3],[21,2,21,3],[29,2,29,3],[30,2,30,3],[31,2,31,3],[159,2,159,3],[161,2,161,3],[164,2,164,3],[166,2,166,3],[82,2,82,3],[89,2,89,3],[157,2,157,3],[49,2,49,3],[77,2,77,3],[79,2,79,3],[35,2,35,3],[42,2,42,3],[37,2,37,3],[39,2,39,3],[40,2,40,3],[41,2,41,3],[60,2,60,3],[63,2,63,3],[50,2,50,3],[52,2,52,3],[53,2,53,3],[56,2,56,3],[58,2,58,3]]}
[]
[null,null,null,"GRAZE4.XLSM"]
[null,null,null,"version 3.3"]
[null,null,null,"You must have Macros Enabled in order to utilize the full functionality of the model."]
[]
[null,null,null,"August, 1999; revised April 2000, revised December 2003; revised December 2010; revised April 2013, September 2017."]
[null,null,null,"Oroginally developed in NRCS, Missouri, Area 4 by Pat Adams, Area Resource Conservationist (Springfield, MO) for use in inventory, documentation, and planning for Prescribed Grazing systems."]
[]
[null,null,null,"For Assistance Contact: Roger Staff at 618.703.3007 or"]
[null,null,null,"Matt Bunger at 309.585.6377"]
{"$rows_left_out":164}
{"sheet":"Field Worksheet","index":4,"n_rows":129,"n_cols":11,"rows_kept":129,"cut":false,"hidden":true,"merged":[[124,3,124,9],[57,1,58,9],[129,1,135,9],[61,4,63,4],[2,1,2,10],[125,3,125,9],[18,1,18,10],[28,1,28,8],[36,1,36,10],[43,1,43,9],[60,1,60,9],[70,1,70,4],[109,1,109,5],[121,1,121,9],[14,1,14,10],[122,3,122,9],[123,3,123,9],[44,4,46,4],[44,3,46,3],[44,2,46,2],[44,1,46,1],[51,4,53,4],[51,3,53,3],[51,2,53,2],[51,1,53,1],[80,1,80,9],[71,1,73,1],[71,2,73,2],[71,3,73,3],[71,4,73,4],[61,2,63,2],[61,1,63,1],[19,4,21,4],[19,3,21,3],[19,2,21,2],[19,1,21,1],[37,2,38,2],[37,1,38,1],[37,3,38,3],[37,4,38,4],[61,5,61,9],[62,5,63,5],[62,6,62,7],[62,8,62,9],[61,3,63,3],[45,6,45,7],[45,5,46,5],[52,5,52,6],[52,7,52,8],[51,5,51,8],[45,8,45,9],[44,5,44,9],[19,6,19,10],[20,7,20,8],[20,9,20,10],[20,6,21,6],[37,8,37,10],[37,7,38,7],[37,6,38,6],[19,5,21,5],[37,5,38,5]]}
[]
[]
[null,"To utilize the field worksheet for collecting data, first use the checkboxes to select the livestock class(es) on the farm you will be visiting.  Select as many as needed.  Then Select the \"Print Field Worksheet\" button, this will open to a print preview screen where you can review and make any adjustments to the page setup prior to printing."]
[]
[null,null,null,"Cow Calf Operation (includes Bulls)"]
[null,null,null,"Stockers Operation"]
[null,null,null,"Seasonal Dairy Operation"]
[null,null,null,"Annual Dairy Operation"]
[null,null,null,"Horse Operation"]
[null,null,null,"Sheep and/or Goats Operation"]
{"$rows_left_out":120}
{"sheet":"Explanation sheet for L.O. ","index":5,"n_rows":30,"n_cols":4,"rows_kept":30,"cut":false,"hidden":false,"merged":[[21,3,21,5],[24,3,24,5],[27,3,27,5],[29,1,29,5],[6,3,6,5],[9,3,9,5],[12,3,12,5],[1,1,1,5],[2,1,2,5],[3,1,3,5],[15,3,15,5],[18,3,18,5]]}
[]
[null,"Explanation Sheet for Attached Documents for"]
[null,{"$f":"Name","v":0}]
[null,{"$f":"Date","v":""}]
[null,"included","not included","Document Name and Explanation"]
[null,null,null,"Livestock Inventory and Demand Summary"]
[null,null,null,"This sheet contains information about the livestock you plan to have (and possibly the livestock you currently have) on a particular piece of ground.  Information like numbers, weights, their daily intake rates are included.  The sheet makes estimates of their forage demand.  This sheet also captures any management decisions for some livestock classes to capture if you livestock will stay on the grazing system year round, spend some of the year on an alternative pasture or spend some time of the year on a dry lot.  An alternative pasture is typically some unmanaged acreage where animals are moved to graze when peak productivity is not required, such as when dairy cows are dry or heifers are not lactating, or when bulls are not with cows for breeding.  The total forage demand by management option is summarized."]
[]
[null,null,null,"Pasture Forage Production Summary"]
[null,null,null,"This sheet captures the forage production on the grazing system per month based on seasonal growth curves per species.  Additionally, if an alternative pasture is being utilized the summary shows the forage production for the alternative pasture(s) modeled.   "]
{"$rows_left_out":21}
{"sheet":"Calculations","index":9,"n_rows":129,"n_cols":21,"rows_kept":129,"cut":false,"hidden":true,"merged":[]}
["Step 1 Balance Worksheet Calculations"]
[null,null,null,null,null,null,null,null,null,null,null,null,null,null,null,null,null,null,null,null,"Adams"]
["Cow Calf",null,null,null,null,null,null,null,null,null,null,null,null,null,null,null,null,null,null,null,"Alexander"]
[null,1,2,3,4,5,6,7,8,9,10,11,12,"month rel. to calving",null,null,null,null,null,null,"Bond"]
[{"$f":"SUM(B5:M5)/12","v":1},1.1679999999999999,1.1830000000000001,1.163,1.141,1.079,1.0069999999999999,0.94699999999999995,0.79100000000000004,0.80600000000000005,0.82099999999999995,0.89300000000000002,1.0009999999999999,"relative forage requirement",null,null,null,null,null,null,"Boone"]
[null,null,null,null,null,null,null,null,null,null,null,null,null,null,null,null,null,null,null,null,"Brown"]
[null,"April","May","June","July","August","September","October","November","December","January","February","March",null,null,null,null,null,null,null,"Bureau"]
["CowCalf1",{"$f":"HLOOKUP(IF(17-Calculations!$B$16>12,17-Calculations!$B$16-12,17-Calculations!$B$16),$B$4:$M$5,2,FALSE)*((365/12)/30)","v":1.1842222222222221},{"$f":"HLOOKUP(IF(18-Calculations!$B$16>12,18-Calculations!$B$16-12,18-Calculations!$B$16),$B$4:$M$5,2,FALSE)*((365/12)/31)","v":1.1607392473118281},{"$f":"HLOOKUP(IF(19-Calculations!$B$16>12,19-Calculations!$B$16-12,19-Calculations!$B$16),$B$4:$M$5,2,FALSE)*((365/12)/30)","v":1.1791527777777777},{"$f":"HLOOKUP(IF(20-Calculations!$B$16>12,20-Calculations!$B$16-12,20-Calculations!$B$16),$B$4:$M$5,2,FALSE)*((365/12)/31)","v":1.1195295698924732},{"$f":"HLOOKUP(IF(21-Calculations!$B$16>12,21-Calculations!$B$16-12,21-Calculations!$B$16),$B$4:$M$5,2,FALSE)*((365/12)/31)","v":1.0586962365591397},{"$f":"HLOOKUP(IF(22-Calculations!$B$16>12,22-Calculations!$B$16-12,22-Calculations!$B$16),$B$4:$M$5,2,FALSE)*((365/12)/30)","v":1.0209861111111109},{"$f":"HLOOKUP(IF(23-Calculations!$B$16>12,23-Calculations!$B$16-12,23-Calculations!$B$16),$B$4:$M$5,2,FALSE)*((365/12)/31)","v":0.92918010752688174},{"$f":"HLOOKUP(IF(24-Calculations!$B$16>12,24-Calculations!$B$16-12,24-Calculations!$B$16),$B$4:$M$5,2,FALSE)*((365/12)/30)","v":0.80198611111111107},{"$f":"HLOOKUP(IF(25-Calculations!$B$16>12,25-Calculations!$B$16-12,25-Calculations!$B$16),$B$4:$M$5,2,FALSE)*((365/12)/31)","v":0.79083333333333339},{"$f":"HLOOKUP(IF(14-Calculations!$B$16>12,14-Calculations!$B$16-12,14-Calculations!$B$16),$B$4:$M$5,2,FALSE)*((365/12)/31)","v":0.8055510752688172},{"$f":"HLOOKUP(IF(15-Calculations!$B$16>12,15-Calculations!$B$16-12,15-Calculations!$B$16),$B$4:$M$5,2,FALSE)*((365/12)/28)","v":0.97007440476190487},{"$f":"HLOOKUP(IF(16-Calculations!$B$16>12,16-Calculations!$B$16-12,16-Calculations!$B$16),$B$4:$M$5,2,FALSE)*((365/12)/31)","v":0.98216397849462356},null,null,null,null,"Haying Month Drop Fown",null,null,"Calhoun"]
[{"$f":"SUM(B9:M9)/365","v":1},{"$f":"B8*30","v":35.526666666666664},{"$f":"C8*31","v":35.982916666666668},{"$f":"D8*30","v":35.374583333333334},{"$f":"E8*31","v":34.705416666666672},{"$f":"F8*31","v":32.819583333333327},{"$f":"G8*30","v":30.629583333333329},{"$f":"H8*31","v":28.804583333333333},{"$f":"I8*30","v":24.059583333333332},{"$f":"J8*31","v":24.515833333333337},{"$f":"K8*31","v":24.972083333333334},{"$f":"L8*28","v":27.162083333333335},{"$f":"M8*31","v":30.447083333333332},null,null,null,null,1,null,null,"Carroll"]
["CowCalf2",{"$f":"HLOOKUP(IF(17-Calculations!$B$17>12,17-Calculations!$B$17-12,17-Calculations!$B$17),$B$4:$M$5,2,FALSE)*((365/12)/30)","v":0.96015277777777763},{"$f":"HLOOKUP(IF(18-Calculations!$B$17>12,18-Calculations!$B$17-12,18-Calculations!$B$17),$B$4:$M$5,2,FALSE)*((365/12)/31)","v":0.77611559139784947},{"$f":"HLOOKUP(IF(19-Calculations!$B$17>12,19-Calculations!$B$17-12,19-Calculations!$B$17),$B$4:$M$5,2,FALSE)*((365/12)/30)","v":0.81719444444444445},{"$f":"HLOOKUP(IF(20-Calculations!$B$17>12,20-Calculations!$B$17-12,20-Calculations!$B$17),$B$4:$M$5,2,FALSE)*((365/12)/31)","v":0.8055510752688172},{"$f":"HLOOKUP(IF(21-Calculations!$B$17>12,21-Calculations!$B$17-12,21-Calculations!$B$17),$B$4:$M$5,2,FALSE)*((365/12)/31)","v":0.87619623655913981},{"$f":"HLOOKUP(IF(22-Calculations!$B$17>12,22-Calculations!$B$17-12,22-Calculations!$B$17),$B$4:$M$5,2,FALSE)*((365/12)/30)","v":1.0149027777777777},{"$f":"HLOOKUP(IF(23-Calculations!$B$17>12,23-Calculations!$B$17-12,23-Calculations!$B$17),$B$4:$M$5,2,FALSE)*((365/12)/31)","v":1.1460215053763441},{"$f":"HLOOKUP(IF(24-Calculations!$B$17>12,24-Calculations!$B$17-12,24-Calculations!$B$17),$B$4:$M$5,2,FALSE)*((365/12)/30)","v":1.1994305555555556},{"$f":"HLOOKUP(IF(25-Calculations!$B$17>12,25-Calculations!$B$17-12,25-Calculations!$B$17),$B$4:$M$5,2,FALSE)*((365/12)/31)","v":1.1411155913978495},{"$f":"HLOOKUP(IF(14-Calculations!$B$17>12,14-Calculations!$B$17-12,14-Calculations!$B$17),$B$4:$M$5,2,FALSE)*((365/12)/31)","v":1.1195295698924732},{"$f":"HLOOKUP(IF(15-Calculations!$B$17>12,15-Calculations!$B$17-12,15-Calculations!$B$17),$B$4:$M$5,2,FALSE)*((365/12)/28)","v":1.1721279761904764},{"$f":"HLOOKUP(IF(16-Calculations!$B$17>12,16-Calculations!$B$17-12,16-Calculations!$B$17),$B$4:$M$5,2,FALSE)*((365/12)/31)","v":0.98805107526881708},null,null,null,null,2,null,null,"Cass"]
{"$rows_left_out":120}
{"sheet":"ForageGrowthCurves","index":10,"n_rows":54,"n_cols":19,"rows_kept":54,"cut":false,"hidden":false,"merged":[[1,0,1,15],[2,0,2,15]]}
[]
["FORAGE GROWTH CURVES "]
["                                            These curves are used to calculate the monthly pasture forage available for the grazing system, and the production pounds of hay for fields that are hayed and then pastured"]
["Pasture Mixes (Table 3-1 Northern IL optimum)",null,"Apr","May","Jun","Jul","Aug","Sep","Oct","Nov","Dec","Jan.","Feb.","Mar","Min Grazing Ht. (in)","Min Haying Ht (in)","OPT. Production",null,"AVE. Production"]
["-","-","-","-","-","-","-","-","-","-","-","-","-","-","-",null,"Tons/Acre",null,"Tons/Acre"]
["Alfalfa",null,0.05,0.23,0.24,0.18,0.15,0.1,0.05,null,null,null,null,null,3,null,6,null,3.9000000000000004]
["Alfalfa/Orchardgrass",null,0.06,0.23,0.24,0.18,0.13,0.11,0.05,null,null,null,null,null,3,null,5.5,null,3.6]
["Alfalfa/Smooth Bromegrass",null,0.06,0.23,0.24,0.18,0.13,0.11,0.05,null,null,null,null,null,4,null,5.2,null,3.4]
["Big Bluestem",null,null,0.03,0.14000000000000001,0.37,0.32,0.14000000000000001,null,null,null,null,null,null,8,null,3.4,null,2.5]
["Big Bluestem/Indiangrass",null,null,0.03,0.12,0.37,0.35,0.12,null,null,null,null,null,null,8,null,3.4,null,2.5]
{"$rows_left_out":45}
{"sheet":"Hay Loss Storage","index":11,"n_rows":78,"n_cols":40,"rows_kept":78,"cut":false,"hidden":false,"merged":[[2,2,2,6],[4,2,4,3],[73,2,76,3],[77,2,78,3]]}
[null,null,"Hay Storage Cost Comparison"]
[null,null,"Ag Decision Maker -- Iowa State University Extension"]
[null,null,"For information on hay costs, see Information File A1-15, Iowa Pasture Cost Improvement Budgets."]
[]
[null,null,"Place the cursor over cells with red triangles to read comments."]
[null,null,"Enter your input values in shaded cells."]
[]
[null,null,"General Information","Unit"]
[null,null,"Acres of hay produced annually","acres",null,null,null,"  "]
[null,null,"Average yield, total for all cuttings","tons/acre"]
{"$rows_left_out":69}
{"sheet":"PastureGrazingEfficiency","index":12,"n_rows":108,"n_cols":3,"rows_kept":108,"cut":false,"hidden":true,"merged":[[2,1,2,13],[3,1,3,13]]}
[]
[null,"Calculate Pasture Grazing Efficiency:"]
[null,"Selecting the \"Calculate Pasture Grazing Efficiency\" button will calculate the pasture grazing efficiency for each field/paddock by dividing the Total Usable Acres Grazed by the Acres of each field/paddock to generate a Paddock Equivalency Value.  The Paddock Equivalency Value is used to return the associated Pasture Grazing Efficiency value based on the table below."]
[null,"You can override the calculated Pasture Grazing Efficiency at any time by manually entering a value in the associated cells.  Alternatively, you can allow the model to calculate the Pasture Grazing Efficiency at any time by re-selecting the \"Calculate Pasture Grazing Efficiency\" button."]
[]
[]
[]
[null,"Paddock Equivalency Value","Grazing Efficiency (%)"]
[null,1,25]
[null,2,28]
{"$rows_left_out":99}
{"sheet":"HayList","index":13,"n_rows":53,"n_cols":2,"rows_kept":53,"cut":false,"hidden":true,"merged":[]}
["-","-"]
["Mechanically Harvested Forage","Minimum"]
["Mixes","Cut Height"]
["-","-"]
["Alfalfa Hay",3]
["Bermudagrass Hay","2-3"]
["Big Bluestem Hay","4-6"]
["Bluegrass Hay","3"]
["Brome Hay","3-4"]
["Brome/Alfalfa Hay","3-4"]
{"$rows_left_out":44}
{"sheet":"FSGTables","index":14,"n_rows":35,"n_cols":20,"rows_kept":35,"cut":false,"hidden":true,"merged":[[5,2,5,19],[7,2,7,3],[15,2,15,3],[24,2,24,3]]}
[]
[]
[]
[]
[]
[null,null,"TABLE 1: RELATIVE ADAPTABILITY OF SELECTED FORAGE SPECIES TO FORAGE SUITABILITY GROUPS; EXPRESSED AS ESTIMATED YIELDS, THOUSANDS OF POUNDS PER ACRE, WHEN OUTSIDE INPUTS ARE MODERATE*. "]
["Wet Tolerance","Drought Tolerance","SPECIES","SOIL       Sa<-L-> Cy","CyU","GNS","GrO","GrP","GrU","LyO","LyP","LyU","MDU","ShU","SyO","WCB","WCU","WLB","WLO","WtP"]
[null,null,"LEGUMES"]
["N","M","ALFALFA","L",8.5,"---",3,2.5,7,10,5,9,6.5,1.5,4,"---","---","---","---","---"]
["H","L","ALSIKE CLOVER","LC",5.5,"---","---","---","---",5.5,3,5,3.5,1,1.5,6.5,6,6,6,4.5]
{"$rows_left_out":26}
{"sheet":"PrintableLivestockInventory","index":15,"n_rows":53,"n_cols":13,"rows_kept":53,"cut":false,"hidden":true,"merged":[[1,0,1,2],[26,1,26,12],[7,8,7,11],[8,8,8,11],[7,0,8,0],[7,4,8,4],[7,5,8,5],[7,6,8,7],[1,4,5,9]]}
["Livestock Inventory and Demand Summary for:",null,null,null,"Notes:"]
[{"$f":"Name","v":0},null,null,null,{"$f":"Notes","v":0}]
[{"$f":"ID","v":""}]
[{"$f":"Date","v":""}]
[]
[]
[]
["Livestock Class","Planned","Avg.","  Intake","Lbs/Day","Lbs/Year","Management Details",null,"Time Frame for"]
[null,"Number","Weight","Rate (%)",null,null,null,null,"Alt Pasture or Dry Lot"]
[{"$f":"LivestockForageBalance!H15","v":"Cow/Calf Pairs Herd 1"},{"$f":"LivestockForageBalance!I15","v":0},{"$f":"LivestockForageBalance!J15","v":0},{"$f":"LivestockForageBalance!K15","v":0},{"$f":"LivestockForageBalance!L15","v":0},{"$f":"LivestockForageBalance!M15","v":0},{"$f":"IF(CC1Past=TRUE,\"Grazing System Year Round\",IF(CC1AltPast=TRUE,\"Alternative Pasture Utilized\",IF(CC1DryLot=TRUE,\"Dry Lot Utilized\")))","v":"Grazing System Year Round"},null,{"$f":"LivestockForageBalance!J16","v":""},{"$f":"LivestockForageBalance!K16","v":""}]
{"$rows_left_out":44}
{"sheet":"PrintableGrazingInventory","index":16,"n_rows":89,"n_cols":13,"rows_kept":89,"cut":false,"hidden":true,"merged":[[5,0,5,10],[68,1,70,3],[76,1,76,3],[75,1,75,3],[74,1,74,3],[73,1,73,3],[72,1,72,3],[71,1,71,3],[33,0,33,3],[13,1,13,3],[12,1,12,3],[11,1,11,3],[10,1,10,3],[32,1,32,3],[31,1,31,3],[30,1,30,3],[29,1,29,3],[28,1,28,3],[27,1,27,3],[26,1,26,3],[25,1,25,3],[79,1,80,12],[77,0,77,3],[68,5,69,5],[67,0,67,7],[35,0,36,9],[6,5,7,5],[1,0,1,2],[38,1,39,12],[6,1,8,3],[9,1,9,3],[20,1,20,3],[19,1,19,3],[18,1,18,3],[17,1,17,3],[16,1,16,3],[15,1,15,3],[14,1,14,3],[24,1,24,3],[23,1,23,3],[22,1,22,3],[21,1,21,3]]}
["Pasture Forage Production Summary for:"]
[{"$f":"Name","v":0}]
[{"$f":"ID","v":""}]
[{"$f":"Date","v":""}]
[]
["Grazing System Pasture Forage Production"]
["Field/","Kind of Forage",null,null,null,"TFP *","Total","Pasture",null,"Hay ","If Yes,"]
["Paddock",null,null,null,"Acres",null,"Production","Grazing ","Usable ","Then ","Month"]
["Number",null,null,null,"(Usable)","lbs/ac","Pounds","Eff. (%)","Pounds","Graze?","Hay Cut"]
[{"$f":"Field1","v":0},{"$f":"Kind1","v":0},null,null,{"$f":"Acres1","v":0},{"$f":"Yield1","v":0},{"$f":"LivestockForageBalance!K103","v":0},{"$f":"Efficiency1","v":0},{"$f":"LivestockForageBalance!M103","v":0},{"$f":"IF(HayMonth1>0,\"Yes\",\"No\")","v":"No"},{"$f":"IF(J10=\"Yes\", LivestockForageBalance!J104,\"\")","v":""}]
{"$rows_left_out":80}
{"sheet":"PrintableSummaryBalance","index":17,"n_rows":42,"n_cols":14,"rows_kept":42,"cut":false,"hidden":true,"merged":[[41,0,41,5],[29,1,29,5],[30,2,30,5],[31,1,31,5],[33,1,33,5],[34,2,34,5],[35,3,35,5],[10,0,10,1],[25,0,25,5],[37,0,37,5],[38,2,38,5],[39,3,39,5],[27,0,27,5],[24,0,24,5],[22,0,22,6],[26,0,26,5],[16,0,16,1]]}
["Summary of Livestock Needs and Pasture Forage Production"]
[{"$f":"Name","v":0}]
[{"$f":"ID","v":""}]
[{"$f":"Date","v":""}]
[]
[null,"Totals","Apr.","May","June","July","Aug.","Sept.","Oct.","Nov.","Dec.","Jan.","Feb.","Mar."]
["Grazing System"]
["Total Forage Available (Lbs)",{"$f":"LivestockForageBalance!M229","v":0},{"$f":"LivestockForageBalance!N229","v":0},{"$f":"LivestockForageBalance!O229","v":0},{"$f":"LivestockForageBalance!P229","v":0},{"$f":"LivestockForageBalance!Q229","v":0},{"$f":"LivestockForageBalance!R229","v":0},{"$f":"LivestockForageBalance!S229","v":0},{"$f":"LivestockForageBalance!T229","v":0},{"$f":"LivestockForageBalance!U229","v":0},{"$f":"LivestockForageBalance!V229","v":0},{"$f":"LivestockForageBalance!W229","v":0},{"$f":"LivestockForageBalance!X229","v":0},{"$f":"LivestockForageBalance!Y229","v":0}]
["Total Forage Needs (Lbs)",{"$f":"LivestockForageBalance!M230","v":0},{"$f":"LivestockForageBalance!N230","v":0},{"$f":"LivestockForageBalance!O230","v":0},{"$f":"LivestockForageBalance!P230","v":0},{"$f":"LivestockForageBalance!Q230","v":0},{"$f":"LivestockForageBalance!R230","v":0},{"$f":"LivestockForageBalance!S230","v":0},{"$f":"LivestockForageBalance!T230","v":0},{"$f":"LivestockForageBalance!U230","v":0},{"$f":"LivestockForageBalance!V230","v":0},{"$f":"LivestockForageBalance!W230","v":0},{"$f":"LivestockForageBalance!X230","v":0},{"$f":"LivestockForageBalance!Y230","v":0}]
["Total Difference (Lbs)",{"$f":"LivestockForageBalance!M231","v":0},{"$f":"LivestockForageBalance!N231","v":0},{"$f":"LivestockForageBalance!O231","v":0},{"$f":"LivestockForageBalance!P231","v":0},{"$f":"LivestockForageBalance!Q231","v":0},{"$f":"LivestockForageBalance!R231","v":0},{"$f":"LivestockForageBalance!S231","v":0},{"$f":"LivestockForageBalance!T231","v":0},{"$f":"LivestockForageBalance!U231","v":0},{"$f":"LivestockForageBalance!V231","v":0},{"$f":"LivestockForageBalance!W231","v":0},{"$f":"LivestockForageBalance!X231","v":0},{"$f":"LivestockForageBalance!Y231","v":0}]
{"$rows_left_out":33}
{"sheet":"PrintableHayInventory","index":18,"n_rows":50,"n_cols":9,"rows_kept":50,"cut":false,"hidden":true,"merged":[[6,3,7,3],[5,0,5,8],[33,0,33,1],[35,0,35,8],[49,0,49,1]]}
["Hay Production Summary for:"]
[{"$f":"Name","v":0}]
[{"$f":"ID","v":""}]
[{"$f":"Date","v":""}]
[]
["Fields Hayed in Conjunction with Grazing"]
[null,null,null,"TFP*",null,"Total","Hay",null,"Minimum"]
["Field",null,"Acres",null,"Haying ","Production","Harvest","Harvested","Cutting"]
["Number","Kind of Forage","(Usable)","lbs/ac","Month","Pounds","Eff. (%)","Pounds"," Ht. (in)"]
[{"$f":"IF(HayMonth1>0,Field1,\"\")","v":""},{"$f":"IF(HayMonth1>0,Kind1,\"\")","v":""},{"$f":"IF(HayMonth1>0,Acres1,\"\")","v":""},{"$f":"IF(HayMonth1>0,HayYield1,\"\")","v":""},{"$f":"IF(HayMonth1>0,LivestockForageBalance!J104,\"\")","v":""},{"$f":"IF(HayMonth1>0,LivestockForageBalance!K160,\"\")","v":""},{"$f":"IF(HayMonth1>0,HarvestEff1,\"\")","v":""},{"$f":"IF(HayMonth1>0,LivestockForageBalance!M160,\"\")","v":""},{"$f":"IF(HayMonth1>0,LivestockForageBalance!N160,\"\")","v":""}]
{"$rows_left_out":40}