{"text_format":"1","workbook":"xlsx","n_sheets":11,"sheets":["Use of Tool","Field Data Sheet","Nutrient Management","Water Management","CONS","CALCS","Soils and Landform","IRRIG","NVALUES","CROP N UPTAKE","Assessment Report"],"not_rendered":{"charts":0,"images":37,"macros":1,"external_links":0,"defined_names":18,"comments":0,"pivot_tables":0},"unopened":[],"bounds":{"document_bytes":16777216,"sheet_cells":100000,"rows_first":2000,"rows_last":500,"rows_between":2000,"halvings":0,"cell_chars":16384,"cell_head_chars":4096},"cells_cut":0,"cells_raw":0,"read":"whole","date_system":"1900"}

{"sheet":"Use of Tool","index":0,"n_rows":0,"n_cols":0,"rows_kept":0,"cut":false,"hidden":false,"merged":[]}

{"sheet":"Field Data Sheet","index":1,"n_rows":124,"n_cols":8,"rows_kept":124,"cut":false,"hidden":false,"merged":[[94,3,94,4],[95,3,95,4],[96,3,96,4],[97,3,97,4],[98,3,98,4],[99,3,99,4],[103,0,103,1],[92,0,92,7],[94,0,94,1],[95,0,95,1],[93,0,93,1],[93,6,93,7],[123,0,125,6],[41,0,43,0],[41,1,41,6],[42,7,43,7],[45,0,47,0],[45,1,45,6],[46,7,47,7],[104,3,104,4],[105,3,105,4],[106,3,106,4],[107,3,107,4],[101,3,101,4],[93,3,93,4],[102,3,102,4],[103,3,103,4],[104,0,104,1],[105,0,105,1],[106,0,106,1],[65,5,66,5],[65,6,66,6],[65,7,66,7],[67,0,69,0],[67,1,67,6],[68,7,69,7],[65,1,66,1],[65,2,66,2],[65,3,66,3],[65,4,66,4],[63,1,64,1],[63,2,64,2],[63,3,64,3],[63,4,64,4],[63,5,64,5],[63,6,64,6],[63,7,64,7],[61,1,62,1],[61,2,62,2],[61,3,62,3],[61,4,62,4],[54,0,56,0],[54,1,54,6],[61,5,62,5],[61,6,62,6],[55,7,56,7],[58,0,60,0],[58,1,58,6],[59,7,60,7],[37,0,39,0],[37,1,37,6],[38,7,39,7],[49,0,51,0],[49,1,49,6],[50,7,51,7],[61,7,62,7],[33,0,35,0],[33,1,33,6],[34,7,35,7],[19,4,21,4],[19,5,21,5],[19,6,21,6],[19,7,21,7],[16,1,18,1],[16,2,18,2],[16,3,18,3],[16,4,18,4],[29,0,31,0],[29,1,29,6],[30,7,31,7],[22,5,24,5],[22,6,24,6],[22,7,24,7],[25,0,27,0],[25,1,25,6],[26,7,27,7],[22,1,24,1],[22,2,24,2],[22,3,24,3],[22,4,24,4],[75,4,76,4],[116,1,117,5],[110,7,112,7],[113,6,115,6],[113,7,115,7],[13,0,15,0],[13,1,13,6],[14,7,15,7],[16,5,18,5],[16,6,18,6],[70,5,71,5],[70,6,71,6],[70,7,71,7],[72,0,74,0],[72,1,72,6],[73,7,74,7],[70,1,71,1],[70,2,71,2],[70,3,71,3],[70,4,71,4],[16,7,18,7],[19,1,21,1],[19,2,21,2],[19,3,21,3],[116,6,117,6],[116,7,117,7],[118,0,120,0],[118,1,118,6],[119,7,120,7],[109,1,109,6],[113,1,115,5],[88,0,90,0],[88,1,88,6],[89,7,90,7],[97,0,97,1],[98,0,98,1],[99,0,99,1],[113,0,114,0],[94,6,95,7],[97,6,98,7],[100,6,101,7],[103,6,104,7],[106,6,107,7],[96,0,96,1],[100,3,100,4],[100,0,100,1],[101,0,101,1],[102,0,102,1],[83,1,83,6],[82,0,82,7],[80,6,81,6],[80,7,81,7],[84,7,86,7],[11,0,11,7],[80,2,81,2],[80,3,81,3],[80,4,81,4],[75,5,76,5],[75,6,76,6],[65,0,66,0],[70,0,71,0],[53,0,53,5],[80,0,81,0],[12,0,12,7],[80,5,81,5],[75,7,76,7],[77,0,79,0],[77,1,77,6],[78,7,79,7],[75,1,76,1],[75,2,76,2],[75,3,76,3],[0,0,0,7],[1,0,1,7],[2,3,2,4],[10,0,10,7],[4,6,4,7],[6,6,6,7],[4,1,4,3],[5,1,5,3],[6,1,6,3],[2,6,2,7],[7,1,7,3],[2,0,2,1]]}
["FIELD DATA SHEET"]
["                       Idaho Nutrient Transport Risk Assessment                                "]
["Natural Resource Conservation Service",null,null,"Water Quality Assessment Tool",null,null,"Version: August 2012"]
[" "]
["   Landowner:",null,null,null,null,"Date:"]
["        Planner:",null,null,null,null,null,null," "]
["Rotation",null,null,null,null,"Field Office:"]
["Critical Crop*"]
[null,null,null,null,null,null,"Tract Number:"]
[]
{"$rows_left_out":115}
{"sheet":"Nutrient Management","index":2,"n_rows":52,"n_cols":18,"rows_kept":52,"cut":false,"hidden":false,"merged":[[51,0,51,4],[10,0,10,1],[36,0,36,1],[9,2,9,4],[9,0,9,1],[14,3,14,4],[18,3,18,4],[13,3,13,4],[17,3,17,4],[25,3,25,4],[47,3,47,4],[40,3,40,4],[43,3,43,4],[44,3,44,4],[48,3,48,4],[1,0,2,4],[11,0,11,4],[37,0,37,4],[22,3,22,4],[39,3,39,4],[21,3,21,4],[26,3,26,4],[29,0,29,1],[30,0,30,4],[32,3,32,4],[31,3,31,4],[34,3,34,4]]}
["SOIL TEST P",null,null,null,null,null,null,null,null,null,null," "," ",null,null,null,null,0]
["Determine the risk associated with amount of nutrients currently in the soil. Plant available phosphorus in soils is estimated with a soil analysis. Select ONLY ONE of the soil P test methods used below:",null,null,null,null,null,null,null,null,null,null,null,null,null,null,null,null,0]
[null,null,null,null,null,null,null,null,null,null,null,null,null,null,null,null,null,0]
[null,null,null,null,null,null,null,null,null,null,null,null,null,null,null,null,null," "]
[null,null,null,null,null,null,null,null,null,null,null,null,null,null,null,null,null," "]
[null,null,null,null,null,null,null,null,null,null,null,null,null,null,null,null,null," "]
[null,null,1,null,null,null,null,null,null,null,null,null,null,null,null,null,null," "]
[null,null,null,null,null,null,null,null,null,null,null,null,null,null,null,null,null," "]
[]
["Soil Test P Result:   "]
{"$rows_left_out":43}
{"sheet":"Water Management","index":3,"n_rows":252,"n_cols":23,"rows_kept":252,"cut":false,"hidden":false,"merged":[[28,0,28,4],[20,0,20,1],[24,0,24,2],[34,0,34,4],[41,0,43,4],[30,0,30,4],[38,0,38,4],[1,0,2,4],[17,0,18,4],[22,0,22,4],[26,0,26,4],[9,2,9,3],[12,0,12,4],[11,0,11,4],[14,3,14,4],[4,0,4,2],[6,2,6,3]]}
["RUNOFF CLASS AND IRRIGATION RUNOFF INDEX",null,null,null,null," ",null,null,null,null,null,null,null,null,null,null,null,null,null,null,null,false,{"$f":"IF(A23=\"\",\"\",VLOOKUP($A23,IRRIG!$C$88:$D$100,2,FALSE))","v":""}]
["The Runoff Class and Irrigation Runoff Index determine the risk of soluble nutrients leaving the site in runoff from storm events and from application of irrigation water. The runoff risk for each is calculated differently. ",null,null,null,null,null,null,null,null,null,null,null,null,null,null,null,null,null,null,null,null,null,{"$f":"IF(A27=\"\",\"\",VLOOKUP($A27,IRRIG!$C$105:$D$109,2,FALSE))","v":""}]
[null,null,null,null,null,null,null,null,null,null,null,null,null,null,null,null,null,null,null,null,null,null,{"$f":"IF(A31=\"\",\"\",VLOOKUP($A31,IRRIG!$C$48:$D$55,2,FALSE))","v":""}]
[null,null,null,null,null,null,null,null,null,null,null,null,null,null,null,null,null,null,null,null,null,null,{"$f":"IF(A35=\"\",\"\",VLOOKUP($A35,IRRIG!$C$71:$D$81,2,FALSE))","v":""}]
["If irrigation is used, select the appropriate button to the right, and then proceed to Runoff Class. If no irrigation is used, skip and go to Runoff Class (below).",null,null,null,null,null,null,null,null,null,null,null,null,null,null,null,null,null,null,null,null,null,{"$f":"IF(A39=\"\",\"\",VLOOKUP($A39,IRRIG!$C$58:$D$62,2,FALSE))","v":""}]
[]
[]
[null,null,null,null,null,null,null,null,null,null,null,null,null,null,null,null,null,null,null,null,null,null,"Multiplicative Irrigation Index"]
[null,null,null,null,null,null,null,null,null,null,null,null,null,null," ",null,null,null,null,null,null,null,{"$f":"W1*W2*W3*W4*W5","v":{"$error":"#VALUE!"}}]
[null,null,null,null,null," ",null,null,null,null,null,null,null,null," "]
{"$rows_left_out":243}
{"sheet":"CONS","index":4,"n_rows":27,"n_cols":18,"rows_kept":27,"cut":false,"hidden":true,"merged":[]}
[null,"No rating value"]
[0,"Very Low",0,"None Used, or No Runoff"]
[1,"Low",1,"Few BMPs"]
[2,"Medium",2,"Average"]
[4,"High",4,"Good"]
[8,"Very High",8,"Excellent"]
[10,"Critical"]
[100,"Critical"]
[null,"Soil Test P","P Rate","P Method","Mrate","Mmethod","N rate","Ntime","Nmethod","Runoff Class","BMPs","Irrigation Index","Leaching Index","Distance","SoilProp","Soil erosion","Runoff Index","Soil Test N"]
["Very Low","Soil test P is in the very low range for most crops. Recommendation: Use and follow crop-specific U of I Fertilizer Guides.","No phosphorus fertlizer used.","No phosphorus fertlizer used.","No animal waste applied","No animal waste applied","N application rate does not meet crop needs. Potential for yield reduction. Recommended: Use soil tests and U of I Fertilizer Guide recommendations.","No N applied","No N applied","Little surface runoff occurs from storm events. Low risk of soluble and/or sediment-attached nutrient loss.","REQUIRED if runoff occurs: Apply in-field conservation practices (reduced tillage, etc.) that reduce soil erosion and runoff. Conservation practices that trap and/or filter nutrients are also required when in-field practices are insufficient.","Good water management. Leaching during the growing season is minimized.","Lower potential for leaching during the non-growing season.","Increased distance to surface water reduces transport risk ","Soils with slow infiltration/water transmission. Reduced risk of leaching.","No erosion occurs","Little surface runoff occurs from irrigation. Low risk of soluble and/or sediment-attached nutrient loss.","Soil test N is in the low range for most crops. Recommendation: Use and follow crop-specific U of I Fertilizer Guides."]
{"$rows_left_out":18}
{"sheet":"CALCS","index":5,"n_rows":21,"n_cols":10,"rows_kept":21,"cut":false,"hidden":true,"merged":[]}
["Soil Test P",null,null,{"$f":"B1*C1","v":0},null,null,"surface - P","ground","surface - N"]
["P application rate",null,null,{"$f":"B2*C2","v":0},null,null,{"$f":"D1+D2+D3+D4+D5+D10+D11+D15+D17+D14","v":0},{"$f":"D6+D7+D12+D13+D16+D20","v":0},{"$f":"D5+D10+D11+D15+D17+D8+D6+D14+D19","v":0}]
["P application method",null,null,0]
["Manure application rate",null,null,0]
["Manure application method",null,null,0]
["N fertilizer rate as % crop need",null,null,0]
["N application timing",null,null,0]
["N application method",null,null,0]
[]
["Runoff Class",null,null,0]
{"$rows_left_out":12}
{"sheet":"Soils and Landform","index":6,"n_rows":156,"n_cols":18,"rows_kept":156,"cut":false,"hidden":false,"merged":[[20,3,20,4],[21,3,21,4],[30,0,33,4],[17,0,17,4],[18,0,18,4],[24,0,24,4],[26,0,26,2],[28,0,28,4],[25,0,25,4],[13,3,13,4],[12,3,12,4],[14,3,14,4],[15,3,15,4],[0,0,0,4],[1,0,2,4],[8,0,8,4],[9,0,10,4],[4,3,4,4],[5,3,5,4]]}
["DISTANCE TO SURFACE WATER BODY",null,null,null,null,null,null,null,null,null," ",null,null,true," ",null,null,"Winter Ppt"]
["The closer the distance from the edge of the agricultural field to the nearest receiving water body (ditch, canal, drain, waterway - any perennial or ephemeral water body with eventual connection to the river or stream), the greater the potential for the majority of the phosphorus lost from the field/operation to reach the water body and negatively impact water quality.",null,null,null,null,null,null,null,null,null," ",null,null," ",null,null,null,{"$f":"IF(A29=\"\",\"\",VLOOKUP($A29,IRRIG!$J$4:$O$156,6,FALSE))","v":""}]
[null,null,null,null,null,null,null,null,null,null," ",null,null," "]
[null,null,null,null,null,null,null,null,null,null," ",null,null,null,"Aberdeen"]
[null,null,null,"Distance to Surface Water Body:",null,null,null,null,null,null,null,null," "," ","American Falls",null,null,"Hydrologic Group A"]
[null,null,null,null,null,null,null,null,null,null,null,null,null," ","Anderson Dam",null,null,{"$f":"IF(A29=\"\",\"\",VLOOKUP($A29,IRRIG!$J$4:$O$156,2,FALSE))","v":""}]
[null,null,null,null,null,null,null,null,null,null,null,null,null,null,"Arbon 2 NW",null,null,"Hydrologic Group B"]
[null,null,null,null,null,null,null,null,null,null,null,null,null,null,"Arco 3 SW",null,null,{"$f":"IF(A29=\"\",\"\",VLOOKUP($A29,IRRIG!$J$4:$O$156,3,FALSE))","v":""}]
["WATER TABLE DEPTH, GEOLOGIC FEATURES AND SOIL TYPE",null,null,null,null,null,null,null,null,null,null,null,null,null,"Arrowrock Dam",null,null,"Hydrologic Group C"]
["Soils can stop or slow nitrogen movement depending on their chemical and physical characteristics. Depth of soils, texture and structure, depth to water tables, and limiting layers such as hard pans or gravels, will influence rooting depth, nitrogen movement, and leaching potential.  ",null,null,null,null,null,null,null,null,null,null,null,null,null,"Ashton",null,null,{"$f":"IF(A29=\"\",\"\",VLOOKUP($A29,IRRIG!$J$4:$O$156,4,FALSE))","v":""}]
{"$rows_left_out":147}
{"sheet":"IRRIG","index":7,"n_rows":156,"n_cols":15,"rows_kept":156,"cut":false,"hidden":true,"merged":[[0,0,0,2],[2,0,2,3]]}
["IRRIGATION SYSTEM AND WATER MANAGEMENT",null,null,null,null,null,null,null,null,"Climate Station Leaching Index for Non Irrigated by hydrologic Group"]
[]
["NOTE: This tool has been modified from the CSP IWM Calculator to capture the irrigation water management factors that have the greatest impact on deep percolation over the irrigation season.",null,null,null,null,null,null,null,null,null,"A","B","C","D","Winter PPt"]
[null,null,null,null,null,null,null,null,null,"Aberdeen",0.45807267342983954,4.2741295336689446E-2,1.8839591033119839E-2,0.11802891348965475,4.3899999999999997]
[null,null,null,null,null,null,null,null,null,"American Falls",1.1479395367340011,0.32062648770481245,3.7930157109174183E-2,7.9150675024550893E-4,5.8]
[null,null,"Irrigation System","Multiplier","Additional Notes",null,null,null,null,"Anderson Dam",2.6612902953336839,0.491111020468813,1.2393239728400488E-3,0.24529460466576589,14.21]
[null,null,null,null,null,null,null,null,null,"Arbon 2 NW",1.0852553530279005,2.6659891859006982E-2,0.27498833712832588,0.90633969574361861,8.74]
[null,null,"Surface - Graded Border",80,null,null,null,null,null,"Arco 3 SW",0.65034789312905839,0.10807306660242397,4.5415664719656744E-4,5.3465356974549717E-2,4.55]
[null,null,"Surface - Level Border (Basin)",90,null,null,null,null,null,"Arrowrock Dam",2.3515224116336753,0.36626939076225445,1.6286408224137999E-2,0.34252448750752484,13.63]
[null,null,"Surface - Guide Border",70,null,null,null,null,null,"Ashton",2.3392841258050443,0.40961057171385823,3.9759136159696401E-3,0.25239962884998107,10.74]
{"$rows_left_out":147}
{"sheet":"NVALUES","index":8,"n_rows":83,"n_cols":5,"rows_kept":83,"cut":false,"hidden":true,"merged":[]}
[{"$f":"IF('CROP N UPTAKE'!B2=\"\",\"\",+'CROP N UPTAKE'!B2)","v":""},{"$f":"IF($A$1=\"\",\"\",VLOOKUP($A$1,$A$3:$E$88,2,FALSE))","v":""},{"$f":"IF($A$1=\"\",\"\",VLOOKUP($A$1,$A$3:$E$88,3,FALSE))","v":""},{"$f":"IF($A$1=\"\",\"\",VLOOKUP($A$1,$A$3:$E$88,4,FALSE))","v":""},{"$f":"IF($A$1=\"\",\"\",VLOOKUP($A$1,$A$3:$E$88,5,FALSE))","v":""}]
[null,"N Uptake","Average Yield","Units of Yield","N+Yield"]
[]
["NORTHERN IDAHO"]
["Alfalfa-Hay, N-ID",0,2,"tons/acre",0]
["Alfalfa-Silage, N-ID",0,3,"tons/acre",0]
["Barley-Spring, N-ID, 21\" or less Precipitation",224,4000,"lbs/acre",0.06]
["Barley-Spring, N-ID, 22-24\" Precipitation",233,4000,"lbs/acre",0.06]
["Barley-Spring, N-ID, 24\" or more Precipitation",241,4000,"lbs/acre",0.06]
["Barley-Winter, N-ID, 21\" or less Precipitation",156,4000,"lbs/acre",0.04]
{"$rows_left_out":74}
{"sheet":"CROP N UPTAKE","index":9,"n_rows":6,"n_cols":5,"rows_kept":6,"cut":false,"hidden":false,"merged":[[0,1,0,4],[2,1,2,2],[3,1,3,2],[5,1,5,2],[1,1,1,4]]}
[null,"Select crop from the list in the cell below, then type in the expected yield to see the N requirement based on the Idaho Fertilizer Guides"]
[]
[null,"Default Average Yield",null,{"$f":"IF(NVALUES!$C$1=0,\"\",+NVALUES!C1)","v":""},{"$f":"IF(NVALUES!$C$1=0,\"\",+NVALUES!D1)","v":""}]
[null,"Expected Yield/acre",null,0,{"$f":"IF(NVALUES!$C$1=0,\"\",+NVALUES!D1)","v":""}]
[]
[null,"Nitrogen-N requirement",null,{"$f":"IF(D4=0,+NVALUES!B1,IF(D4>0,NVALUES!$B$1+(D4-NVALUES!$C$1)*NVALUES!$E$1))","v":""},"lb-N/acre"]

{"sheet":"Assessment Report","index":10,"n_rows":35,"n_cols":27,"rows_kept":35,"cut":false,"hidden":false,"merged":[[15,2,15,3],[15,4,15,12],[27,1,27,3],[27,4,29,12],[24,2,24,3],[25,2,25,3],[26,2,26,3],[24,4,24,12],[25,4,25,12],[16,2,16,3],[22,2,22,3],[20,2,20,3],[21,2,21,3],[18,4,18,12],[19,4,19,12],[21,4,21,12],[16,4,16,12],[30,4,32,12],[33,0,33,12],[31,1,31,3],[23,4,23,12],[30,1,30,3],[29,1,29,3],[23,2,23,3],[28,1,28,3],[18,2,18,3],[17,2,17,3],[17,4,17,12],[32,1,32,3],[11,4,11,12],[12,4,12,12],[13,2,13,3],[5,9,5,12],[5,7,5,8],[5,2,5,6],[6,2,6,6],[7,5,7,6],[7,10,7,11],[9,4,9,12],[10,4,10,12],[0,0,0,12],[2,0,2,12],[1,11,1,12],[4,11,4,12],[3,7,3,8],[4,7,4,8],[1,0,1,1],[1,3,1,7],[3,9,3,12],[4,2,4,6],[3,2,3,6],[35,0,44,12],[8,26,8,28],[9,26,9,28],[26,4,26,12],[10,2,10,3],[11,2,11,3],[12,2,12,3],[34,0,34,12],[8,0,8,12],[13,4,13,12],[14,4,14,12],[9,2,9,3],[20,4,20,12],[22,4,22,12],[19,2,19,3],[14,2,14,3]]}
["Idaho Nutrient Transport Risk Assessment                                ",null,null,null,null,null,null,null,null,null,null,null,null,null,null,null,null,null,null," "," "," "," ",null,null,{"$f":"B28+B29","v":0}]
["Natural Resource Conservation Service",null,null,"Water Quality Assessment Tool",null,null,null,null,null,null,null,"Version: April 2014",null,null,null,null,null,null,null," ",null,null,null,null,null,"do not delete"]
[" ",null,null,null,null,null,null,null,null,null,null,null,null,null,null,null,null,null,null," "," "]
["   Landowner:",null," ",null,null,null,null,"Date:",null,null,null,null,null,null,null,null,null,null,null," "," "," "," "]
["        Planner:",null,null,null,null,null,null," ",null,null,null,null,null,null,null,null,null,null,null," "," "," "," "]
["Rotation:","                      ",null,null,null,null,null,"Field Office",null,null,null,null,null,null,null,null,null,null,null," "," "]
["Critical Crop:",null,null,null,null,null,null,null,null,null,null,null,null,null,null,null,null,null,null," ","  "," "," "]
[null,null,null,null,null,null,null,null,null,null,"Tract Number(s):",null,null,null,null,null,null,null,null,null," "]
["Factors Impacting Water Quality ",null,null,null,null,null,null,null,null,null,null,null,null,null,null,null,null,null,null,null," ",null," "," ",null,null," "]
[null,"RATING","RISK CATEGORY",null,"MITIGATING PRACTICES",null,null,null,null,null,null,null,null,null,null,null,null,null,null,null," ",null," "," ",null,null," "]
{"$rows_left_out":25}