{"text_format":"1","workbook":"xlsx","n_sheets":7,"sheets":["Title","FIRI Worksheet","Detailed report","Summary Report","System_Descript","Factors","Development notes"],"not_rendered":{"charts":0,"images":19,"macros":1,"external_links":0,"defined_names":4,"comments":2,"pivot_tables":0},"unopened":[],"bounds":{"document_bytes":16777216,"sheet_cells":100000,"rows_first":2000,"rows_last":500,"rows_between":2000,"halvings":0,"cell_chars":16384,"cell_head_chars":4096},"cells_cut":0,"cells_raw":0,"read":"whole","date_system":"1900"}

{"sheet":"Title","index":0,"n_rows":38,"n_cols":14,"rows_kept":38,"cut":false,"hidden":false,"merged":[[2,2,8,17],[24,3,25,14],[26,3,32,14],[37,3,46,14],[35,7,36,10]]}
[null,null,null,null,null,null,null,null,null,null,null,null,"Revision date:",{"$f":"MAX('Development notes'!A9:A700)","v":"2015-03-23"}]
[]
[null,null,"Farm Irrigation Rating Index (FIRI) 2015.1.01"]
[]
[]
[]
[]
[]
[]
[]
[]
[]
[]
[]
[]
[]
[]
[]
[]
[]
{"$rows_left_out":19}
{"sheet":"FIRI Worksheet","index":1,"n_rows":233,"n_cols":44,"rows_kept":233,"cut":false,"hidden":false,"merged":[[44,4,47,13],[2,3,2,13],[3,10,3,11],[4,11,4,13],[0,3,0,13],[16,4,16,6],[43,4,43,5],[39,4,39,5],[43,9,43,10],[39,9,39,10],[31,4,32,5],[33,4,33,5],[36,4,36,5],[31,12,32,12],[36,9,36,10],[37,9,37,10],[21,9,21,11],[17,4,17,5],[18,4,18,5],[21,4,21,6],[18,9,18,10],[17,9,17,10],[19,9,19,11],[20,9,20,11],[20,4,20,6],[25,9,25,11],[22,4,22,6],[23,4,23,6],[25,4,25,6],[24,4,24,6],[22,9,22,11],[23,9,23,11],[24,9,24,11],[1,5,1,13],[3,3,3,5],[3,7,3,8],[1,3,1,4],[4,9,4,10],[12,4,12,6],[13,4,13,6],[12,9,12,11],[13,9,13,11],[14,9,14,11],[14,4,14,6],[6,9,6,12],[16,9,16,11],[9,9,9,11],[10,9,10,11],[7,9,7,11],[11,9,11,11],[0,1,2,2],[3,1,3,2],[4,1,4,2],[9,1,14,1],[16,1,25,1],[17,2,18,2],[6,2,7,3],[6,1,7,1],[17,3,18,3],[4,3,4,4],[19,4,19,6],[6,4,6,7],[7,4,7,6],[9,4,9,6],[10,4,10,6],[11,4,11,6],[31,6,32,6],[31,7,32,8],[39,2,41,2],[39,6,39,7],[29,4,29,5],[31,2,32,3],[33,2,33,3],[31,1,41,1],[36,2,37,2],[27,1,29,1],[39,11,39,12],[35,12,35,13],[27,6,28,6],[27,7,28,7],[27,11,28,11],[33,9,33,10],[31,9,32,10],[28,9,28,10],[27,12,28,12],[29,9,29,10],[33,7,33,8],[37,4,37,5],[28,4,28,5]]}
[null,"NRCS",null,"Farm Irrigation Rating Tool 2015.1"]
[]
[null,null,null,"       Natural Resources Conservation Service (NRCS)   "]
[null,"Client:",null,null,null,null,"Planner:",null,null,"Location:",null,null,"Date:",{"$f":"TODAY()","v":"2015-03-24"}]
[null,"Tract No.",null,null,null," Farm No.",null,"Field No.",null,"Field Name/description:"]
[]
[null,"System ","Irrigation Type",null,"Present Condition",null,null,null,null,"Planned Condition"]
[null,null,null,null,"",null,null,{"$f":"IF(E8<>\"\",VLOOKUP(E8,$AE$113:$AF$146,2,FALSE)*100,\"\")","v":""},null,"",null,null,{"$f":"IF(J8<>\"\",VLOOKUP(J8,$AE$113:$AF$146,2,FALSE)*100,\"\")","v":""},{"$f":"IF(M10=\"\",\"\",(1-M10)^2)","v":""}]
[null,null,null,null,null,null,null,null,null,null,null,null,null,""]
[null,"Management Factors","Measurement","Md",null,null,null,{"$f":"IF(ISERROR(VLOOKUP($E10,$AE$40:$AF$44,2,0)),\"\",VLOOKUP($E10,$AE$40:$AF$44,2,0))","v":""},{"$f":"IF(H10=\"\",\"\",(1-H10)^2)","v":""},null,null,null,{"$f":"IF(ISERROR(VLOOKUP($J10,$AE$40:$AF$44,2,0)),\"\",VLOOKUP($J10,$AE$40:$AF$44,2,0))","v":""},""]
[null,null,"Scheduling","S",null,null,null,{"$f":"IF(ISERROR(VLOOKUP($E11,$AE$47:$AF$54,2,0)),\"\",VLOOKUP($E11,$AE$47:$AF$54,2,0))","v":""},"",null,null,null,{"$f":"IF(ISERROR(VLOOKUP($J11,$AE$47:$AF$54,2,0)),\"\",VLOOKUP($J11,$AE$47:$AF$54,2,0))","v":""},""]
[null,null,"Skill","I",null,null,null,{"$f":"IF(ISERROR(VLOOKUP($E12,$AE$57:$AF$59,2,0)),\"\",VLOOKUP($E12,$AE$57:$AF$59,2,0))","v":""},"",null,null,null,{"$f":"IF(ISERROR(VLOOKUP($J12,$AE$57:$AF$59,2,0)),\"\",VLOOKUP($J12,$AE$57:$AF$59,2,0))","v":""},""]
[null,null,"Maintenance","M",null,null,null,{"$f":"IF(ISERROR(VLOOKUP($E13,$AE$149:$AF$152,2,0)),\"\",VLOOKUP($E13,$AE$149:$AF$152,2,0))","v":""},"",null,null,null,{"$f":"IF(ISERROR(VLOOKUP($J13,$AE$149:$AF$152,2,0)),\"\",VLOOKUP($J13,$AE$149:$AF$152,2,0))","v":""},""]
[null,null,"Delivery","D",null,null,null,{"$f":"IF(ISERROR(VLOOKUP($E14,$AE$158:$AF$167,2,0)),\"\",VLOOKUP($E14,$AE$158:$AF$167,2,0))","v":""},"",null,null,null,{"$f":"IF(ISERROR(VLOOKUP($J14,$AE$158:$AF$167,2,0)),\"\",VLOOKUP($J14,$AE$158:$AF$167,2,0))","v":""}]
[null,null,"Soil","Sc",null,null,null,{"$f":"IF(ISERROR(VLOOKUP($E15,$AE$62:$AF$72,2,0)),\"\",VLOOKUP($E15,$AE$62:$AF$72,2,0))","v":""},"",null,null,null,{"$f":"IF(ISERROR(VLOOKUP($J15,$AE$62:$AF$72,2,0)),\"\",VLOOKUP($J15,$AE$62:$AF$72,2,0))","v":""}]
[]
[null,"System Design  Factors","Water Distribution Control","Wc",null,null,null,{"$f":"IF(ISERROR(VLOOKUP($E17,$AE$75:$AF$78,2,0)),\"\",VLOOKUP($E17,$AE$75:$AF$78,2,0))","v":""},{"$f":"IF(H17=\"\",\"\",(1-H17)^2)","v":""},null,null,null,{"$f":"IF(ISERROR(VLOOKUP($J17,$AE$75:$AF$78,2,0)),\"\",VLOOKUP($J17,$AE$75:$AF$78,2,0))","v":""},{"$f":"IF(M17=\"\",\"\",(1-M17)^2)","v":""}]
[null,null,"Conveyance","Ce","              Material",null,"Length(ft)",null,null,"             Material",null,"Length(ft)"]
[null,null,null,null,null,null,null,{"$f":"IF(E19=\"Multiple\",AG80^(G19/1000),IF(ISERROR(VLOOKUP($E19,$AE$81:$AF$88,2,0)^(G19/1000)),\"\",VLOOKUP($E19,$AE$81:$AF$88,2,0)^(G19/1000)))","v":""},{"$f":"IF(H19=\"\",\"\",(1-H19)^2)","v":""},null,null,null,{"$f":"IF(J19<>\"Multiple\",IF(ISERROR(VLOOKUP($J19,$AE$81:$AF$88,2,0)^(L19/1000)),\"\",VLOOKUP($J19,$AE$81:$AF$88,2,0)^(L19/1000)),AH80^(L19/1000))","v":""},""]
[null,null,"Land Leveling","L",null,null,null,null,{"$f":"IF(H20=\"\",\"\",(1-H20)^2)","v":""},null,null,null,null,""]
{"$rows_left_out":214}
{"sheet":"Detailed report","index":2,"n_rows":35,"n_cols":18,"rows_kept":35,"cut":false,"hidden":false,"merged":[[0,1,2,1],[2,3,2,16],[0,3,0,16],[1,3,1,15],[6,16,7,16],[4,12,4,13],[4,14,4,18],[3,12,3,13],[3,14,3,18],[5,12,5,16],[4,3,4,4],[4,5,4,6],[20,12,20,15],[21,12,21,15],[22,12,22,15],[23,12,23,15],[9,1,9,3],[7,6,9,7],[8,12,9,13],[15,12,15,15],[16,12,16,15],[17,12,17,15],[18,12,18,15],[19,12,19,15],[13,6,13,10],[10,6,10,7],[17,4,17,9],[11,2,11,3],[30,4,30,9],[24,12,24,15],[30,12,30,15],[29,12,29,15],[25,12,25,15],[26,12,26,15],[27,12,27,15],[28,12,28,15],[26,4,26,9],[27,4,27,9],[28,4,28,9],[29,4,29,9],[18,4,18,9],[12,2,12,3],[5,6,5,10],[4,7,4,9],[6,1,6,3],[8,1,8,3],[15,4,15,9],[16,4,16,9],[14,6,14,9],[14,13,14,15],[34,3,40,15],[3,3,3,9],[19,4,19,9],[20,4,20,9],[21,4,21,9],[22,4,22,9],[23,4,23,9],[24,4,24,9],[25,4,25,9],[15,1,15,3],[16,1,21,1],[22,1,30,1],[13,14,13,16],[13,2,14,3],[32,2,32,6]]}
[null,"NRCS",null,"Farm Irrigation Rating Tool"]
[null,null,null,"Detail Report"]
[null,null,null,"       Natural Resources Conservation Service (NRCS)   "]
[null,null,"Client:",{"$f":"IF('FIRI Worksheet'!D4<>\"\",'FIRI Worksheet'!D4,\"\")","v":""},null,null,null,null,null,null,"Date:",{"$f":"'FIRI Worksheet'!N4","v":"2015-03-24"},"Planner:",null,{"$f":"IF('FIRI Worksheet'!H4<>\"\",'FIRI Worksheet'!H4,\"\")","v":""}]
[null,null,"Tract No.",{"$f":"'FIRI Worksheet'!D5:E5","v":0},null," Farm No.",null,{"$f":"'FIRI Worksheet'!G5","v":0},null,null,"Field No.",{"$f":"'FIRI Worksheet'!I5","v":0},"Description:",null,{"$f":"IF('FIRI Worksheet'!L5<>\"\",'FIRI Worksheet'!L5,\"\")","v":""}]
[null,null,null,null,null,null,"Current System Status",null,null,null,null,null,"Planned improvements or Management"]
[null,"  FIRI Rating Index",null,null,null,null,null,null,{"$f":"'FIRI Worksheet'!E30","v":""},null,null,null,null,null,{"$f":"'FIRI Worksheet'!J30","v":""},null,{"$f":"IF(Q10=\"\",\"\",\"Estimated change\")","v":""}]
[null,null,null,null,null,null,{"$f":"IF('FIRI Worksheet'!M34<>\"\",\"Corrected for limited water\",\"\")","v":""}]
[null,"  Net  Irrigation Applied ",null,null,null,null,null,null,{"$f":"'FIRI Worksheet'!G38","v":""},{"$f":"IF(I9<>\"\",\"ac-in/ac\",)","v":0},null,null,{"$f":"IF(AND('FIRI Worksheet'!M34<>\"\",'FIRI Worksheet'!M34<='FIRI Worksheet'!J38),\"Corrected for limited water\",\"\")","v":""},null,{"$f":"'FIRI Worksheet'!L38","v":""},{"$f":"IF(O9<>\"\",\"ac-in/ac\",)","v":0}]
[null,"  Gross Irrigation Available ",null,null,null,null,null,null,{"$f":"'FIRI Worksheet'!E38","v":""},0,null,null,null,null,{"$f":"'FIRI Worksheet'!J38","v":""},0,{"$f":"IF(O10>=I10,\"\",IFERROR(O10-I10,\"\"))","v":""},{"$f":"IF(Q10<>\"\",\"ac-in/ac\",\"\")","v":""}]
[null,null,null,null,null,null,{"$f":"IF(I13=\"\",\"\",IF('FIRI Worksheet'!AO113=\"\",\"Default (%)\",\"User defined (%)\"))","v":""},null,null,null,null,null,{"$f":"IF(O13=\"\",\"\",IF('FIRI Worksheet'!AS113=\"\",\"Default (%)\",\"User defined (%)\"))","v":""}]
[null,null,"  Runoff ",null,null,{"$f":"IF(I13=\"\",\"\",\"Break down\")","v":""},{"$f":"IF(I13=\"\",\"\",'FIRI Worksheet'!E42)","v":""},null,{"$f":"'FIRI Worksheet'!G42","v":""},{"$f":"IF(I12<>\"\",\"ac-in/ac\",\"\")","v":""},null,null,{"$f":"IF(O13=\"\",\"\",'FIRI Worksheet'!J42)","v":""},null,{"$f":"'FIRI Worksheet'!L42","v":""},{"$f":"IF(O12<>\"\",\"ac-in/ac\",\"\")","v":""},{"$f":"IF(O10>I10,\"\",IFERROR(I12-O12,\"\"))","v":""},{"$f":"IF(Q12<>\"\",\"ac-in/ac\",\"\")","v":""}]
[null,null,"  Deep Percolation ",null,null,null,{"$f":"IF(I13=\"\",\"\",'FIRI Worksheet'!F42)","v":""},null,{"$f":"'FIRI Worksheet'!H42","v":""},{"$f":"IF(I13<>\"\",\"ac-in/ac\",\"\")","v":""},null,null,{"$f":"IF(O13=\"\",\"\",'FIRI Worksheet'!K42)","v":""},null,{"$f":"'FIRI Worksheet'!M42","v":""},{"$f":"IF(O13<>\"\",\"ac-in/ac\",\"\")","v":""},{"$f":"IF(O10>I10,\"\",IFERROR(I13-O13,\"\"))","v":""},{"$f":"IF(Q13<>\"\",\"ac-in/ac\",\"\")","v":""}]
[null,null,"FIRI Factors"]
[null,null,null,null,null,null,"Practice",null,null,null,"Rating",null,null,"Practice",null,null,"Rating"]
[null,"System Type",null,null,{"$f":"IF('FIRI Worksheet'!E8=\"\",\"N/A\",'FIRI Worksheet'!E8)","v":"N/A"},null,null,null,null,null,{"$f":"'FIRI Worksheet'!H8","v":""},null,{"$f":"IF('FIRI Worksheet'!J8=\"\",\"N/A\",'FIRI Worksheet'!J8)","v":"N/A"},null,null,null,{"$f":"'FIRI Worksheet'!M8","v":""}]
[null,"Management","Water Measurement","Md",{"$f":"IF('FIRI Worksheet'!E10=\"\",\"N/A\",'FIRI Worksheet'!E10)","v":"N/A"},null,null,null,null,null,{"$f":"'FIRI Worksheet'!H10","v":""},null,{"$f":"IF('FIRI Worksheet'!J10=\"\",\"N/A\",'FIRI Worksheet'!J10)","v":"N/A"},null,null,null,{"$f":"'FIRI Worksheet'!M10","v":""}]
[null,null,"Irrigation Scheduling","S",{"$f":"IF('FIRI Worksheet'!E11=\"\",\"N/A\",'FIRI Worksheet'!E11)","v":"N/A"},null,null,null,null,null,{"$f":"'FIRI Worksheet'!H11","v":""},null,{"$f":"IF('FIRI Worksheet'!J11=\"\",\"N/A\",'FIRI Worksheet'!J11)","v":"N/A"},null,null,null,{"$f":"'FIRI Worksheet'!M11","v":""}]
[null,null,"Irrigation Knowledge or Skill","I",{"$f":"IF('FIRI Worksheet'!E12=\"\",\"N/A\",'FIRI Worksheet'!E12)","v":"N/A"},null,null,null,null,null,{"$f":"'FIRI Worksheet'!H12","v":""},null,{"$f":"IF('FIRI Worksheet'!J12=\"\",\"N/A\",'FIRI Worksheet'!J12)","v":"N/A"},null,null,null,{"$f":"'FIRI Worksheet'!M12","v":""}]
[null,null,"System Maintenance","M",{"$f":"IF('FIRI Worksheet'!E13=\"\",\"N/A\",'FIRI Worksheet'!E13)","v":"N/A"},null,null,null,null,null,{"$f":"'FIRI Worksheet'!H13","v":""},null,{"$f":"IF('FIRI Worksheet'!J13=\"\",\"N/A\",'FIRI Worksheet'!J13)","v":"N/A"},null,null,null,{"$f":"'FIRI Worksheet'!M13","v":""}]
{"$rows_left_out":16}
{"sheet":"Summary Report","index":3,"n_rows":44,"n_cols":12,"rows_kept":44,"cut":false,"hidden":false,"merged":[[27,1,29,4],[14,8,14,11],[5,2,6,3],[5,8,6,9],[13,1,13,2],[14,4,14,6],[12,8,12,11],[7,4,9,6],[7,9,9,11],[14,1,14,2],[15,1,15,2],[16,1,16,2],[17,1,17,2],[18,1,18,2],[11,8,11,11],[30,9,31,9],[12,4,12,6],[19,4,19,6],[13,4,13,6],[19,8,19,11],[13,8,13,11],[15,8,15,11],[16,8,16,11],[17,8,17,11],[18,8,18,11],[15,4,15,6],[16,4,16,6],[18,4,18,6],[17,4,17,6],[24,4,24,6],[25,8,25,11],[42,2,42,11],[45,3,45,4],[38,2,38,11],[21,4,21,6],[22,4,22,6],[39,4,39,6],[40,2,40,11],[41,4,41,6],[21,8,21,11],[22,8,22,11],[23,8,23,11],[24,8,24,11],[37,1,37,11],[24,1,24,2],[25,1,25,2],[23,4,23,6],[0,1,2,1],[7,1,9,3],[10,1,10,3],[11,1,11,2],[12,1,12,2],[0,3,0,11],[1,3,1,11],[2,3,2,11],[3,3,3,5],[3,10,3,11],[11,4,11,6],[10,4,10,6],[3,7,3,8],[4,7,4,8],[10,8,10,11],[4,10,4,11],[39,2,39,3],[34,1,34,11],[35,1,35,11],[19,1,19,2],[20,1,20,2],[21,1,21,2],[22,1,22,2],[23,1,23,2],[20,4,20,6],[30,10,31,11],[20,8,20,11],[25,4,25,6],[28,5,29,5],[28,6,29,6],[27,9,28,11],[29,10,29,11]]}
[null,"NRCS",null,"Farm Irrigation Rating Tool"]
[null,null,null,"Summary Sheet"]
[null,null,null,"       Natural Resources Conservation Service (NRCS)   "]
[null,null,"Client:",{"$f":"IF('FIRI Worksheet'!D4<>\"\",'FIRI Worksheet'!D4,\"\")","v":""},null,null,"Date:",{"$f":"'FIRI Worksheet'!N4","v":"2015-03-24"},null,"Planner:",{"$f":"IF('FIRI Worksheet'!H4<>\"\",'FIRI Worksheet'!H4,\"\")","v":""}]
[null,null,"Tract No.",{"$f":"'FIRI Worksheet'!D5","v":0}," Farm No.",{"$f":"'FIRI Worksheet'!G5","v":0},"Field No.",{"$f":"'FIRI Worksheet'!I5","v":0},null,"Field Name:",{"$f":"IF('FIRI Worksheet'!L5<>\"\",'FIRI Worksheet'!L5,\"\")","v":""}]
[null,null,"Initial assessment year (yr)",null,"Current ",null,null,null,"Period of Planned activities (yr)",null,"Start","End"]
[]
[null,"System rating categories",null,null,"Current system status",null,null,null,null,"Planned improvements or Management"]
[]
[]
[null,"System Type",null,null,{"$f":"IF('FIRI Worksheet'!E8=\"\",\"N/A\",'FIRI Worksheet'!E8)","v":"N/A"},null,null,null,{"$f":"IF('FIRI Worksheet'!J8=\"\",\"\",'FIRI Worksheet'!J8)","v":""}]
[null,"Water Measurement",null,"Md",{"$f":"IF('FIRI Worksheet'!E10=\"\",\"N/A\",'FIRI Worksheet'!E10)","v":"N/A"},null,null,null,{"$f":"IF('FIRI Worksheet'!J10=\"\",\"N/A\",'FIRI Worksheet'!J10)","v":"N/A"}]
[null,"Irrigation Scheduling",null,"S",{"$f":"IF('FIRI Worksheet'!E11=\"\",\"N/A\",'FIRI Worksheet'!E11)","v":"N/A"},null,null,null,{"$f":"IF('FIRI Worksheet'!J11=\"\",\"N/A\",'FIRI Worksheet'!J11)","v":"N/A"}]
[null,"Irrigation Knowledge or Skill",null,"I",{"$f":"IF('FIRI Worksheet'!E12=\"\",\"N/A\",'FIRI Worksheet'!E12)","v":"N/A"},null,null,null,{"$f":"IF('FIRI Worksheet'!J12=\"\",\"N/A\",'FIRI Worksheet'!J12)","v":"N/A"}]
[null,"System Maintenance",null,"M",{"$f":"IF('FIRI Worksheet'!E13=\"\",\"N/A\",'FIRI Worksheet'!E13)","v":"N/A"},null,null,null,{"$f":"IF('FIRI Worksheet'!J13=\"\",\"N/A\",'FIRI Worksheet'!J13)","v":"N/A"}]
[null,"Water Availability and Delivery",null,"D",{"$f":"IF('FIRI Worksheet'!E14=\"\",\"N/A\",'FIRI Worksheet'!E14)","v":"N/A"},null,null,null,{"$f":"IF('FIRI Worksheet'!J14=\"\",\"N/A\",'FIRI Worksheet'!J14)","v":"N/A"}]
[null,"Soil Condition or Health",null,"Sc",{"$f":"IF('FIRI Worksheet'!E15=\"\",\"N/A\",'FIRI Worksheet'!E15)","v":"N/A"},null,null,null,{"$f":"IF('FIRI Worksheet'!J15=\"\",\"N/A\",'FIRI Worksheet'!J15)","v":"N/A"}]
[null,"Water delivery Control",null,"Wc",{"$f":"IF('FIRI Worksheet'!E17=\"\",\"N/A\",'FIRI Worksheet'!E17)","v":"N/A"},null,null,null,{"$f":"IF('FIRI Worksheet'!J17=\"\",\"N/A\",'FIRI Worksheet'!J17)","v":"N/A"}]
[null,"Type of water Conveyance used",null,"Ce",{"$f":"IF('FIRI Worksheet'!E19=\"\",\"N/A\",'FIRI Worksheet'!E19)","v":"N/A"},null,null,null,{"$f":"IF('FIRI Worksheet'!J19=\"\",\"N/A\",'FIRI Worksheet'!J19)","v":"N/A"}]
[null,"Field Levelness",null,"L",{"$f":"IF('FIRI Worksheet'!E20=\"\",\"N/A\",'FIRI Worksheet'!E20)","v":"N/A"},null,null,null,{"$f":"IF('FIRI Worksheet'!J20=\"\",\"N/A\",'FIRI Worksheet'!J20)","v":"N/A"}]
{"$rows_left_out":25}
{"sheet":"System_Descript","index":4,"n_rows":0,"n_cols":0,"rows_kept":0,"cut":false,"hidden":false,"merged":[]}

{"sheet":"Factors","index":5,"n_rows":195,"n_cols":25,"rows_kept":195,"cut":false,"hidden":false,"merged":[]}
[{"$f":"'FIRI Worksheet'!AD37","v":" Enhancement Category"},null,{"$f":"'FIRI Worksheet'!AF37","v":"iwm"}]
[null,{"$f":"'FIRI Worksheet'!AE38","v":"Irrigation Enhancement Action"},{"$f":"'FIRI Worksheet'!AF38","v":"Rating"}]
[{"$f":"'FIRI Worksheet'!AD39","v":"Improved Water Measurement"},null,null,null,null,null,null,null,null,null,null,null,null,null,null,null,null,null,null,null,"Uniform","<=0.05%","None","<0.3%"]
[null,{"$f":"'FIRI Worksheet'!AE40","v":"No flow measuring devices"},{"$f":"'FIRI Worksheet'!AF40","v":0.9},null,null,null,null,null,null,null,null,null,null,null,null,null,null,null,null,null,"Fairly uniform",">0.05%","Uniform",">=0.3 <0.5%","Not proper length of run"]
["[Md]",{"$f":"'FIRI Worksheet'!AE41","v":"Flow measurement - whole farm-manually recorded"},{"$f":"'FIRI Worksheet'!AF41","v":0.93},null,null,null,null,null,null,null,null,null,null,null,null,null,null,null,null,null,"Variable",null,"Variable","<0.5%","Proper length of run"]
[null,{"$f":"'FIRI Worksheet'!AE42","v":"Flow measurement - whole farm-automatic recorded"},{"$f":"'FIRI Worksheet'!AF42","v":0.95},null,null,null,null,null,null,null,null,null,null,null,null,null,null,null,null,null,null,null,null,">=0.5%"]
[null,{"$f":"'FIRI Worksheet'!AE43","v":"Flow measurement - whole farm plus individual field manual recorded"},{"$f":"'FIRI Worksheet'!AF43","v":0.97}]
[null,{"$f":"'FIRI Worksheet'!AE44","v":"Flow measurement - whole farm plus individual field automatic recorded"},{"$f":"'FIRI Worksheet'!AF44","v":1}]
[]
[{"$f":"'FIRI Worksheet'!AD46","v":"Improved Soil Moisture Monitoring and Irrigation Scheduling"}]
[null,"None",0.9]
["[ S ]",{"$f":"'FIRI Worksheet'!AE48","v":"Visual crop stress"},0.94]
[null,{"$f":"'FIRI Worksheet'!AE49","v":"Soil moisture by NRCS feel method"},0.95]
[null,{"$f":"'FIRI Worksheet'!AE50","v":"Check book scheduling, irrigation scheduler, etc."},0.95]
[null,{"$f":"'FIRI Worksheet'!AE51","v":"Irrigation scheduling via pan evaporation or atmometer for field"},0.96]
[null,{"$f":"'FIRI Worksheet'!AE52","v":"Irrigation scheduling via regional weather network"},0.97]
[null,{"$f":"'FIRI Worksheet'!AE53","v":"Soil moisture using Gypsum blocks, moisture probe, etc."},0.98]
[null,{"$f":"'FIRI Worksheet'!AE54","v":"Continuous measurement of soil moisture, water applied and ET"},1]
[]
[{"$f":"'FIRI Worksheet'!AD56","v":"Irrigation skill and Action"}]
{"$rows_left_out":176}
{"sheet":"Development notes","index":6,"n_rows":24,"n_cols":3,"rows_kept":24,"cut":false,"hidden":false,"merged":[[0,1,0,6],[1,2,5,5],[7,1,7,8]]}
[null,"Development notes"]
[null,null,"Questions or bug reports contact Clarence Prestwich                     WNTSC, Portland, OR                                                    (503) 414-3075 clarence.prestwich@por.usda.gov"]
[]
[]
[]
[]
[]
["Date","Notes"]
["2014-01-31","Added more functionality to the worksheet. Added Report sheets and title sheet"]
["2014-02-04","Corrected error on the conveyance factor when using multiple pipes."]
["2014-02-06","Fixed error with emmitter design factor display"]
["2014-02-14","embedded alternative conveyance lost method in spreadsheet to avoid the necessity of having companion files when distributing"]
["2014-02-20","Corrected error in e30 adjusted to save values selected on multiple section conveyance and land leveling, Tweaked land leveling to better guide selection, gray out more sections when different systems are selected. Changed name to 2014.1"]
["2014-02-24","corrected error in conveyance and made land leveling more robust"]
["2014-02-26","corrected formating errors on summary page"]
["2014-06-26","Corrected errors with sprinkler and trickle design. Corrected cell protection. Added spot for crop and climate information"]
["2014-07-15","Fixed #Ref! errors on Factors tab"]
["2014-08-22","fixed soil condition SCI index numbers by changing them back to original values"]
["2014-10-30","Fixed formating errors"]
["2015-01-09","corrected error with limited water supply and erroron trickle design factor. Adjusted formating"]
{"$rows_left_out":4}