{"text_format":"1","workbook":"xlsx","n_sheets":10,"sheets":["Calculator","SeedingPlan_CUST","Grasses","ForbsLegumes","Instructions","Counties","comp_temp","mixcheck","modifications","border"],"not_rendered":{"charts":0,"images":21,"macros":1,"external_links":0,"defined_names":70,"comments":2,"pivot_tables":0},"unopened":[],"bounds":{"document_bytes":16777216,"sheet_cells":100000,"rows_first":2000,"rows_last":500,"rows_between":2000,"halvings":0,"cell_chars":16384,"cell_head_chars":4096},"cells_cut":0,"cells_raw":0,"read":"whole","date_system":"1900"}

{"sheet":"Calculator","index":0,"n_rows":156,"n_cols":44,"rows_kept":156,"cut":false,"hidden":false,"merged":[[82,7,83,7],[116,14,117,14],[142,8,143,8],[92,14,93,14],[116,7,117,7],[86,7,87,7],[110,14,111,14],[126,7,127,7],[124,7,125,7],[122,7,123,7],[120,7,121,7],[118,7,119,7],[155,9,155,11],[122,14,123,14],[120,14,121,14],[132,7,133,7],[130,7,131,7],[128,7,129,7],[132,14,133,14],[130,14,131,14],[128,14,129,14],[126,14,127,14],[8,4,8,7],[10,6,10,7],[9,4,9,5],[60,5,61,5],[60,7,61,7],[60,8,61,8],[54,6,55,6],[54,7,55,7],[60,6,61,6],[177,27,179,27],[177,28,179,28],[163,23,169,23],[140,14,141,14],[138,14,139,14],[136,14,137,14],[134,14,135,14],[163,24,169,24],[163,25,169,25],[163,27,166,27],[163,28,166,28],[164,8,168,8],[147,9,152,9],[177,29,179,29],[170,23,172,23],[170,24,172,24],[170,25,172,25],[170,27,172,27],[170,28,172,28],[170,29,172,29],[173,23,176,23],[173,24,176,24],[173,25,176,25],[173,27,176,27],[173,28,176,28],[173,29,176,29],[163,29,166,29],[167,27,169,27],[167,28,169,28],[167,29,169,29],[153,27,157,27],[153,28,157,28],[153,29,157,29],[177,24,179,24],[177,25,179,25],[12,0,13,0],[12,15,13,15],[12,9,13,9],[12,16,13,16],[12,4,13,4],[12,5,13,5],[12,6,13,6],[12,11,13,11],[12,10,13,10],[12,7,13,7],[12,8,13,8],[12,12,13,12],[12,13,13,13],[12,14,13,14],[164,7,168,7],[157,4,158,4],[157,5,158,5],[157,7,158,7],[60,4,61,4],[157,8,158,8],[157,9,158,9],[64,7,65,7],[66,7,67,7],[102,7,103,7],[100,7,101,7],[98,7,99,7],[96,7,97,7],[94,7,95,7],[134,7,135,7],[88,7,89,7],[62,7,63,7],[68,7,69,7],[108,7,109,7],[110,7,111,7],[84,7,85,7],[114,7,115,7],[112,7,113,7],[136,7,137,7],[157,1,158,1],[60,10,61,10],[106,14,107,14],[104,14,105,14],[80,7,81,7],[78,7,79,7],[76,7,77,7],[74,7,75,7],[92,7,93,7],[90,7,91,7],[104,7,105,7],[106,7,107,7],[90,14,91,14],[88,14,89,14],[86,14,87,14],[84,14,85,14],[82,14,83,14],[108,14,109,14],[124,14,125,14],[149,1,152,1],[147,10,148,10],[150,10,152,10],[118,14,119,14],[157,3,158,3],[60,11,61,11],[60,13,61,13],[140,7,141,7],[138,7,139,7],[80,14,81,14],[72,7,73,7],[70,7,71,7],[64,14,65,14],[66,14,67,14],[78,14,79,14],[76,14,77,14],[74,14,75,14],[72,14,73,14],[70,14,71,14],[68,14,69,14],[102,14,103,14],[100,14,101,14],[98,14,99,14],[96,14,97,14],[94,14,95,14],[114,14,115,14],[62,14,63,14],[60,12,61,12],[112,14,113,14],[60,33,60,36],[60,43,61,43],[2,1,2,2],[0,45,2,50],[0,52,2,57],[3,1,3,2],[9,6,9,7],[2,13,2,17],[7,1,7,2],[60,41,61,41],[60,42,61,42],[3,45,7,50],[10,4,10,5],[3,4,3,5],[60,24,60,26],[6,8,7,8],[11,31,11,32],[12,18,13,18],[12,23,12,24],[12,19,12,20],[12,21,12,22],[60,31,60,32],[12,30,13,30],[60,16,61,16],[12,26,12,27],[12,28,12,29],[60,22,61,22],[60,21,61,21],[60,20,61,20],[60,14,61,14],[60,17,61,17],[60,29,60,30],[60,19,61,19],[60,18,61,18]]}
[null,"LANDOWNER:",null,null,null,"TRACT #",null,"Design by:",null,"Checked by:",null,null,null,null,null,null,null,null,null,null,null,null,null,null,"FSG GROUPS","NRCS standard","hide/unhide status"]
[1,"County:",null,null,"seeds / ft2 PLS","FIELD #",null,"Date:",null,"Check Date:",null,null,null,null,null,null,null,null,null,null,null,null,null,null,0,0,"visible"]
[null,"      NRCS STANDARD",null,null,null,"ACRES",null,null,null,null,null,null,null," Hot Links to Standards/Tech Notes/Job Sheets"]
[0,"CONSERVATION MIXES",null,null,"Rate Specification/Acre"]
[0]
[0]
[null,null,"   Pollinator?",null,null,null,null,null,"Enter Unit Cost for:"]
[0,"PASTURE MIXES",null,null,null,null,null,null,null,null,null,null,{"$f":"COUNT(R15:R54)*2","v":0}]
[null,null,"PREVALENT FSG ",null,"Common Name Lookup",null,null,null,null,null,null,null,{"$f":"COUNT(X63:X141)*2","v":0}]
[0,null,null,2,"Select Scientific \nName            "]
{"$rows_left_out":147}
{"sheet":"SeedingPlan_CUST","index":1,"n_rows":97,"n_cols":17,"rows_kept":97,"cut":false,"hidden":false,"merged":[[3,0,3,6],[10,0,10,5],[84,5,85,5],[0,1,0,3],[34,0,34,8],[79,0,79,1],[81,5,81,6],[80,5,80,6],[79,5,79,6],[84,1,85,1],[84,4,85,4],[84,7,85,7],[80,0,80,1],[81,0,81,1],[84,3,85,3],[106,0,106,7],[101,4,101,7],[102,4,102,7],[104,0,104,7],[89,4,89,5],[90,4,90,5],[91,4,91,5],[92,4,92,5],[91,0,91,1],[96,2,96,3],[98,4,98,5],[105,0,105,7],[99,0,99,1],[92,0,92,1],[89,7,90,7],[90,0,90,1],[99,4,99,5],[87,4,87,5],[89,0,89,1],[84,6,85,6],[88,4,88,5],[87,0,88,1]]}
["LANDOWNER: ",{"$f":"IF(Calculator!C1=\"\",\"\",Calculator!C1)","v":""}]
["TRACT #: ",{"$f":"IF(Calculator!G1=\"\",\"\",Calculator!G1)","v":""},null,null,"NRCS Std.:",{"$f":"IF(Calculator!$Z$2=1,327,IF(Calculator!$Z$2=2,342,IF(Calculator!$Z$2=3,512,\"\")))","v":""}]
["Field(s): ",{"$f":"IF(Calculator!G2=\"\",\"\",Calculator!G2)","v":""},null,null,"Plan by: ",{"$f":"IF(Calculator!I1=\"\",\"\",Calculator!I1)","v":""}]
[]
["Total Acres: ",{"$f":"IF(Calculator!G3=\"\",\"\",Calculator!G3)","v":""},null,null,"Plan date: ",{"$f":"IF(Calculator!I2=\"\",\"\",Calculator!I2)","v":""}]
["County: ",{"$f":"IF(Calculator!C2=\"\",\"\",Calculator!C2)","v":""},null,null,null,null,null,null,{"$f":"+I8","v":0},null,"HIDDEN"]
[null,null,null,null,null,null,null,null,{"$f":"MAX(I13:I32)","v":0}]
[null,null,null,null,null,null,null,null,{"$f":"MAX(J37:J76)","v":0}]
[]
[]
{"$rows_left_out":88}
{"sheet":"Grasses","index":2,"n_rows":49,"n_cols":42,"rows_kept":49,"cut":false,"hidden":false,"merged":[[0,40,1,40],[0,41,1,41],[0,16,0,21],[0,22,0,24],[0,25,0,34],[0,35,0,37]]}
[1,2,3,4,5,6,7,8,9,10,11,12,13,14,15,16,"MOISTURE REGIME",null,null,null,null,null,null,null,null,"Forage Suitablility Groups (FSG)",null,null,null,null,null,null,null,null,null,"Forage Productivity",null,null,null,null,"Intro/Native","Pure Stand Rate"]
["Common Name","Plant Type","Scientific Name","Estimated Cost/lb","Seeds/lb.","Seeds/sq ft @ 1 lb./ac",null,"Blooming period","Growth Form","Suitable For Pollinators","Wildlife Value","Retardance Capacity","Forage Productivity","Fertility Requirements","Moisture Regime","FSG","D","DM","M","WM","W","ALL","INTRO","NAT","BOTH",1,2,3,4,5,6,7,8,9,10,"LOW","MED","HIGH","Pasture","POLLINATOR"]
[null,null,"LEAVE THIS ROW BLANK",null,null,null,null,null,null,null,null,null,null,null,null,null,"X","X","X","X","X","X","X","X","X","X","X","X","X","X","X","X","X","X","X","X","X","X","X","X"]
["American Mannagrass","Grass","Glyceria grandis",0,1279616,29.38475665748393,null,"Late","Bunch","yes","fair","A","fair","medium","WM, W","4,7,10"," "," "," ","X","X","X"," ","X","X"," "," "," ","X"," "," ","X"," "," ","X"," ","X"," "," ","X","N"]
["Annual (Italian) Ryegrass","Grass","Lolium perenne L. ssp. Multiflorum",0,227000,5.2112029384756662,null,"Middle","Bunch","yes","fair","C","fair","medium","DM,M,WM","1,4-9"," ","X","X","X"," ","X","X"," ","X","X"," "," ","X","X","X","X","X","X"," "," ","X"," ","X","X","I",20]
["Big Bluestem","Grass","Andropogon gerardii",0,165000,3.79,null,"Middle","Bunch","yes","good","B","good","low","D, DM, M, WM","1-9","X","X","X","X"," ","X"," ","X","X","X","X","X","X","X","X","X","X","X"," "," "," ","X","X","X","N",10]
["Bluejoint","Grass","Calamagrostis canadensis",0,4480064,102.84664830119375,null,"Early","Sod-Forming","no","good","B","poor","high","WM, W","4,7,10"," "," "," ","X","X","X"," ","X","X"," "," "," ","X"," "," ","X"," "," ","X","X"," "," "," "," ","N"]
["Bottlebrush Sedge","Sedge","Carex hystericina",0,480208,11.019283746556473,null,"Late","Bunch","yes","fair","C","poor","low","WM, W","4,7,10"," "," "," ","X","X","X"," ","X","X"," "," "," ","X"," "," ","X"," "," ","X","X"," "," "," ","X","N"]
["Canada Wildrye","Grass","Elymus canadensis",0,83200,1.9100091827364554,null,"Early","Bunch","yes","fair","B","poor","medium"," DM, M,WM","1,3,4,5,6,7,8,9"," ","X","X","X"," ","X"," ","X","X","X"," ","X","X","X","X","X","X","X"," ","X"," "," "," ","X","N"]
["Chewings Red Fescue","Grass","Festuca rubra L. ssp. fallax",0,350000,8.0348943985307617,null,"Early","Sod-Forming","no","poor","D","poor","medium","D, DM, M","2,3,5,6,8,9","X","X","X"," "," ","X","X"," ","X"," ","X","X"," ","X","X"," ","X","X"," ","X"," "," ","X"," ","I",5]
{"$rows_left_out":40}
{"sheet":"ForbsLegumes","index":3,"n_rows":362,"n_cols":48,"rows_kept":362,"cut":false,"hidden":false,"merged":[[0,19,0,24],[0,29,0,38],[0,39,0,41],[0,43,1,43],[0,44,1,44]]}
[1,2,3,4,5,6,7,8,9,10,11,12,13,14,15,16,17,18,19,"MOISTURE REGIME",null,null,null,null,null,null,null,null,null,"Forage Suitablility Groups (FSG)",null,null,null,null,null,null,null,null,null,"Forage Productivity",null,null,null,"Intro/Native","Pure Stand Rate"]
["Common Name","Plant Type","Scientific Name","Estimated Cost/oz","Estimated Cost/lb","Seeds/oz","Seeds/lb.","Seeds/sq ft @ 1oz/ac","Seeds/sq ft @ 1 lb./ac","Blooming period","Growth Form","Suitable For Pollinators","Wildlife Value","Retardance Capacity","Forage Productivity","Fertility Requirements","Moisture Regime","color code","Forage Suitablility Groups (FSG)","D","DM","M","WM","W","All","INTRO","NAT","BOTH","Pasture",1,2,3,4,5,6,7,8,9,10,"LOW","MED","HIGH","Pollinator",null,null,"Monarch Friendly"]
[null,null,"Leave this row blank",null,{"$f":"D3*16","v":0},null,null,null,null,null,null,null,null,null,null,null,null,0,null,"X","X","X","X","X","X","X","X","X","X","X","X","X","X","X","X","X","X","X","X","X","X","X","X"]
["Alfalfa","Legume","Medicago sativa",0,{"$f":"+D4*16","v":0},13688,219000,0.314,{"$f":"+H4*16","v":5.024},"Middle","crown","Yes","good","C","good","high","D, DM, M",21,"2,3,5,6,8,9","X","X","X"," "," ","X","X"," ","X","X"," ","X","X"," ","X","X"," ","X","X"," "," "," ","X","X","I",12]
["Alsike Clover","Legume","Trifolium hybridum",0,0,42500,680000,0.97499999999999998,15.6,"Early-Middle","crown","Yes","good","D","fair","medium","M, WM, W",38,"1,4,5,7,8,9"," "," ","X","X","X","X","X"," ","X","X","X"," "," ","X","X"," ","X","X","X"," ","X"," "," ","X","I",3]
["Angelica","Forb","Angelica atropurpurea",0,0,5400,86400,0.12396694214876033,1.9834710743801653,"Middle","erect, single stem","yes","fair","D","N/A","low","W",10," "," "," "," "," ","X","X"," ","X","X"," "," "," "," "," "," "," "," "," "," "," "," "," "," ","X","N"]
["Bergamot","Forb","Monarda fistulosa",0,0,77800,1244800,1.7860422405876952,28.576675849403124,"Middle-Late","erect, stem branched","yes","good","D","N/A","low","DM, M, WM",21,null," ","X","X","X"," ","X"," ","X","X"," "," "," "," "," "," "," "," "," "," "," "," "," "," ","X","N",null,1]
["Biennial Beeblossom","Forb","Gaura biennis",0,0,2700,43200,6.1983471074380167E-2,0.99173553719008267,"Middle-Late","erect, single stem","yes","fair","D","N/A","low","M",38,null," "," ","X"," "," ","X"," ","X","X"," "," "," "," "," "," "," "," "," "," "," "," "," "," ","X","N"]
["Bird's Foot Violet","Forb","Viola pedata",0,0,26000,416000,0.59699999999999998,9.5519999999999996,"Early-Late","erect, stemless","yes","poor","D","N/A","low","D, DM",21,null,"X","X"," "," "," ","X"," ","X","X"," "," "," "," "," "," "," "," "," "," "," "," "," "," ","X","N"]
["Birdsfoot Trefoil","Legume","Lotus corniculatus",0,0,23437.5,375000,0.53800000000000003,8.6080000000000005,"Middle-Late","single crown","Yes","good","D","fair","medium","DM, M, WM,W",6,"1,4-9"," ","X","X","X","X","X","X"," ","X","X","X"," "," ","X","X","X","X","X","X"," ","X"," "," ","X","I",7]
{"$rows_left_out":353}
{"sheet":"Instructions","index":4,"n_rows":32,"n_cols":15,"rows_kept":32,"cut":false,"hidden":false,"merged":[[0,12,1,13],[27,1,27,7],[3,0,3,8],[5,1,5,8],[7,1,7,8],[9,1,9,8],[22,1,22,8],[23,1,23,8],[11,1,11,8],[13,0,13,8],[15,0,15,8],[17,0,17,8],[19,0,19,8]]}
[null,null,null,null,null,null,null,null,null,null,null,null,"ADMINISTRATORS ONLY"]
[]
["THIS SPREADSHEET ORIGINATED FROM THE IOWA NRCS AND HAS BEEN SIGNIFICANTLY MODIFIED FOR USE IN WI.",null,null,null,null,null,null,null,null,null,null,null,"Table Names and Descriptions"]
[null,null,null,null,null,null,null,null,null,null,null,null,"Table Name","Description"]
[null,null,null,null,null,null,null,null,null,null,null,null,"Calculator","custom seed mix design page- SEE INSTRUCTIONS"]
[null,null,null,null,null,null,null,null,null,null,null,null,"SeedingPlan_Cust","seeding plan printout for custom designed mixes - SEE INSTRUCTIONS"]
[]
[null,null,null,null,null,null,null,null,null,null,null,null,"Grasses","Table of all native and introduced grasses that can be used in the NRCS Standards.  Sort by Common Name for lookups to work.  The calculator page uses this table to lookup species."]
[null,null,null,null,null,null,null,null,null,null,null,null,"ForbsLegumes","Table of all native and introduced forbs/legumes that can be used in the NRCS Standards.   Sort by Common Name for lookups to work.  The calculator page uses this table to lookup species."]
[]
{"$rows_left_out":23}
{"sheet":"Counties","index":5,"n_rows":139,"n_cols":28,"rows_kept":139,"cut":false,"hidden":true,"merged":[[6,9,6,12],[0,9,0,13],[12,9,12,13],[12,4,12,7],[16,6,16,7],[15,6,15,7],[14,6,14,7],[13,6,13,7],[0,4,0,7],[6,4,6,7]]}
[1,null,null,null,null,null,null,null,null,null,null,null,null,null,null,"NRCS Standard","Region","STD-REGION\nsort by this column",null,null,"Spring Seeding","Late Summer","Fall Dormant Seeding","Frost Seeding Allowed?"]
[2,"ADAMS","CENTRAL",null,null,null,null,null,null,null,null,null,null,null,null,327,"Central",{"$f":"CONCATENATE(P2,\"-\",Q2)","v":"327-Central"},"i","INTRODUCED GRASSES & LEGUMES and COMPANION CROPS","4/15 - 6/1","8/1 - 8/21","11/1-Freeze up","Yes",null,null,"Agrostis gigantea","Redtop"]
[3,"ASHLAND","NORTH",null,null,null,null,null,null,null,null,null,null,null,null,327,"North","327-North","i","INTRODUCED GRASSES & LEGUMES and COMPANION CROPS","5/1 - 6/15","7/15 - 8/10","11/1-Freeze up","Yes",null,null,"Allium canadense","Wild Garlic"]
[4,"BARRON","CENTRAL",null,null,null,null,null,null,null,null,null,null,null,null,327,"South","327-South","i","INTRODUCED GRASSES & LEGUMES and COMPANION CROPS","4/1 - 5/15","8/7 - 8/29","11/1-Freeze up","Yes",null,null,"Allium cernuum","Nodding Wild Onion"]
[5,"BAYFIELD","NORTH",null,null,null,null,null,null,null,null,null,null,null,null,342,"Central","342-Central","i","INTRODUCED GRASSES & LEGUMES and COMPANION CROPS","4/15 - 6/1","8/1 - 8/21","11/1-Freeze up","No",null,null,"Amorpha canescens","Leadplant                 "]
[6,"BROWN","CENTRAL",null,null,null,null,null,null,null,null,null,null,null,null,342,"North","342-North","i","INTRODUCED GRASSES & LEGUMES and COMPANION CROPS","5/1 - 6/15","7/15 - 8/10","11/1-Freeze up","No",null,null,"Andropogon gerardii","Big Bluestem"]
[7,"BUFFALO","CENTRAL",null,null,null,null,null,null,null,null,null,null,null,null,342,"South","342-South","i","INTRODUCED GRASSES & LEGUMES and COMPANION CROPS","4/1 - 5/15","8/7 - 8/29","11/1-Freeze up","No",null,null,"Anemone canadensis","Meadow Anemone"]
[8,"BURNETT","NORTH",null,null,null,null,null,null,null,null,null,null,null,null,512,"Central","512-Central","i","INTRODUCED GRASSES & LEGUMES","4/15 - 6/1","8/1 - 8/21","N/A","Legumes Only",null,null,"Anemone cylindrica","Thimbleweed"]
[9,"CALUMET","CENTRAL",null,null,null,null,null,null,null,null,null,null,null,null,512,"North","512-North","i","INTRODUCED GRASSES & LEGUMES","5/1 - 6/15","7/15 - 8/10","N/A","Legumes Only",null,null,"Angelica atropurpurea","Angelica"]
[10,"CHIPPEWA","CENTRAL",null,null,null,null,null,null,null,null,null,null,null,null,512,"South","512-South","i","INTRODUCED GRASSES & LEGUMES","4/1 - 5/15","8/7 - 8/29","N/A","Legumes Only",null,null,"Asclepias incarnata","Marsh Milkweed"]
{"$rows_left_out":130}
{"sheet":"comp_temp","index":6,"n_rows":90,"n_cols":26,"rows_kept":90,"cut":false,"hidden":true,"merged":[[10,2,12,2],[10,7,12,7],[10,8,12,8],[13,2,17,2],[13,7,17,7],[13,8,17,8],[2,2,2,8],[3,2,3,8],[5,2,9,2],[5,7,9,7],[5,8,9,8],[18,2,23,2],[18,7,23,7],[18,8,23,8],[16,14,16,25],[17,22,17,25],[24,2,27,2],[24,7,27,7],[24,8,27,8],[28,2,30,2],[28,7,30,7],[28,8,30,8],[31,2,33,2],[31,7,33,7],[31,8,33,8],[34,2,38,2],[34,7,38,7],[34,8,38,8],[39,2,45,2],[39,7,45,7],[39,8,45,8],[46,2,51,2],[46,7,51,7],[46,8,51,8],[62,2,64,2],[62,7,64,7],[62,8,64,8],[52,2,57,2],[52,7,57,7],[52,8,57,8],[58,2,61,2],[58,7,61,7],[58,8,61,8],[3,14,14,14],[16,12,24,13],[4,19,10,19],[17,14,17,17],[17,18,17,21],[3,15,3,18]]}
[]
[]
[]
[null,null,null,null,null,null,null,null,null,null,null,null,null,null,"DATA ENTRY TABLE","TEMPORARY CROPS-same for all standards",null,null,null,null,"SPECIES","lbs/Bu"]
[null,null,null,null,null,null,null,null,null,null,null,null,null,null,null,"Species","lbs/A","Bu/A","lbs/Bu","DATA ENTRY TABLE","Annual (Italian) Ryegrass",22]
[null,null,null,null,null,null,null,null,null,null,null,null,null,null,null,"NONE",null,null,null,null,"Canada Wild Rye",26]
[null,null,null,null,null,null,null,null,null,null,null,null,null,null,null,"Annual (Italian) Ryegrass",20,{"$f":"ROUND(Q7/S7,1)","v":0.9},22,null,"Oats",32]
[null,null,null,null,null,null,null,null,null,null,null,null,null,null,null,"Forage Sorghum",20,{"$f":"ROUND(Q8/S8,1)","v":0.5},40,null,"Sideoats Grama",10]
[null,null,null,null,null,null,null,null,null,null,null,null,null,null,null,"Oats",64,2,32,null,"Spring Wheat",60]
[null,null,null,null,null,null,null,null,null,null,null,null,null,null,null,"Spring Wheat",120,2,60,null,"Virginia Wild Rye",16]
{"$rows_left_out":81}
{"sheet":"mixcheck","index":7,"n_rows":54,"n_cols":13,"rows_kept":54,"cut":false,"hidden":true,"merged":[[53,0,53,9],[0,0,0,9],[1,0,2,0],[1,1,1,9],[2,1,2,2],[2,3,2,4],[2,5,2,8],[2,9,3,9],[6,0,6,9],[7,0,7,9],[8,0,9,0],[8,1,8,9],[9,1,9,2],[9,3,9,4],[9,5,9,8],[9,9,10,9],[17,0,17,9],[15,0,15,8],[18,0,18,9],[19,0,19,8],[20,0,20,9],[21,0,22,0],[21,1,21,9],[22,1,22,2],[22,3,22,4],[22,5,22,8],[22,9,23,9],[26,0,26,8],[27,0,27,9],[28,0,29,0],[28,1,28,9],[29,1,29,2],[29,3,29,4],[29,5,29,8],[29,9,30,9],[33,0,33,8],[34,0,34,8],[36,0,36,9],[37,0,38,0],[37,1,37,9],[38,1,38,2],[38,3,38,4],[38,5,38,8],[49,0,49,9],[38,9,39,9],[41,1,41,4],[42,1,42,2],[42,3,42,4],[43,0,43,8],[44,0,45,0],[44,1,44,9],[45,1,45,2],[45,3,45,4],[45,5,45,8],[45,9,46,9]]}
["Conservation Cover (327)"]
[327,"Introduced Species",null,null,null,null,null,null,null,null,null,{"$f":"+Calculator!M148+Calculator!M152","v":0},"intro total"]
[null,"Grasses",null,"Legumesa",null,"Seeding Periods",null,null,null,"Notes",null,{"$f":"+Calculator!M149+Calculator!M151+Calculator!M153","v":0},"native total"]
["Mix Type","No. ","seeds/ft2","No.","seeds/ft2","Spring","Late Summer","Dormantb","Frostb",null,null,{"$f":"IF(Calculator!$Z$2=1,327,IF(Calculator!$Z$2=2,342,512))","v":512},"std"]
["Wildlife Habitat","³ 2","³ 70","³ 1","³ 30","X","X","X","X","Grasses must be at least 50% of mix.",null,{"$f":"IF(OR(Calculator!A6=1,Calculator!A10=3),\"B\",IF(OR(Calculator!A6=2,Calculator!A10=1),\"I\",\"N\"))","v":"N"},"intro/native/both"]
["Pollinator Habitat","1-2","≤ 30","³ 2","³ 40","X","X","X","X","Grasses must be bunch-type.",null,{"$f":"CONCATENATE(L4,\"-\",L5)","v":"512-N"}]
["(a) If more than 20% of legumes are hard seed, increase rate by % of hard seed.",null,null,null,null,null,null,null,null,null,null,{"$f":"IF(L6=\"327-N\",1,IF(L6=\"327-I\",2,IF(L6=\"327-B\",3,IF(L6=\"342-N\",4,IF(L6=\"342-I\",5,IF(L6=\"342-B\",6,IF(L6=\"512-N\",7,IF(L6=\"512-I\",8,IF(L6=\"512-B\",9,\"\")))))))))","v":7}]
["(b) Increase rate 15% for frost and dormant seedings"]
[327,"Native Species"]
[null,"Grassesa",null,"Forbs/Legumesb",null,"Seeding Periods",null,null,null,"Notes"]
{"$rows_left_out":45}
{"sheet":"modifications","index":8,"n_rows":100,"n_cols":3,"rows_kept":100,"cut":false,"hidden":false,"merged":[]}
[]
["date","by","Mod"]
["2014-12-14","janet vosberg","added giant sunflower, partridge pea, panicled aster, common milkweed, gian hyssop, and tall bellflower to forbsLegumes tab.  Also changed the scientific name of Joe-Pye Weed to Eutrochium maculatum"]
["2015-04-08","janet vosberg","fixed formula on seeding plan sheet to bring acres over from calculator page and set acres decimal to hundredths place for CRP use"]
["2015-04-30","janet vosberg","Changed 9 grasses to \"yes\" for pollinators and made sure there is an \"X\" in the pollinator table.  Fixed Great St. John's Wort so it now shows up as a pollinator."]
["2017-03-14","janet vosberg","Added Lance Leaf Coriospis and Northern Plains/Meadow Blazing Star to ForbsLegumes.  Added Forbs (MONARCH) total to bottom of calculator page that only shows if Monarch forbs are selected.  Added \"MONARCH\" to Forbs species that are Monarch friendly and now shows in the calculator dropdown.  All changes made per Steve Bertjens direction.  Added Monarch butterfly column to seeding plan"]
["2017-04-06","Janet vosberg","modified seeding dates so if any introduced species in mix, it will always pick the introduced seeding dates.  Unprotected cell D85 and G85 to add companion crop amounts on seeding sheet.  Temporarily deleted the Hide/Unhide rows button from calculator page as it was rendering the combo boxes for species selection unusable.  Will fix in future.  Changed OATS companion crop rate to 1 bushel/acre for natives."]
["2020-06-30","janet vosberg","modified the hide/unhide button on the seedingPlan_Cust sheet so it shows all rows if a user deletes a species in between rows on calculator page (Added formula to column M, revised formulas in columns I and J, changed count of rows to Max of I and J in cells I7 and I8 which are used in macro)"]
["2021-03-10","janet vosberg","Changed \"% of Mix\" Column format in Calculator tab to display to the nearest hundredth.  The summary table at the bottom will display to the nearest tenth, Per BH."]
["2023-03-02","michelle komiskey","updated rounding to hundredths pounds, changed seeding rate of oats for companion crop to 1bu/ac rather than 2bu/ac, removed outdated seed costs."]
{"$rows_left_out":91}
{"sheet":"border","index":9,"n_rows":10,"n_cols":12,"rows_kept":10,"cut":false,"hidden":true,"merged":[[5,3,6,12],[7,3,8,12],[9,11,9,12]]}
[]
[]
[]
[]
[]
[null,null,null,"Seeding Plan"]
[]
[null,null,null,"Custom Mix"]
[]
[null,null,null,null,null,null,null,null,null,null,null,"Ver. 2/2013"]